mesos-builds mailing list archives

Site index · List index
Message view « Date » · « Thread »
Top « Date » · « Thread »
From Apache Jenkins Server <jenk...@builds.apache.org>
Subject Build failed in Jenkins: Mesos-Buildbot » cmake,gcc,--verbose,GLOG_v=1 MESOS_VERBOSE=1,ubuntu:14.04,(docker||Hadoop)&&(!ubuntu-us1)&&(!ubuntu-eu2) #3624
Date Mon, 08 May 2017 17:53:16 GMT
See <https://builds.apache.org/job/Mesos-Buildbot/BUILDTOOL=cmake,COMPILER=gcc,CONFIGURATION=--verbose,ENVIRONMENT=GLOG_v=1%20MESOS_VERBOSE=1,OS=ubuntu%3A14.04,label_exp=(docker%7C%7CHadoop)&&(!ubuntu-us1)&&(!ubuntu-eu2)/3624/display/redirect?page=changes>

Changes:

[neil.conway] Fixed extra newline in webui for re-registered frameworks.

[toenshoff] Added new ContainerLaunchInfo task_environment.

[toenshoff] Updated containerizer for isolator task_environment merge.

[toenshoff] Updated runtime isolators to use new task_environment member.

------------------------------------------
[...truncated 744.72 KB...]
[ 27%] Building CXX object 3rdparty/stout/tests/CMakeFiles/stout-tests.dir/json_tests.cpp.o
cd /mesos/build/3rdparty/stout/tests && /usr/bin/g++   -DBUILD_FLAGS=\"\" -DBUILD_JAVA_JVM_LIBRARY=\"\" -DHAS_AUTHENTICATION=1 -DLIBDIR=\"/usr/local/libmesos\" -DPICOJSON_USE_INT64 -DPKGDATADIR=\"/usr/local/share/mesos\" -DPKGLIBEXECDIR=\"/usr/local/libexec/mesos\" -DUSE_CMAKE_BUILD_CONFIG -DUSE_STATIC_LIB -DVERSION=\"1.4.0\" -D__STDC_FORMAT_MACROS -O2 -std=c++11 -g -fPIE -isystem /usr/include/apr-1.0 -isystem /mesos/build/3rdparty/boost-1.53.0/src/boost-1.53.0 -isystem /mesos/build/3rdparty/elfio-3.2/src/elfio-3.2 -isystem /mesos/build/3rdparty/glog-0.3.3/src/glog-0.3.3-lib/lib/include -isystem /mesos/build/3rdparty/nvml-352.79/src/nvml-352.79 -isystem /mesos/build/3rdparty/picojson-1.3.0/src/picojson-1.3.0 -isystem /mesos/build/3rdparty/protobuf-2.6.1/src/protobuf-2.6.1-lib/lib/include -isystem /usr/include/subversion-1 -isystem /mesos/build/3rdparty/gmock-1.7.0/src/gmock-1.7.0/include -isystem /mesos/build/3rdparty/gmock-1.7.0/src/gmock-1.7.0/gtest/include -I/mesos/3rdparty/stout/include    -o CMakeFiles/stout-tests.dir/json_tests.cpp.o -c /mesos/3rdparty/stout/tests/json_tests.cpp
/usr/bin/cmake -E cmake_progress_report /mesos/build/CMakeFiles 
[ 27%] Building CXX object 3rdparty/libprocess/src/CMakeFiles/process-0.0.1.dir/mime.cpp.o
cd /mesos/build/3rdparty/libprocess/src && /usr/bin/g++   -DBUILD_FLAGS=\"\" -DBUILD_JAVA_JVM_LIBRARY=\"\" -DHAS_AUTHENTICATION=1 -DLIBDIR=\"/usr/local/libmesos\" -DPICOJSON_USE_INT64 -DPKGDATADIR=\"/usr/local/share/mesos\" -DPKGLIBEXECDIR=\"/usr/local/libexec/mesos\" -DUSE_CMAKE_BUILD_CONFIG -DUSE_STATIC_LIB -DVERSION=\"1.4.0\" -D__STDC_FORMAT_MACROS -Dprocess_0_0_1_EXPORTS -O2 -std=c++11 -g -fPIC -isystem /usr/include/apr-1.0 -isystem /mesos/build/3rdparty/boost-1.53.0/src/boost-1.53.0 -isystem /mesos/build/3rdparty/elfio-3.2/src/elfio-3.2 -isystem /mesos/build/3rdparty/glog-0.3.3/src/glog-0.3.3-lib/lib/include -isystem /mesos/build/3rdparty/nvml-352.79/src/nvml-352.79 -isystem /mesos/build/3rdparty/picojson-1.3.0/src/picojson-1.3.0 -isystem /mesos/build/3rdparty/protobuf-2.6.1/src/protobuf-2.6.1-lib/lib/include -isystem /usr/include/subversion-1 -isystem /mesos/3rdparty/stout/include -isystem /mesos/build/3rdparty/http_parser-2.6.2/src/http_parser-2.6.2 -isystem /mesos/build/3rdparty/libev-4.22/src/libev-4.22 -I/mesos/3rdparty/libprocess/include    -o CMakeFiles/process-0.0.1.dir/mime.cpp.o -c /mesos/3rdparty/libprocess/src/mime.cpp
/usr/bin/cmake -E cmake_progress_report /mesos/build/CMakeFiles 
[ 27%] Building CXX object src/CMakeFiles/mesos-protobufs.dir/__/include/mesos/quota/quota.pb.cc.o
cd /mesos/build/src && /usr/bin/g++   -DBUILD_FLAGS=\"\" -DBUILD_JAVA_JVM_LIBRARY=\"\" -DHAS_AUTHENTICATION=1 -DLIBDIR=\"/usr/local/libmesos\" -DPICOJSON_USE_INT64 -DPKGDATADIR=\"/usr/local/share/mesos\" -DPKGLIBEXECDIR=\"/usr/local/libexec/mesos\" -DUSE_CMAKE_BUILD_CONFIG -DUSE_STATIC_LIB -DVERSION=\"1.4.0\" -D__STDC_FORMAT_MACROS -Dmesos_protobufs_EXPORTS -O2 -std=c++11 -g -fPIC -I/mesos/build/include -I/mesos/build/include/mesos -I/mesos/build/src -I/mesos/src -isystem /mesos/build/3rdparty/protobuf-2.6.1/src/protobuf-2.6.1-lib/lib/include -isystem /mesos/3rdparty/libprocess/include -isystem /usr/include/apr-1.0 -isystem /mesos/build/3rdparty/boost-1.53.0/src/boost-1.53.0 -isystem /mesos/build/3rdparty/elfio-3.2/src/elfio-3.2 -isystem /mesos/build/3rdparty/glog-0.3.3/src/glog-0.3.3-lib/lib/include -isystem /mesos/build/3rdparty/nvml-352.79/src/nvml-352.79 -isystem /mesos/build/3rdparty/picojson-1.3.0/src/picojson-1.3.0 -isystem /usr/include/subversion-1 -isystem /mesos/3rdparty/stout/include -isystem /mesos/build/3rdparty/http_parser-2.6.2/src/http_parser-2.6.2 -isystem /mesos/build/3rdparty/libev-4.22/src/libev-4.22 -isystem /mesos/build/3rdparty/zookeeper-3.4.8/src/zookeeper-3.4.8/src/c/include -isystem /mesos/build/3rdparty/zookeeper-3.4.8/src/zookeeper-3.4.8/src/c/generated -isystem /mesos/build/3rdparty/leveldb-1.19/src/leveldb-1.19/include -I/mesos/include    -o CMakeFiles/mesos-protobufs.dir/__/include/mesos/quota/quota.pb.cc.o -c /mesos/build/include/mesos/quota/quota.pb.cc
/usr/bin/cmake -E cmake_progress_report /mesos/build/CMakeFiles 
[ 27%] Building CXX object 3rdparty/libprocess/src/CMakeFiles/process-0.0.1.dir/pid.cpp.o
cd /mesos/build/3rdparty/libprocess/src && /usr/bin/g++   -DBUILD_FLAGS=\"\" -DBUILD_JAVA_JVM_LIBRARY=\"\" -DHAS_AUTHENTICATION=1 -DLIBDIR=\"/usr/local/libmesos\" -DPICOJSON_USE_INT64 -DPKGDATADIR=\"/usr/local/share/mesos\" -DPKGLIBEXECDIR=\"/usr/local/libexec/mesos\" -DUSE_CMAKE_BUILD_CONFIG -DUSE_STATIC_LIB -DVERSION=\"1.4.0\" -D__STDC_FORMAT_MACROS -Dprocess_0_0_1_EXPORTS -O2 -std=c++11 -g -fPIC -isystem /usr/include/apr-1.0 -isystem /mesos/build/3rdparty/boost-1.53.0/src/boost-1.53.0 -isystem /mesos/build/3rdparty/elfio-3.2/src/elfio-3.2 -isystem /mesos/build/3rdparty/glog-0.3.3/src/glog-0.3.3-lib/lib/include -isystem /mesos/build/3rdparty/nvml-352.79/src/nvml-352.79 -isystem /mesos/build/3rdparty/picojson-1.3.0/src/picojson-1.3.0 -isystem /mesos/build/3rdparty/protobuf-2.6.1/src/protobuf-2.6.1-lib/lib/include -isystem /usr/include/subversion-1 -isystem /mesos/3rdparty/stout/include -isystem /mesos/build/3rdparty/http_parser-2.6.2/src/http_parser-2.6.2 -isystem /mesos/build/3rdparty/libev-4.22/src/libev-4.22 -I/mesos/3rdparty/libprocess/include    -o CMakeFiles/process-0.0.1.dir/pid.cpp.o -c /mesos/3rdparty/libprocess/src/pid.cpp
/usr/bin/cmake -E cmake_progress_report /mesos/build/CMakeFiles 
[ 27%] Building CXX object 3rdparty/stout/tests/CMakeFiles/stout-tests.dir/jsonify_tests.cpp.o
cd /mesos/build/3rdparty/stout/tests && /usr/bin/g++   -DBUILD_FLAGS=\"\" -DBUILD_JAVA_JVM_LIBRARY=\"\" -DHAS_AUTHENTICATION=1 -DLIBDIR=\"/usr/local/libmesos\" -DPICOJSON_USE_INT64 -DPKGDATADIR=\"/usr/local/share/mesos\" -DPKGLIBEXECDIR=\"/usr/local/libexec/mesos\" -DUSE_CMAKE_BUILD_CONFIG -DUSE_STATIC_LIB -DVERSION=\"1.4.0\" -D__STDC_FORMAT_MACROS -O2 -std=c++11 -g -fPIE -isystem /usr/include/apr-1.0 -isystem /mesos/build/3rdparty/boost-1.53.0/src/boost-1.53.0 -isystem /mesos/build/3rdparty/elfio-3.2/src/elfio-3.2 -isystem /mesos/build/3rdparty/glog-0.3.3/src/glog-0.3.3-lib/lib/include -isystem /mesos/build/3rdparty/nvml-352.79/src/nvml-352.79 -isystem /mesos/build/3rdparty/picojson-1.3.0/src/picojson-1.3.0 -isystem /mesos/build/3rdparty/protobuf-2.6.1/src/protobuf-2.6.1-lib/lib/include -isystem /usr/include/subversion-1 -isystem /mesos/build/3rdparty/gmock-1.7.0/src/gmock-1.7.0/include -isystem /mesos/build/3rdparty/gmock-1.7.0/src/gmock-1.7.0/gtest/include -I/mesos/3rdparty/stout/include    -o CMakeFiles/stout-tests.dir/jsonify_tests.cpp.o -c /mesos/3rdparty/stout/tests/jsonify_tests.cpp
/usr/bin/cmake -E cmake_progress_report /mesos/build/CMakeFiles 
[ 27%] Building CXX object 3rdparty/libprocess/src/CMakeFiles/process-0.0.1.dir/poll_socket.cpp.o
cd /mesos/build/3rdparty/libprocess/src && /usr/bin/g++   -DBUILD_FLAGS=\"\" -DBUILD_JAVA_JVM_LIBRARY=\"\" -DHAS_AUTHENTICATION=1 -DLIBDIR=\"/usr/local/libmesos\" -DPICOJSON_USE_INT64 -DPKGDATADIR=\"/usr/local/share/mesos\" -DPKGLIBEXECDIR=\"/usr/local/libexec/mesos\" -DUSE_CMAKE_BUILD_CONFIG -DUSE_STATIC_LIB -DVERSION=\"1.4.0\" -D__STDC_FORMAT_MACROS -Dprocess_0_0_1_EXPORTS -O2 -std=c++11 -g -fPIC -isystem /usr/include/apr-1.0 -isystem /mesos/build/3rdparty/boost-1.53.0/src/boost-1.53.0 -isystem /mesos/build/3rdparty/elfio-3.2/src/elfio-3.2 -isystem /mesos/build/3rdparty/glog-0.3.3/src/glog-0.3.3-lib/lib/include -isystem /mesos/build/3rdparty/nvml-352.79/src/nvml-352.79 -isystem /mesos/build/3rdparty/picojson-1.3.0/src/picojson-1.3.0 -isystem /mesos/build/3rdparty/protobuf-2.6.1/src/protobuf-2.6.1-lib/lib/include -isystem /usr/include/subversion-1 -isystem /mesos/3rdparty/stout/include -isystem /mesos/build/3rdparty/http_parser-2.6.2/src/http_parser-2.6.2 -isystem /mesos/build/3rdparty/libev-4.22/src/libev-4.22 -I/mesos/3rdparty/libprocess/include    -o CMakeFiles/process-0.0.1.dir/poll_socket.cpp.o -c /mesos/3rdparty/libprocess/src/poll_socket.cpp
/usr/bin/cmake -E cmake_progress_report /mesos/build/CMakeFiles 
[ 27%] Building CXX object src/CMakeFiles/mesos-protobufs.dir/__/include/mesos/scheduler/scheduler.pb.cc.o
cd /mesos/build/src && /usr/bin/g++   -DBUILD_FLAGS=\"\" -DBUILD_JAVA_JVM_LIBRARY=\"\" -DHAS_AUTHENTICATION=1 -DLIBDIR=\"/usr/local/libmesos\" -DPICOJSON_USE_INT64 -DPKGDATADIR=\"/usr/local/share/mesos\" -DPKGLIBEXECDIR=\"/usr/local/libexec/mesos\" -DUSE_CMAKE_BUILD_CONFIG -DUSE_STATIC_LIB -DVERSION=\"1.4.0\" -D__STDC_FORMAT_MACROS -Dmesos_protobufs_EXPORTS -O2 -std=c++11 -g -fPIC -I/mesos/build/include -I/mesos/build/include/mesos -I/mesos/build/src -I/mesos/src -isystem /mesos/build/3rdparty/protobuf-2.6.1/src/protobuf-2.6.1-lib/lib/include -isystem /mesos/3rdparty/libprocess/include -isystem /usr/include/apr-1.0 -isystem /mesos/build/3rdparty/boost-1.53.0/src/boost-1.53.0 -isystem /mesos/build/3rdparty/elfio-3.2/src/elfio-3.2 -isystem /mesos/build/3rdparty/glog-0.3.3/src/glog-0.3.3-lib/lib/include -isystem /mesos/build/3rdparty/nvml-352.79/src/nvml-352.79 -isystem /mesos/build/3rdparty/picojson-1.3.0/src/picojson-1.3.0 -isystem /usr/include/subversion-1 -isystem /mesos/3rdparty/stout/include -isystem /mesos/build/3rdparty/http_parser-2.6.2/src/http_parser-2.6.2 -isystem /mesos/build/3rdparty/libev-4.22/src/libev-4.22 -isystem /mesos/build/3rdparty/zookeeper-3.4.8/src/zookeeper-3.4.8/src/c/include -isystem /mesos/build/3rdparty/zookeeper-3.4.8/src/zookeeper-3.4.8/src/c/generated -isystem /mesos/build/3rdparty/leveldb-1.19/src/leveldb-1.19/include -I/mesos/include    -o CMakeFiles/mesos-protobufs.dir/__/include/mesos/scheduler/scheduler.pb.cc.o -c /mesos/build/include/mesos/scheduler/scheduler.pb.cc
/usr/bin/cmake -E cmake_progress_report /mesos/build/CMakeFiles 
[ 27%] Building CXX object 3rdparty/libprocess/src/CMakeFiles/process-0.0.1.dir/profiler.cpp.o
cd /mesos/build/3rdparty/libprocess/src && /usr/bin/g++   -DBUILD_FLAGS=\"\" -DBUILD_JAVA_JVM_LIBRARY=\"\" -DHAS_AUTHENTICATION=1 -DLIBDIR=\"/usr/local/libmesos\" -DPICOJSON_USE_INT64 -DPKGDATADIR=\"/usr/local/share/mesos\" -DPKGLIBEXECDIR=\"/usr/local/libexec/mesos\" -DUSE_CMAKE_BUILD_CONFIG -DUSE_STATIC_LIB -DVERSION=\"1.4.0\" -D__STDC_FORMAT_MACROS -Dprocess_0_0_1_EXPORTS -O2 -std=c++11 -g -fPIC -isystem /usr/include/apr-1.0 -isystem /mesos/build/3rdparty/boost-1.53.0/src/boost-1.53.0 -isystem /mesos/build/3rdparty/elfio-3.2/src/elfio-3.2 -isystem /mesos/build/3rdparty/glog-0.3.3/src/glog-0.3.3-lib/lib/include -isystem /mesos/build/3rdparty/nvml-352.79/src/nvml-352.79 -isystem /mesos/build/3rdparty/picojson-1.3.0/src/picojson-1.3.0 -isystem /mesos/build/3rdparty/protobuf-2.6.1/src/protobuf-2.6.1-lib/lib/include -isystem /usr/include/subversion-1 -isystem /mesos/3rdparty/stout/include -isystem /mesos/build/3rdparty/http_parser-2.6.2/src/http_parser-2.6.2 -isystem /mesos/build/3rdparty/libev-4.22/src/libev-4.22 -I/mesos/3rdparty/libprocess/include    -o CMakeFiles/process-0.0.1.dir/profiler.cpp.o -c /mesos/3rdparty/libprocess/src/profiler.cpp
/usr/bin/cmake -E cmake_progress_report /mesos/build/CMakeFiles 
[ 27%] Building CXX object src/CMakeFiles/mesos-protobufs.dir/__/include/mesos/state/state.pb.cc.o
cd /mesos/build/src && /usr/bin/g++   -DBUILD_FLAGS=\"\" -DBUILD_JAVA_JVM_LIBRARY=\"\" -DHAS_AUTHENTICATION=1 -DLIBDIR=\"/usr/local/libmesos\" -DPICOJSON_USE_INT64 -DPKGDATADIR=\"/usr/local/share/mesos\" -DPKGLIBEXECDIR=\"/usr/local/libexec/mesos\" -DUSE_CMAKE_BUILD_CONFIG -DUSE_STATIC_LIB -DVERSION=\"1.4.0\" -D__STDC_FORMAT_MACROS -Dmesos_protobufs_EXPORTS -O2 -std=c++11 -g -fPIC -I/mesos/build/include -I/mesos/build/include/mesos -I/mesos/build/src -I/mesos/src -isystem /mesos/build/3rdparty/protobuf-2.6.1/src/protobuf-2.6.1-lib/lib/include -isystem /mesos/3rdparty/libprocess/include -isystem /usr/include/apr-1.0 -isystem /mesos/build/3rdparty/boost-1.53.0/src/boost-1.53.0 -isystem /mesos/build/3rdparty/elfio-3.2/src/elfio-3.2 -isystem /mesos/build/3rdparty/glog-0.3.3/src/glog-0.3.3-lib/lib/include -isystem /mesos/build/3rdparty/nvml-352.79/src/nvml-352.79 -isystem /mesos/build/3rdparty/picojson-1.3.0/src/picojson-1.3.0 -isystem /usr/include/subversion-1 -isystem /mesos/3rdparty/stout/include -isystem /mesos/build/3rdparty/http_parser-2.6.2/src/http_parser-2.6.2 -isystem /mesos/build/3rdparty/libev-4.22/src/libev-4.22 -isystem /mesos/build/3rdparty/zookeeper-3.4.8/src/zookeeper-3.4.8/src/c/include -isystem /mesos/build/3rdparty/zookeeper-3.4.8/src/zookeeper-3.4.8/src/c/generated -isystem /mesos/build/3rdparty/leveldb-1.19/src/leveldb-1.19/include -I/mesos/include    -o CMakeFiles/mesos-protobufs.dir/__/include/mesos/state/state.pb.cc.o -c /mesos/build/include/mesos/state/state.pb.cc
/usr/bin/cmake -E cmake_progress_report /mesos/build/CMakeFiles 
[ 27%] Building CXX object 3rdparty/stout/tests/CMakeFiles/stout-tests.dir/linkedhashmap_tests.cpp.o
cd /mesos/build/3rdparty/stout/tests && /usr/bin/g++   -DBUILD_FLAGS=\"\" -DBUILD_JAVA_JVM_LIBRARY=\"\" -DHAS_AUTHENTICATION=1 -DLIBDIR=\"/usr/local/libmesos\" -DPICOJSON_USE_INT64 -DPKGDATADIR=\"/usr/local/share/mesos\" -DPKGLIBEXECDIR=\"/usr/local/libexec/mesos\" -DUSE_CMAKE_BUILD_CONFIG -DUSE_STATIC_LIB -DVERSION=\"1.4.0\" -D__STDC_FORMAT_MACROS -O2 -std=c++11 -g -fPIE -isystem /usr/include/apr-1.0 -isystem /mesos/build/3rdparty/boost-1.53.0/src/boost-1.53.0 -isystem /mesos/build/3rdparty/elfio-3.2/src/elfio-3.2 -isystem /mesos/build/3rdparty/glog-0.3.3/src/glog-0.3.3-lib/lib/include -isystem /mesos/build/3rdparty/nvml-352.79/src/nvml-352.79 -isystem /mesos/build/3rdparty/picojson-1.3.0/src/picojson-1.3.0 -isystem /mesos/build/3rdparty/protobuf-2.6.1/src/protobuf-2.6.1-lib/lib/include -isystem /usr/include/subversion-1 -isystem /mesos/build/3rdparty/gmock-1.7.0/src/gmock-1.7.0/include -isystem /mesos/build/3rdparty/gmock-1.7.0/src/gmock-1.7.0/gtest/include -I/mesos/3rdparty/stout/include    -o CMakeFiles/stout-tests.dir/linkedhashmap_tests.cpp.o -c /mesos/3rdparty/stout/tests/linkedhashmap_tests.cpp
/usr/bin/cmake -E cmake_progress_report /mesos/build/CMakeFiles 
[ 27%] Building CXX object src/CMakeFiles/mesos-protobufs.dir/__/include/mesos/uri/uri.pb.cc.o
cd /mesos/build/src && /usr/bin/g++   -DBUILD_FLAGS=\"\" -DBUILD_JAVA_JVM_LIBRARY=\"\" -DHAS_AUTHENTICATION=1 -DLIBDIR=\"/usr/local/libmesos\" -DPICOJSON_USE_INT64 -DPKGDATADIR=\"/usr/local/share/mesos\" -DPKGLIBEXECDIR=\"/usr/local/libexec/mesos\" -DUSE_CMAKE_BUILD_CONFIG -DUSE_STATIC_LIB -DVERSION=\"1.4.0\" -D__STDC_FORMAT_MACROS -Dmesos_protobufs_EXPORTS -O2 -std=c++11 -g -fPIC -I/mesos/build/include -I/mesos/build/include/mesos -I/mesos/build/src -I/mesos/src -isystem /mesos/build/3rdparty/protobuf-2.6.1/src/protobuf-2.6.1-lib/lib/include -isystem /mesos/3rdparty/libprocess/include -isystem /usr/include/apr-1.0 -isystem /mesos/build/3rdparty/boost-1.53.0/src/boost-1.53.0 -isystem /mesos/build/3rdparty/elfio-3.2/src/elfio-3.2 -isystem /mesos/build/3rdparty/glog-0.3.3/src/glog-0.3.3-lib/lib/include -isystem /mesos/build/3rdparty/nvml-352.79/src/nvml-352.79 -isystem /mesos/build/3rdparty/picojson-1.3.0/src/picojson-1.3.0 -isystem /usr/include/subversion-1 -isystem /mesos/3rdparty/stout/include -isystem /mesos/build/3rdparty/http_parser-2.6.2/src/http_parser-2.6.2 -isystem /mesos/build/3rdparty/libev-4.22/src/libev-4.22 -isystem /mesos/build/3rdparty/zookeeper-3.4.8/src/zookeeper-3.4.8/src/c/include -isystem /mesos/build/3rdparty/zookeeper-3.4.8/src/zookeeper-3.4.8/src/c/generated -isystem /mesos/build/3rdparty/leveldb-1.19/src/leveldb-1.19/include -I/mesos/include    -o CMakeFiles/mesos-protobufs.dir/__/include/mesos/uri/uri.pb.cc.o -c /mesos/build/include/mesos/uri/uri.pb.cc
/usr/bin/cmake -E cmake_progress_report /mesos/build/CMakeFiles 90
[ 28%] Building CXX object 3rdparty/stout/tests/CMakeFiles/stout-tests.dir/mac_tests.cpp.o
cd /mesos/build/3rdparty/stout/tests && /usr/bin/g++   -DBUILD_FLAGS=\"\" -DBUILD_JAVA_JVM_LIBRARY=\"\" -DHAS_AUTHENTICATION=1 -DLIBDIR=\"/usr/local/libmesos\" -DPICOJSON_USE_INT64 -DPKGDATADIR=\"/usr/local/share/mesos\" -DPKGLIBEXECDIR=\"/usr/local/libexec/mesos\" -DUSE_CMAKE_BUILD_CONFIG -DUSE_STATIC_LIB -DVERSION=\"1.4.0\" -D__STDC_FORMAT_MACROS -O2 -std=c++11 -g -fPIE -isystem /usr/include/apr-1.0 -isystem /mesos/build/3rdparty/boost-1.53.0/src/boost-1.53.0 -isystem /mesos/build/3rdparty/elfio-3.2/src/elfio-3.2 -isystem /mesos/build/3rdparty/glog-0.3.3/src/glog-0.3.3-lib/lib/include -isystem /mesos/build/3rdparty/nvml-352.79/src/nvml-352.79 -isystem /mesos/build/3rdparty/picojson-1.3.0/src/picojson-1.3.0 -isystem /mesos/build/3rdparty/protobuf-2.6.1/src/protobuf-2.6.1-lib/lib/include -isystem /usr/include/subversion-1 -isystem /mesos/build/3rdparty/gmock-1.7.0/src/gmock-1.7.0/include -isystem /mesos/build/3rdparty/gmock-1.7.0/src/gmock-1.7.0/gtest/include -I/mesos/3rdparty/stout/include    -o CMakeFiles/stout-tests.dir/mac_tests.cpp.o -c /mesos/3rdparty/stout/tests/mac_tests.cpp
/usr/bin/cmake -E cmake_progress_report /mesos/build/CMakeFiles 
[ 28%] Building CXX object 3rdparty/stout/tests/CMakeFiles/stout-tests.dir/main.cpp.o
cd /mesos/build/3rdparty/stout/tests && /usr/bin/g++   -DBUILD_FLAGS=\"\" -DBUILD_JAVA_JVM_LIBRARY=\"\" -DHAS_AUTHENTICATION=1 -DLIBDIR=\"/usr/local/libmesos\" -DPICOJSON_USE_INT64 -DPKGDATADIR=\"/usr/local/share/mesos\" -DPKGLIBEXECDIR=\"/usr/local/libexec/mesos\" -DUSE_CMAKE_BUILD_CONFIG -DUSE_STATIC_LIB -DVERSION=\"1.4.0\" -D__STDC_FORMAT_MACROS -O2 -std=c++11 -g -fPIE -isystem /usr/include/apr-1.0 -isystem /mesos/build/3rdparty/boost-1.53.0/src/boost-1.53.0 -isystem /mesos/build/3rdparty/elfio-3.2/src/elfio-3.2 -isystem /mesos/build/3rdparty/glog-0.3.3/src/glog-0.3.3-lib/lib/include -isystem /mesos/build/3rdparty/nvml-352.79/src/nvml-352.79 -isystem /mesos/build/3rdparty/picojson-1.3.0/src/picojson-1.3.0 -isystem /mesos/build/3rdparty/protobuf-2.6.1/src/protobuf-2.6.1-lib/lib/include -isystem /usr/include/subversion-1 -isystem /mesos/build/3rdparty/gmock-1.7.0/src/gmock-1.7.0/include -isystem /mesos/build/3rdparty/gmock-1.7.0/src/gmock-1.7.0/gtest/include -I/mesos/3rdparty/stout/include    -o CMakeFiles/stout-tests.dir/main.cpp.o -c /mesos/3rdparty/stout/tests/main.cpp
/usr/bin/cmake -E cmake_progress_report /mesos/build/CMakeFiles 
[ 28%] Building CXX object 3rdparty/libprocess/src/CMakeFiles/process-0.0.1.dir/process.cpp.o
cd /mesos/build/3rdparty/libprocess/src && /usr/bin/g++   -DBUILD_FLAGS=\"\" -DBUILD_JAVA_JVM_LIBRARY=\"\" -DHAS_AUTHENTICATION=1 -DLIBDIR=\"/usr/local/libmesos\" -DPICOJSON_USE_INT64 -DPKGDATADIR=\"/usr/local/share/mesos\" -DPKGLIBEXECDIR=\"/usr/local/libexec/mesos\" -DUSE_CMAKE_BUILD_CONFIG -DUSE_STATIC_LIB -DVERSION=\"1.4.0\" -D__STDC_FORMAT_MACROS -Dprocess_0_0_1_EXPORTS -O2 -std=c++11 -g -fPIC -isystem /usr/include/apr-1.0 -isystem /mesos/build/3rdparty/boost-1.53.0/src/boost-1.53.0 -isystem /mesos/build/3rdparty/elfio-3.2/src/elfio-3.2 -isystem /mesos/build/3rdparty/glog-0.3.3/src/glog-0.3.3-lib/lib/include -isystem /mesos/build/3rdparty/nvml-352.79/src/nvml-352.79 -isystem /mesos/build/3rdparty/picojson-1.3.0/src/picojson-1.3.0 -isystem /mesos/build/3rdparty/protobuf-2.6.1/src/protobuf-2.6.1-lib/lib/include -isystem /usr/include/subversion-1 -isystem /mesos/3rdparty/stout/include -isystem /mesos/build/3rdparty/http_parser-2.6.2/src/http_parser-2.6.2 -isystem /mesos/build/3rdparty/libev-4.22/src/libev-4.22 -I/mesos/3rdparty/libprocess/include    -o CMakeFiles/process-0.0.1.dir/process.cpp.o -c /mesos/3rdparty/libprocess/src/process.cpp
/usr/bin/cmake -E cmake_progress_report /mesos/build/CMakeFiles 56
[ 29%] Building CXX object src/CMakeFiles/mesos-protobufs.dir/__/include/mesos/v1/agent/agent.pb.cc.o
cd /mesos/build/src && /usr/bin/g++   -DBUILD_FLAGS=\"\" -DBUILD_JAVA_JVM_LIBRARY=\"\" -DHAS_AUTHENTICATION=1 -DLIBDIR=\"/usr/local/libmesos\" -DPICOJSON_USE_INT64 -DPKGDATADIR=\"/usr/local/share/mesos\" -DPKGLIBEXECDIR=\"/usr/local/libexec/mesos\" -DUSE_CMAKE_BUILD_CONFIG -DUSE_STATIC_LIB -DVERSION=\"1.4.0\" -D__STDC_FORMAT_MACROS -Dmesos_protobufs_EXPORTS -O2 -std=c++11 -g -fPIC -I/mesos/build/include -I/mesos/build/include/mesos -I/mesos/build/src -I/mesos/src -isystem /mesos/build/3rdparty/protobuf-2.6.1/src/protobuf-2.6.1-lib/lib/include -isystem /mesos/3rdparty/libprocess/include -isystem /usr/include/apr-1.0 -isystem /mesos/build/3rdparty/boost-1.53.0/src/boost-1.53.0 -isystem /mesos/build/3rdparty/elfio-3.2/src/elfio-3.2 -isystem /mesos/build/3rdparty/glog-0.3.3/src/glog-0.3.3-lib/lib/include -isystem /mesos/build/3rdparty/nvml-352.79/src/nvml-352.79 -isystem /mesos/build/3rdparty/picojson-1.3.0/src/picojson-1.3.0 -isystem /usr/include/subversion-1 -isystem /mesos/3rdparty/stout/include -isystem /mesos/build/3rdparty/http_parser-2.6.2/src/http_parser-2.6.2 -isystem /mesos/build/3rdparty/libev-4.22/src/libev-4.22 -isystem /mesos/build/3rdparty/zookeeper-3.4.8/src/zookeeper-3.4.8/src/c/include -isystem /mesos/build/3rdparty/zookeeper-3.4.8/src/zookeeper-3.4.8/src/c/generated -isystem /mesos/build/3rdparty/leveldb-1.19/src/leveldb-1.19/include -I/mesos/include    -o CMakeFiles/mesos-protobufs.dir/__/include/mesos/v1/agent/agent.pb.cc.o -c /mesos/build/include/mesos/v1/agent/agent.pb.cc
/usr/bin/cmake -E cmake_progress_report /mesos/build/CMakeFiles 85
[ 30%] Building CXX object 3rdparty/libprocess/src/CMakeFiles/process-0.0.1.dir/reap.cpp.o
cd /mesos/build/3rdparty/libprocess/src && /usr/bin/g++   -DBUILD_FLAGS=\"\" -DBUILD_JAVA_JVM_LIBRARY=\"\" -DHAS_AUTHENTICATION=1 -DLIBDIR=\"/usr/local/libmesos\" -DPICOJSON_USE_INT64 -DPKGDATADIR=\"/usr/local/share/mesos\" -DPKGLIBEXECDIR=\"/usr/local/libexec/mesos\" -DUSE_CMAKE_BUILD_CONFIG -DUSE_STATIC_LIB -DVERSION=\"1.4.0\" -D__STDC_FORMAT_MACROS -Dprocess_0_0_1_EXPORTS -O2 -std=c++11 -g -fPIC -isystem /usr/include/apr-1.0 -isystem /mesos/build/3rdparty/boost-1.53.0/src/boost-1.53.0 -isystem /mesos/build/3rdparty/elfio-3.2/src/elfio-3.2 -isystem /mesos/build/3rdparty/glog-0.3.3/src/glog-0.3.3-lib/lib/include -isystem /mesos/build/3rdparty/nvml-352.79/src/nvml-352.79 -isystem /mesos/build/3rdparty/picojson-1.3.0/src/picojson-1.3.0 -isystem /mesos/build/3rdparty/protobuf-2.6.1/src/protobuf-2.6.1-lib/lib/include -isystem /usr/include/subversion-1 -isystem /mesos/3rdparty/stout/include -isystem /mesos/build/3rdparty/http_parser-2.6.2/src/http_parser-2.6.2 -isystem /mesos/build/3rdparty/libev-4.22/src/libev-4.22 -I/mesos/3rdparty/libprocess/include    -o CMakeFiles/process-0.0.1.dir/reap.cpp.o -c /mesos/3rdparty/libprocess/src/reap.cpp
/usr/bin/cmake -E cmake_progress_report /mesos/build/CMakeFiles 
[ 30%] Building CXX object src/CMakeFiles/mesos-protobufs.dir/__/include/mesos/v1/allocator/allocator.pb.cc.o
cd /mesos/build/src && /usr/bin/g++   -DBUILD_FLAGS=\"\" -DBUILD_JAVA_JVM_LIBRARY=\"\" -DHAS_AUTHENTICATION=1 -DLIBDIR=\"/usr/local/libmesos\" -DPICOJSON_USE_INT64 -DPKGDATADIR=\"/usr/local/share/mesos\" -DPKGLIBEXECDIR=\"/usr/local/libexec/mesos\" -DUSE_CMAKE_BUILD_CONFIG -DUSE_STATIC_LIB -DVERSION=\"1.4.0\" -D__STDC_FORMAT_MACROS -Dmesos_protobufs_EXPORTS -O2 -std=c++11 -g -fPIC -I/mesos/build/include -I/mesos/build/include/mesos -I/mesos/build/src -I/mesos/src -isystem /mesos/build/3rdparty/protobuf-2.6.1/src/protobuf-2.6.1-lib/lib/include -isystem /mesos/3rdparty/libprocess/include -isystem /usr/include/apr-1.0 -isystem /mesos/build/3rdparty/boost-1.53.0/src/boost-1.53.0 -isystem /mesos/build/3rdparty/elfio-3.2/src/elfio-3.2 -isystem /mesos/build/3rdparty/glog-0.3.3/src/glog-0.3.3-lib/lib/include -isystem /mesos/build/3rdparty/nvml-352.79/src/nvml-352.79 -isystem /mesos/build/3rdparty/picojson-1.3.0/src/picojson-1.3.0 -isystem /usr/include/subversion-1 -isystem /mesos/3rdparty/stout/include -isystem /mesos/build/3rdparty/http_parser-2.6.2/src/http_parser-2.6.2 -isystem /mesos/build/3rdparty/libev-4.22/src/libev-4.22 -isystem /mesos/build/3rdparty/zookeeper-3.4.8/src/zookeeper-3.4.8/src/c/include -isystem /mesos/build/3rdparty/zookeeper-3.4.8/src/zookeeper-3.4.8/src/c/generated -isystem /mesos/build/3rdparty/leveldb-1.19/src/leveldb-1.19/include -I/mesos/include    -o CMakeFiles/mesos-protobufs.dir/__/include/mesos/v1/allocator/allocator.pb.cc.o -c /mesos/build/include/mesos/v1/allocator/allocator.pb.cc
/usr/bin/cmake -E cmake_progress_report /mesos/build/CMakeFiles 
[ 30%] Building CXX object 3rdparty/stout/tests/CMakeFiles/stout-tests.dir/multimap_tests.cpp.o
cd /mesos/build/3rdparty/stout/tests && /usr/bin/g++   -DBUILD_FLAGS=\"\" -DBUILD_JAVA_JVM_LIBRARY=\"\" -DHAS_AUTHENTICATION=1 -DLIBDIR=\"/usr/local/libmesos\" -DPICOJSON_USE_INT64 -DPKGDATADIR=\"/usr/local/share/mesos\" -DPKGLIBEXECDIR=\"/usr/local/libexec/mesos\" -DUSE_CMAKE_BUILD_CONFIG -DUSE_STATIC_LIB -DVERSION=\"1.4.0\" -D__STDC_FORMAT_MACROS -O2 -std=c++11 -g -fPIE -isystem /usr/include/apr-1.0 -isystem /mesos/build/3rdparty/boost-1.53.0/src/boost-1.53.0 -isystem /mesos/build/3rdparty/elfio-3.2/src/elfio-3.2 -isystem /mesos/build/3rdparty/glog-0.3.3/src/glog-0.3.3-lib/lib/include -isystem /mesos/build/3rdparty/nvml-352.79/src/nvml-352.79 -isystem /mesos/build/3rdparty/picojson-1.3.0/src/picojson-1.3.0 -isystem /mesos/build/3rdparty/protobuf-2.6.1/src/protobuf-2.6.1-lib/lib/include -isystem /usr/include/subversion-1 -isystem /mesos/build/3rdparty/gmock-1.7.0/src/gmock-1.7.0/include -isystem /mesos/build/3rdparty/gmock-1.7.0/src/gmock-1.7.0/gtest/include -I/mesos/3rdparty/stout/include    -o CMakeFiles/stout-tests.dir/multimap_tests.cpp.o -c /mesos/3rdparty/stout/tests/multimap_tests.cpp
/usr/bin/cmake -E cmake_progress_report /mesos/build/CMakeFiles 
[ 30%] Building CXX object src/CMakeFiles/mesos-protobufs.dir/__/include/mesos/v1/executor/executor.pb.cc.o
cd /mesos/build/src && /usr/bin/g++   -DBUILD_FLAGS=\"\" -DBUILD_JAVA_JVM_LIBRARY=\"\" -DHAS_AUTHENTICATION=1 -DLIBDIR=\"/usr/local/libmesos\" -DPICOJSON_USE_INT64 -DPKGDATADIR=\"/usr/local/share/mesos\" -DPKGLIBEXECDIR=\"/usr/local/libexec/mesos\" -DUSE_CMAKE_BUILD_CONFIG -DUSE_STATIC_LIB -DVERSION=\"1.4.0\" -D__STDC_FORMAT_MACROS -Dmesos_protobufs_EXPORTS -O2 -std=c++11 -g -fPIC -I/mesos/build/include -I/mesos/build/include/mesos -I/mesos/build/src -I/mesos/src -isystem /mesos/build/3rdparty/protobuf-2.6.1/src/protobuf-2.6.1-lib/lib/include -isystem /mesos/3rdparty/libprocess/include -isystem /usr/include/apr-1.0 -isystem /mesos/build/3rdparty/boost-1.53.0/src/boost-1.53.0 -isystem /mesos/build/3rdparty/elfio-3.2/src/elfio-3.2 -isystem /mesos/build/3rdparty/glog-0.3.3/src/glog-0.3.3-lib/lib/include -isystem /mesos/build/3rdparty/nvml-352.79/src/nvml-352.79 -isystem /mesos/build/3rdparty/picojson-1.3.0/src/picojson-1.3.0 -isystem /usr/include/subversion-1 -isystem /mesos/3rdparty/stout/include -isystem /mesos/build/3rdparty/http_parser-2.6.2/src/http_parser-2.6.2 -isystem /mesos/build/3rdparty/libev-4.22/src/libev-4.22 -isystem /mesos/build/3rdparty/zookeeper-3.4.8/src/zookeeper-3.4.8/src/c/include -isystem /mesos/build/3rdparty/zookeeper-3.4.8/src/zookeeper-3.4.8/src/c/generated -isystem /mesos/build/3rdparty/leveldb-1.19/src/leveldb-1.19/include -I/mesos/include    -o CMakeFiles/mesos-protobufs.dir/__/include/mesos/v1/executor/executor.pb.cc.o -c /mesos/build/include/mesos/v1/executor/executor.pb.cc
/usr/bin/cmake -E cmake_progress_report /mesos/build/CMakeFiles 
[ 30%] Building CXX object 3rdparty/libprocess/src/CMakeFiles/process-0.0.1.dir/socket.cpp.o
cd /mesos/build/3rdparty/libprocess/src && /usr/bin/g++   -DBUILD_FLAGS=\"\" -DBUILD_JAVA_JVM_LIBRARY=\"\" -DHAS_AUTHENTICATION=1 -DLIBDIR=\"/usr/local/libmesos\" -DPICOJSON_USE_INT64 -DPKGDATADIR=\"/usr/local/share/mesos\" -DPKGLIBEXECDIR=\"/usr/local/libexec/mesos\" -DUSE_CMAKE_BUILD_CONFIG -DUSE_STATIC_LIB -DVERSION=\"1.4.0\" -D__STDC_FORMAT_MACROS -Dprocess_0_0_1_EXPORTS -O2 -std=c++11 -g -fPIC -isystem /usr/include/apr-1.0 -isystem /mesos/build/3rdparty/boost-1.53.0/src/boost-1.53.0 -isystem /mesos/build/3rdparty/elfio-3.2/src/elfio-3.2 -isystem /mesos/build/3rdparty/glog-0.3.3/src/glog-0.3.3-lib/lib/include -isystem /mesos/build/3rdparty/nvml-352.79/src/nvml-352.79 -isystem /mesos/build/3rdparty/picojson-1.3.0/src/picojson-1.3.0 -isystem /mesos/build/3rdparty/protobuf-2.6.1/src/protobuf-2.6.1-lib/lib/include -isystem /usr/include/subversion-1 -isystem /mesos/3rdparty/stout/include -isystem /mesos/build/3rdparty/http_parser-2.6.2/src/http_parser-2.6.2 -isystem /mesos/build/3rdparty/libev-4.22/src/libev-4.22 -I/mesos/3rdparty/libprocess/include    -o CMakeFiles/process-0.0.1.dir/socket.cpp.o -c /mesos/3rdparty/libprocess/src/socket.cpp
/usr/bin/cmake -E cmake_progress_report /mesos/build/CMakeFiles 
[ 30%] Building CXX object src/CMakeFiles/mesos-protobufs.dir/__/include/mesos/v1/maintenance/maintenance.pb.cc.o
cd /mesos/build/src && /usr/bin/g++   -DBUILD_FLAGS=\"\" -DBUILD_JAVA_JVM_LIBRARY=\"\" -DHAS_AUTHENTICATION=1 -DLIBDIR=\"/usr/local/libmesos\" -DPICOJSON_USE_INT64 -DPKGDATADIR=\"/usr/local/share/mesos\" -DPKGLIBEXECDIR=\"/usr/local/libexec/mesos\" -DUSE_CMAKE_BUILD_CONFIG -DUSE_STATIC_LIB -DVERSION=\"1.4.0\" -D__STDC_FORMAT_MACROS -Dmesos_protobufs_EXPORTS -O2 -std=c++11 -g -fPIC -I/mesos/build/include -I/mesos/build/include/mesos -I/mesos/build/src -I/mesos/src -isystem /mesos/build/3rdparty/protobuf-2.6.1/src/protobuf-2.6.1-lib/lib/include -isystem /mesos/3rdparty/libprocess/include -isystem /usr/include/apr-1.0 -isystem /mesos/build/3rdparty/boost-1.53.0/src/boost-1.53.0 -isystem /mesos/build/3rdparty/elfio-3.2/src/elfio-3.2 -isystem /mesos/build/3rdparty/glog-0.3.3/src/glog-0.3.3-lib/lib/include -isystem /mesos/build/3rdparty/nvml-352.79/src/nvml-352.79 -isystem /mesos/build/3rdparty/picojson-1.3.0/src/picojson-1.3.0 -isystem /usr/include/subversion-1 -isystem /mesos/3rdparty/stout/include -isystem /mesos/build/3rdparty/http_parser-2.6.2/src/http_parser-2.6.2 -isystem /mesos/build/3rdparty/libev-4.22/src/libev-4.22 -isystem /mesos/build/3rdparty/zookeeper-3.4.8/src/zookeeper-3.4.8/src/c/include -isystem /mesos/build/3rdparty/zookeeper-3.4.8/src/zookeeper-3.4.8/src/c/generated -isystem /mesos/build/3rdparty/leveldb-1.19/src/leveldb-1.19/include -I/mesos/include    -o CMakeFiles/mesos-protobufs.dir/__/include/mesos/v1/maintenance/maintenance.pb.cc.o -c /mesos/build/include/mesos/v1/maintenance/maintenance.pb.cc
/usr/bin/cmake -E cmake_progress_report /mesos/build/CMakeFiles 
[ 30%] Building CXX object 3rdparty/libprocess/src/CMakeFiles/process-0.0.1.dir/subprocess.cpp.o
cd /mesos/build/3rdparty/libprocess/src && /usr/bin/g++   -DBUILD_FLAGS=\"\" -DBUILD_JAVA_JVM_LIBRARY=\"\" -DHAS_AUTHENTICATION=1 -DLIBDIR=\"/usr/local/libmesos\" -DPICOJSON_USE_INT64 -DPKGDATADIR=\"/usr/local/share/mesos\" -DPKGLIBEXECDIR=\"/usr/local/libexec/mesos\" -DUSE_CMAKE_BUILD_CONFIG -DUSE_STATIC_LIB -DVERSION=\"1.4.0\" -D__STDC_FORMAT_MACROS -Dprocess_0_0_1_EXPORTS -O2 -std=c++11 -g -fPIC -isystem /usr/include/apr-1.0 -isystem /mesos/build/3rdparty/boost-1.53.0/src/boost-1.53.0 -isystem /mesos/build/3rdparty/elfio-3.2/src/elfio-3.2 -isystem /mesos/build/3rdparty/glog-0.3.3/src/glog-0.3.3-lib/lib/include -isystem /mesos/build/3rdparty/nvml-352.79/src/nvml-352.79 -isystem /mesos/build/3rdparty/picojson-1.3.0/src/picojson-1.3.0 -isystem /mesos/build/3rdparty/protobuf-2.6.1/src/protobuf-2.6.1-lib/lib/include -isystem /usr/include/subversion-1 -isystem /mesos/3rdparty/stout/include -isystem /mesos/build/3rdparty/http_parser-2.6.2/src/http_parser-2.6.2 -isystem /mesos/build/3rdparty/libev-4.22/src/libev-4.22 -I/mesos/3rdparty/libprocess/include    -o CMakeFiles/process-0.0.1.dir/subprocess.cpp.o -c /mesos/3rdparty/libprocess/src/subprocess.cpp
/usr/bin/cmake -E cmake_progress_report /mesos/build/CMakeFiles 
[ 30%] Building CXX object 3rdparty/stout/tests/CMakeFiles/stout-tests.dir/none_tests.cpp.o
cd /mesos/build/3rdparty/stout/tests && /usr/bin/g++   -DBUILD_FLAGS=\"\" -DBUILD_JAVA_JVM_LIBRARY=\"\" -DHAS_AUTHENTICATION=1 -DLIBDIR=\"/usr/local/libmesos\" -DPICOJSON_USE_INT64 -DPKGDATADIR=\"/usr/local/share/mesos\" -DPKGLIBEXECDIR=\"/usr/local/libexec/mesos\" -DUSE_CMAKE_BUILD_CONFIG -DUSE_STATIC_LIB -DVERSION=\"1.4.0\" -D__STDC_FORMAT_MACROS -O2 -std=c++11 -g -fPIE -isystem /usr/include/apr-1.0 -isystem /mesos/build/3rdparty/boost-1.53.0/src/boost-1.53.0 -isystem /mesos/build/3rdparty/elfio-3.2/src/elfio-3.2 -isystem /mesos/build/3rdparty/glog-0.3.3/src/glog-0.3.3-lib/lib/include -isystem /mesos/build/3rdparty/nvml-352.79/src/nvml-352.79 -isystem /mesos/build/3rdparty/picojson-1.3.0/src/picojson-1.3.0 -isystem /mesos/build/3rdparty/protobuf-2.6.1/src/protobuf-2.6.1-lib/lib/include -isystem /usr/include/subversion-1 -isystem /mesos/build/3rdparty/gmock-1.7.0/src/gmock-1.7.0/include -isystem /mesos/build/3rdparty/gmock-1.7.0/src/gmock-1.7.0/gtest/include -I/mesos/3rdparty/stout/include    -o CMakeFiles/stout-tests.dir/none_tests.cpp.o -c /mesos/3rdparty/stout/tests/none_tests.cpp
/usr/bin/cmake -E cmake_progress_report /mesos/build/CMakeFiles 
[ 30%] Building CXX object src/CMakeFiles/mesos-protobufs.dir/__/include/mesos/v1/master/master.pb.cc.o
cd /mesos/build/src && /usr/bin/g++   -DBUILD_FLAGS=\"\" -DBUILD_JAVA_JVM_LIBRARY=\"\" -DHAS_AUTHENTICATION=1 -DLIBDIR=\"/usr/local/libmesos\" -DPICOJSON_USE_INT64 -DPKGDATADIR=\"/usr/local/share/mesos\" -DPKGLIBEXECDIR=\"/usr/local/libexec/mesos\" -DUSE_CMAKE_BUILD_CONFIG -DUSE_STATIC_LIB -DVERSION=\"1.4.0\" -D__STDC_FORMAT_MACROS -Dmesos_protobufs_EXPORTS -O2 -std=c++11 -g -fPIC -I/mesos/build/include -I/mesos/build/include/mesos -I/mesos/build/src -I/mesos/src -isystem /mesos/build/3rdparty/protobuf-2.6.1/src/protobuf-2.6.1-lib/lib/include -isystem /mesos/3rdparty/libprocess/include -isystem /usr/include/apr-1.0 -isystem /mesos/build/3rdparty/boost-1.53.0/src/boost-1.53.0 -isystem /mesos/build/3rdparty/elfio-3.2/src/elfio-3.2 -isystem /mesos/build/3rdparty/glog-0.3.3/src/glog-0.3.3-lib/lib/include -isystem /mesos/build/3rdparty/nvml-352.79/src/nvml-352.79 -isystem /mesos/build/3rdparty/picojson-1.3.0/src/picojson-1.3.0 -isystem /usr/include/subversion-1 -isystem /mesos/3rdparty/stout/include -isystem /mesos/build/3rdparty/http_parser-2.6.2/src/http_parser-2.6.2 -isystem /mesos/build/3rdparty/libev-4.22/src/libev-4.22 -isystem /mesos/build/3rdparty/zookeeper-3.4.8/src/zookeeper-3.4.8/src/c/include -isystem /mesos/build/3rdparty/zookeeper-3.4.8/src/zookeeper-3.4.8/src/c/generated -isystem /mesos/build/3rdparty/leveldb-1.19/src/leveldb-1.19/include -I/mesos/include    -o CMakeFiles/mesos-protobufs.dir/__/include/mesos/v1/master/master.pb.cc.o -c /mesos/build/include/mesos/v1/master/master.pb.cc
/usr/bin/cmake -E cmake_progress_report /mesos/build/CMakeFiles 
[ 30%] Building CXX object 3rdparty/stout/tests/CMakeFiles/stout-tests.dir/numify_tests.cpp.o
cd /mesos/build/3rdparty/stout/tests && /usr/bin/g++   -DBUILD_FLAGS=\"\" -DBUILD_JAVA_JVM_LIBRARY=\"\" -DHAS_AUTHENTICATION=1 -DLIBDIR=\"/usr/local/libmesos\" -DPICOJSON_USE_INT64 -DPKGDATADIR=\"/usr/local/share/mesos\" -DPKGLIBEXECDIR=\"/usr/local/libexec/mesos\" -DUSE_CMAKE_BUILD_CONFIG -DUSE_STATIC_LIB -DVERSION=\"1.4.0\" -D__STDC_FORMAT_MACROS -O2 -std=c++11 -g -fPIE -isystem /usr/include/apr-1.0 -isystem /mesos/build/3rdparty/boost-1.53.0/src/boost-1.53.0 -isystem /mesos/build/3rdparty/elfio-3.2/src/elfio-3.2 -isystem /mesos/build/3rdparty/glog-0.3.3/src/glog-0.3.3-lib/lib/include -isystem /mesos/build/3rdparty/nvml-352.79/src/nvml-352.79 -isystem /mesos/build/3rdparty/picojson-1.3.0/src/picojson-1.3.0 -isystem /mesos/build/3rdparty/protobuf-2.6.1/src/protobuf-2.6.1-lib/lib/include -isystem /usr/include/subversion-1 -isystem /mesos/build/3rdparty/gmock-1.7.0/src/gmock-1.7.0/include -isystem /mesos/build/3rdparty/gmock-1.7.0/src/gmock-1.7.0/gtest/include -I/mesos/3rdparty/stout/include    -o CMakeFiles/stout-tests.dir/numify_tests.cpp.o -c /mesos/3rdparty/stout/tests/numify_tests.cpp
/usr/bin/cmake -E cmake_progress_report /mesos/build/CMakeFiles 
[ 30%] Building CXX object 3rdparty/libprocess/src/CMakeFiles/process-0.0.1.dir/time.cpp.o
cd /mesos/build/3rdparty/libprocess/src && /usr/bin/g++   -DBUILD_FLAGS=\"\" -DBUILD_JAVA_JVM_LIBRARY=\"\" -DHAS_AUTHENTICATION=1 -DLIBDIR=\"/usr/local/libmesos\" -DPICOJSON_USE_INT64 -DPKGDATADIR=\"/usr/local/share/mesos\" -DPKGLIBEXECDIR=\"/usr/local/libexec/mesos\" -DUSE_CMAKE_BUILD_CONFIG -DUSE_STATIC_LIB -DVERSION=\"1.4.0\" -D__STDC_FORMAT_MACROS -Dprocess_0_0_1_EXPORTS -O2 -std=c++11 -g -fPIC -isystem /usr/include/apr-1.0 -isystem /mesos/build/3rdparty/boost-1.53.0/src/boost-1.53.0 -isystem /mesos/build/3rdparty/elfio-3.2/src/elfio-3.2 -isystem /mesos/build/3rdparty/glog-0.3.3/src/glog-0.3.3-lib/lib/include -isystem /mesos/build/3rdparty/nvml-352.79/src/nvml-352.79 -isystem /mesos/build/3rdparty/picojson-1.3.0/src/picojson-1.3.0 -isystem /mesos/build/3rdparty/protobuf-2.6.1/src/protobuf-2.6.1-lib/lib/include -isystem /usr/include/subversion-1 -isystem /mesos/3rdparty/stout/include -isystem /mesos/build/3rdparty/http_parser-2.6.2/src/http_parser-2.6.2 -isystem /mesos/build/3rdparty/libev-4.22/src/libev-4.22 -I/mesos/3rdparty/libprocess/include    -o CMakeFiles/process-0.0.1.dir/time.cpp.o -c /mesos/3rdparty/libprocess/src/time.cpp
/usr/bin/cmake -E cmake_progress_report /mesos/build/CMakeFiles 
[ 30%] Building CXX object src/CMakeFiles/mesos-protobufs.dir/__/include/mesos/v1/mesos.pb.cc.o
cd /mesos/build/src && /usr/bin/g++   -DBUILD_FLAGS=\"\" -DBUILD_JAVA_JVM_LIBRARY=\"\" -DHAS_AUTHENTICATION=1 -DLIBDIR=\"/usr/local/libmesos\" -DPICOJSON_USE_INT64 -DPKGDATADIR=\"/usr/local/share/mesos\" -DPKGLIBEXECDIR=\"/usr/local/libexec/mesos\" -DUSE_CMAKE_BUILD_CONFIG -DUSE_STATIC_LIB -DVERSION=\"1.4.0\" -D__STDC_FORMAT_MACROS -Dmesos_protobufs_EXPORTS -O2 -std=c++11 -g -fPIC -I/mesos/build/include -I/mesos/build/include/mesos -I/mesos/build/src -I/mesos/src -isystem /mesos/build/3rdparty/protobuf-2.6.1/src/protobuf-2.6.1-lib/lib/include -isystem /mesos/3rdparty/libprocess/include -isystem /usr/include/apr-1.0 -isystem /mesos/build/3rdparty/boost-1.53.0/src/boost-1.53.0 -isystem /mesos/build/3rdparty/elfio-3.2/src/elfio-3.2 -isystem /mesos/build/3rdparty/glog-0.3.3/src/glog-0.3.3-lib/lib/include -isystem /mesos/build/3rdparty/nvml-352.79/src/nvml-352.79 -isystem /mesos/build/3rdparty/picojson-1.3.0/src/picojson-1.3.0 -isystem /usr/include/subversion-1 -isystem /mesos/3rdparty/stout/include -isystem /mesos/build/3rdparty/http_parser-2.6.2/src/http_parser-2.6.2 -isystem /mesos/build/3rdparty/libev-4.22/src/libev-4.22 -isystem /mesos/build/3rdparty/zookeeper-3.4.8/src/zookeeper-3.4.8/src/c/include -isystem /mesos/build/3rdparty/zookeeper-3.4.8/src/zookeeper-3.4.8/src/c/generated -isystem /mesos/build/3rdparty/leveldb-1.19/src/leveldb-1.19/include -I/mesos/include    -o CMakeFiles/mesos-protobufs.dir/__/include/mesos/v1/mesos.pb.cc.o -c /mesos/build/include/mesos/v1/mesos.pb.cc
/usr/bin/cmake -E cmake_progress_report /mesos/build/CMakeFiles 
[ 30%] Building CXX object 3rdparty/stout/tests/CMakeFiles/stout-tests.dir/option_tests.cpp.o
cd /mesos/build/3rdparty/stout/tests && /usr/bin/g++   -DBUILD_FLAGS=\"\" -DBUILD_JAVA_JVM_LIBRARY=\"\" -DHAS_AUTHENTICATION=1 -DLIBDIR=\"/usr/local/libmesos\" -DPICOJSON_USE_INT64 -DPKGDATADIR=\"/usr/local/share/mesos\" -DPKGLIBEXECDIR=\"/usr/local/libexec/mesos\" -DUSE_CMAKE_BUILD_CONFIG -DUSE_STATIC_LIB -DVERSION=\"1.4.0\" -D__STDC_FORMAT_MACROS -O2 -std=c++11 -g -fPIE -isystem /usr/include/apr-1.0 -isystem /mesos/build/3rdparty/boost-1.53.0/src/boost-1.53.0 -isystem /mesos/build/3rdparty/elfio-3.2/src/elfio-3.2 -isystem /mesos/build/3rdparty/glog-0.3.3/src/glog-0.3.3-lib/lib/include -isystem /mesos/build/3rdparty/nvml-352.79/src/nvml-352.79 -isystem /mesos/build/3rdparty/picojson-1.3.0/src/picojson-1.3.0 -isystem /mesos/build/3rdparty/protobuf-2.6.1/src/protobuf-2.6.1-lib/lib/include -isystem /usr/include/subversion-1 -isystem /mesos/build/3rdparty/gmock-1.7.0/src/gmock-1.7.0/include -isystem /mesos/build/3rdparty/gmock-1.7.0/src/gmock-1.7.0/gtest/include -I/mesos/3rdparty/stout/include    -o CMakeFiles/stout-tests.dir/option_tests.cpp.o -c /mesos/3rdparty/stout/tests/option_tests.cpp
/usr/bin/cmake -E cmake_progress_report /mesos/build/CMakeFiles 57
[ 31%] Building CXX object src/CMakeFiles/mesos-protobufs.dir/__/include/mesos/v1/quota/quota.pb.cc.o
cd /mesos/build/src && /usr/bin/g++   -DBUILD_FLAGS=\"\" -DBUILD_JAVA_JVM_LIBRARY=\"\" -DHAS_AUTHENTICATION=1 -DLIBDIR=\"/usr/local/libmesos\" -DPICOJSON_USE_INT64 -DPKGDATADIR=\"/usr/local/share/mesos\" -DPKGLIBEXECDIR=\"/usr/local/libexec/mesos\" -DUSE_CMAKE_BUILD_CONFIG -DUSE_STATIC_LIB -DVERSION=\"1.4.0\" -D__STDC_FORMAT_MACROS -Dmesos_protobufs_EXPORTS -O2 -std=c++11 -g -fPIC -I/mesos/build/include -I/mesos/build/include/mesos -I/mesos/build/src -I/mesos/src -isystem /mesos/build/3rdparty/protobuf-2.6.1/src/protobuf-2.6.1-lib/lib/include -isystem /mesos/3rdparty/libprocess/include -isystem /usr/include/apr-1.0 -isystem /mesos/build/3rdparty/boost-1.53.0/src/boost-1.53.0 -isystem /mesos/build/3rdparty/elfio-3.2/src/elfio-3.2 -isystem /mesos/build/3rdparty/glog-0.3.3/src/glog-0.3.3-lib/lib/include -isystem /mesos/build/3rdparty/nvml-352.79/src/nvml-352.79 -isystem /mesos/build/3rdparty/picojson-1.3.0/src/picojson-1.3.0 -isystem /usr/include/subversion-1 -isystem /mesos/3rdparty/stout/include -isystem /mesos/build/3rdparty/http_parser-2.6.2/src/http_parser-2.6.2 -isystem /mesos/build/3rdparty/libev-4.22/src/libev-4.22 -isystem /mesos/build/3rdparty/zookeeper-3.4.8/src/zookeeper-3.4.8/src/c/include -isystem /mesos/build/3rdparty/zookeeper-3.4.8/src/zookeeper-3.4.8/src/c/generated -isystem /mesos/build/3rdparty/leveldb-1.19/src/leveldb-1.19/include -I/mesos/include    -o CMakeFiles/mesos-protobufs.dir/__/include/mesos/v1/quota/quota.pb.cc.o -c /mesos/build/include/mesos/v1/quota/quota.pb.cc
/usr/bin/cmake -E cmake_progress_report /mesos/build/CMakeFiles 
[ 31%] Building CXX object 3rdparty/stout/tests/CMakeFiles/stout-tests.dir/os_tests.cpp.o
cd /mesos/build/3rdparty/stout/tests && /usr/bin/g++   -DBUILD_FLAGS=\"\" -DBUILD_JAVA_JVM_LIBRARY=\"\" -DHAS_AUTHENTICATION=1 -DLIBDIR=\"/usr/local/libmesos\" -DPICOJSON_USE_INT64 -DPKGDATADIR=\"/usr/local/share/mesos\" -DPKGLIBEXECDIR=\"/usr/local/libexec/mesos\" -DUSE_CMAKE_BUILD_CONFIG -DUSE_STATIC_LIB -DVERSION=\"1.4.0\" -D__STDC_FORMAT_MACROS -O2 -std=c++11 -g -fPIE -isystem /usr/include/apr-1.0 -isystem /mesos/build/3rdparty/boost-1.53.0/src/boost-1.53.0 -isystem /mesos/build/3rdparty/elfio-3.2/src/elfio-3.2 -isystem /mesos/build/3rdparty/glog-0.3.3/src/glog-0.3.3-lib/lib/include -isystem /mesos/build/3rdparty/nvml-352.79/src/nvml-352.79 -isystem /mesos/build/3rdparty/picojson-1.3.0/src/picojson-1.3.0 -isystem /mesos/build/3rdparty/protobuf-2.6.1/src/protobuf-2.6.1-lib/lib/include -isystem /usr/include/subversion-1 -isystem /mesos/build/3rdparty/gmock-1.7.0/src/gmock-1.7.0/include -isystem /mesos/build/3rdparty/gmock-1.7.0/src/gmock-1.7.0/gtest/include -I/mesos/3rdparty/stout/include    -o CMakeFiles/stout-tests.dir/os_tests.cpp.o -c /mesos/3rdparty/stout/tests/os_tests.cpp
/usr/bin/cmake -E cmake_progress_report /mesos/build/CMakeFiles 91
[ 32%] Building CXX object 3rdparty/stout/tests/CMakeFiles/stout-tests.dir/recordio_tests.cpp.o
cd /mesos/build/3rdparty/stout/tests && /usr/bin/g++   -DBUILD_FLAGS=\"\" -DBUILD_JAVA_JVM_LIBRARY=\"\" -DHAS_AUTHENTICATION=1 -DLIBDIR=\"/usr/local/libmesos\" -DPICOJSON_USE_INT64 -DPKGDATADIR=\"/usr/local/share/mesos\" -DPKGLIBEXECDIR=\"/usr/local/libexec/mesos\" -DUSE_CMAKE_BUILD_CONFIG -DUSE_STATIC_LIB -DVERSION=\"1.4.0\" -D__STDC_FORMAT_MACROS -O2 -std=c++11 -g -fPIE -isystem /usr/include/apr-1.0 -isystem /mesos/build/3rdparty/boost-1.53.0/src/boost-1.53.0 -isystem /mesos/build/3rdparty/elfio-3.2/src/elfio-3.2 -isystem /mesos/build/3rdparty/glog-0.3.3/src/glog-0.3.3-lib/lib/include -isystem /mesos/build/3rdparty/nvml-352.79/src/nvml-352.79 -isystem /mesos/build/3rdparty/picojson-1.3.0/src/picojson-1.3.0 -isystem /mesos/build/3rdparty/protobuf-2.6.1/src/protobuf-2.6.1-lib/lib/include -isystem /usr/include/subversion-1 -isystem /mesos/build/3rdparty/gmock-1.7.0/src/gmock-1.7.0/include -isystem /mesos/build/3rdparty/gmock-1.7.0/src/gmock-1.7.0/gtest/include -I/mesos/3rdparty/stout/include    -o CMakeFiles/stout-tests.dir/recordio_tests.cpp.o -c /mesos/3rdparty/stout/tests/recordio_tests.cpp
/usr/bin/cmake -E cmake_progress_report /mesos/build/CMakeFiles 
[ 32%] Building CXX object src/CMakeFiles/mesos-protobufs.dir/__/include/mesos/v1/scheduler/scheduler.pb.cc.o
cd /mesos/build/src && /usr/bin/g++   -DBUILD_FLAGS=\"\" -DBUILD_JAVA_JVM_LIBRARY=\"\" -DHAS_AUTHENTICATION=1 -DLIBDIR=\"/usr/local/libmesos\" -DPICOJSON_USE_INT64 -DPKGDATADIR=\"/usr/local/share/mesos\" -DPKGLIBEXECDIR=\"/usr/local/libexec/mesos\" -DUSE_CMAKE_BUILD_CONFIG -DUSE_STATIC_LIB -DVERSION=\"1.4.0\" -D__STDC_FORMAT_MACROS -Dmesos_protobufs_EXPORTS -O2 -std=c++11 -g -fPIC -I/mesos/build/include -I/mesos/build/include/mesos -I/mesos/build/src -I/mesos/src -isystem /mesos/build/3rdparty/protobuf-2.6.1/src/protobuf-2.6.1-lib/lib/include -isystem /mesos/3rdparty/libprocess/include -isystem /usr/include/apr-1.0 -isystem /mesos/build/3rdparty/boost-1.53.0/src/boost-1.53.0 -isystem /mesos/build/3rdparty/elfio-3.2/src/elfio-3.2 -isystem /mesos/build/3rdparty/glog-0.3.3/src/glog-0.3.3-lib/lib/include -isystem /mesos/build/3rdparty/nvml-352.79/src/nvml-352.79 -isystem /mesos/build/3rdparty/picojson-1.3.0/src/picojson-1.3.0 -isystem /usr/include/subversion-1 -isystem /mesos/3rdparty/stout/include -isystem /mesos/build/3rdparty/http_parser-2.6.2/src/http_parser-2.6.2 -isystem /mesos/build/3rdparty/libev-4.22/src/libev-4.22 -isystem /mesos/build/3rdparty/zookeeper-3.4.8/src/zookeeper-3.4.8/src/c/include -isystem /mesos/build/3rdparty/zookeeper-3.4.8/src/zookeeper-3.4.8/src/c/generated -isystem /mesos/build/3rdparty/leveldb-1.19/src/leveldb-1.19/include -I/mesos/include    -o CMakeFiles/mesos-protobufs.dir/__/include/mesos/v1/scheduler/scheduler.pb.cc.o -c /mesos/build/include/mesos/v1/scheduler/scheduler.pb.cc
/usr/bin/cmake -E cmake_progress_report /mesos/build/CMakeFiles 
[ 32%] Building CXX object 3rdparty/libprocess/src/CMakeFiles/process-0.0.1.dir/timeseries.cpp.o
cd /mesos/build/3rdparty/libprocess/src && /usr/bin/g++   -DBUILD_FLAGS=\"\" -DBUILD_JAVA_JVM_LIBRARY=\"\" -DHAS_AUTHENTICATION=1 -DLIBDIR=\"/usr/local/libmesos\" -DPICOJSON_USE_INT64 -DPKGDATADIR=\"/usr/local/share/mesos\" -DPKGLIBEXECDIR=\"/usr/local/libexec/mesos\" -DUSE_CMAKE_BUILD_CONFIG -DUSE_STATIC_LIB -DVERSION=\"1.4.0\" -D__STDC_FORMAT_MACROS -Dprocess_0_0_1_EXPORTS -O2 -std=c++11 -g -fPIC -isystem /usr/include/apr-1.0 -isystem /mesos/build/3rdparty/boost-1.53.0/src/boost-1.53.0 -isystem /mesos/build/3rdparty/elfio-3.2/src/elfio-3.2 -isystem /mesos/build/3rdparty/glog-0.3.3/src/glog-0.3.3-lib/lib/include -isystem /mesos/build/3rdparty/nvml-352.79/src/nvml-352.79 -isystem /mesos/build/3rdparty/picojson-1.3.0/src/picojson-1.3.0 -isystem /mesos/build/3rdparty/protobuf-2.6.1/src/protobuf-2.6.1-lib/lib/include -isystem /usr/include/subversion-1 -isystem /mesos/3rdparty/stout/include -isystem /mesos/build/3rdparty/http_parser-2.6.2/src/http_parser-2.6.2 -isystem /mesos/build/3rdparty/libev-4.22/src/libev-4.22 -I/mesos/3rdparty/libprocess/include    -o CMakeFiles/process-0.0.1.dir/timeseries.cpp.o -c /mesos/3rdparty/libprocess/src/timeseries.cpp
/usr/bin/cmake -E cmake_progress_report /mesos/build/CMakeFiles 
[ 32%] Building CXX object 3rdparty/stout/tests/CMakeFiles/stout-tests.dir/result_tests.cpp.o
cd /mesos/build/3rdparty/stout/tests && /usr/bin/g++   -DBUILD_FLAGS=\"\" -DBUILD_JAVA_JVM_LIBRARY=\"\" -DHAS_AUTHENTICATION=1 -DLIBDIR=\"/usr/local/libmesos\" -DPICOJSON_USE_INT64 -DPKGDATADIR=\"/usr/local/share/mesos\" -DPKGLIBEXECDIR=\"/usr/local/libexec/mesos\" -DUSE_CMAKE_BUILD_CONFIG -DUSE_STATIC_LIB -DVERSION=\"1.4.0\" -D__STDC_FORMAT_MACROS -O2 -std=c++11 -g -fPIE -isystem /usr/include/apr-1.0 -isystem /mesos/build/3rdparty/boost-1.53.0/src/boost-1.53.0 -isystem /mesos/build/3rdparty/elfio-3.2/src/elfio-3.2 -isystem /mesos/build/3rdparty/glog-0.3.3/src/glog-0.3.3-lib/lib/include -isystem /mesos/build/3rdparty/nvml-352.79/src/nvml-352.79 -isystem /mesos/build/3rdparty/picojson-1.3.0/src/picojson-1.3.0 -isystem /mesos/build/3rdparty/protobuf-2.6.1/src/protobuf-2.6.1-lib/lib/include -isystem /usr/include/subversion-1 -isystem /mesos/build/3rdparty/gmock-1.7.0/src/gmock-1.7.0/include -isystem /mesos/build/3rdparty/gmock-1.7.0/src/gmock-1.7.0/gtest/include -I/mesos/3rdparty/stout/include    -o CMakeFiles/stout-tests.dir/result_tests.cpp.o -c /mesos/3rdparty/stout/tests/result_tests.cpp
/usr/bin/cmake -E cmake_progress_report /mesos/build/CMakeFiles 
[ 32%] Building CXX object src/CMakeFiles/mesos-protobufs.dir/messages/flags.pb.cc.o
cd /mesos/build/src && /usr/bin/g++   -DBUILD_FLAGS=\"\" -DBUILD_JAVA_JVM_LIBRARY=\"\" -DHAS_AUTHENTICATION=1 -DLIBDIR=\"/usr/local/libmesos\" -DPICOJSON_USE_INT64 -DPKGDATADIR=\"/usr/local/share/mesos\" -DPKGLIBEXECDIR=\"/usr/local/libexec/mesos\" -DUSE_CMAKE_BUILD_CONFIG -DUSE_STATIC_LIB -DVERSION=\"1.4.0\" -D__STDC_FORMAT_MACROS -Dmesos_protobufs_EXPORTS -O2 -std=c++11 -g -fPIC -I/mesos/build/include -I/mesos/build/include/mesos -I/mesos/build/src -I/mesos/src -isystem /mesos/build/3rdparty/protobuf-2.6.1/src/protobuf-2.6.1-lib/lib/include -isystem /mesos/3rdparty/libprocess/include -isystem /usr/include/apr-1.0 -isystem /mesos/build/3rdparty/boost-1.53.0/src/boost-1.53.0 -isystem /mesos/build/3rdparty/elfio-3.2/src/elfio-3.2 -isystem /mesos/build/3rdparty/glog-0.3.3/src/glog-0.3.3-lib/lib/include -isystem /mesos/build/3rdparty/nvml-352.79/src/nvml-352.79 -isystem /mesos/build/3rdparty/picojson-1.3.0/src/picojson-1.3.0 -isystem /usr/include/subversion-1 -isystem /mesos/3rdparty/stout/include -isystem /mesos/build/3rdparty/http_parser-2.6.2/src/http_parser-2.6.2 -isystem /mesos/build/3rdparty/libev-4.22/src/libev-4.22 -isystem /mesos/build/3rdparty/zookeeper-3.4.8/src/zookeeper-3.4.8/src/c/include -isystem /mesos/build/3rdparty/zookeeper-3.4.8/src/zookeeper-3.4.8/src/c/generated -isystem /mesos/build/3rdparty/leveldb-1.19/src/leveldb-1.19/include -I/mesos/include    -o CMakeFiles/mesos-protobufs.dir/messages/flags.pb.cc.o -c /mesos/build/src/messages/flags.pb.cc
/usr/bin/cmake -E cmake_progress_report /mesos/build/CMakeFiles 
[ 32%] Building CXX object 3rdparty/libprocess/src/CMakeFiles/process-0.0.1.dir/libev.cpp.o
cd /mesos/build/3rdparty/libprocess/src && /usr/bin/g++   -DBUILD_FLAGS=\"\" -DBUILD_JAVA_JVM_LIBRARY=\"\" -DHAS_AUTHENTICATION=1 -DLIBDIR=\"/usr/local/libmesos\" -DPICOJSON_USE_INT64 -DPKGDATADIR=\"/usr/local/share/mesos\" -DPKGLIBEXECDIR=\"/usr/local/libexec/mesos\" -DUSE_CMAKE_BUILD_CONFIG -DUSE_STATIC_LIB -DVERSION=\"1.4.0\" -D__STDC_FORMAT_MACROS -Dprocess_0_0_1_EXPORTS -O2 -std=c++11 -g -fPIC -isystem /usr/include/apr-1.0 -isystem /mesos/build/3rdparty/boost-1.53.0/src/boost-1.53.0 -isystem /mesos/build/3rdparty/elfio-3.2/src/elfio-3.2 -isystem /mesos/build/3rdparty/glog-0.3.3/src/glog-0.3.3-lib/lib/include -isystem /mesos/build/3rdparty/nvml-352.79/src/nvml-352.79 -isystem /mesos/build/3rdparty/picojson-1.3.0/src/picojson-1.3.0 -isystem /mesos/build/3rdparty/protobuf-2.6.1/src/protobuf-2.6.1-lib/lib/include -isystem /usr/include/subversion-1 -isystem /mesos/3rdparty/stout/include -isystem /mesos/build/3rdparty/http_parser-2.6.2/src/http_parser-2.6.2 -isystem /mesos/build/3rdparty/libev-4.22/src/libev-4.22 -I/mesos/3rdparty/libprocess/include    -o CMakeFiles/process-0.0.1.dir/libev.cpp.o -c /mesos/3rdparty/libprocess/src/libev.cpp
/usr/bin/cmake -E cmake_progress_report /mesos/build/CMakeFiles 86
[ 33%] Building CXX object 3rdparty/libprocess/src/CMakeFiles/process-0.0.1.dir/libev_poll.cpp.o
cd /mesos/build/3rdparty/libprocess/src && /usr/bin/g++   -DBUILD_FLAGS=\"\" -DBUILD_JAVA_JVM_LIBRARY=\"\" -DHAS_AUTHENTICATION=1 -DLIBDIR=\"/usr/local/libmesos\" -DPICOJSON_USE_INT64 -DPKGDATADIR=\"/usr/local/share/mesos\" -DPKGLIBEXECDIR=\"/usr/local/libexec/mesos\" -DUSE_CMAKE_BUILD_CONFIG -DUSE_STATIC_LIB -DVERSION=\"1.4.0\" -D__STDC_FORMAT_MACROS -Dprocess_0_0_1_EXPORTS -O2 -std=c++11 -g -fPIC -isystem /usr/include/apr-1.0 -isystem /mesos/build/3rdparty/boost-1.53.0/src/boost-1.53.0 -isystem /mesos/build/3rdparty/elfio-3.2/src/elfio-3.2 -isystem /mesos/build/3rdparty/glog-0.3.3/src/glog-0.3.3-lib/lib/include -isystem /mesos/build/3rdparty/nvml-352.79/src/nvml-352.79 -isystem /mesos/build/3rdparty/picojson-1.3.0/src/picojson-1.3.0 -isystem /mesos/build/3rdparty/protobuf-2.6.1/src/protobuf-2.6.1-lib/lib/include -isystem /usr/include/subversion-1 -isystem /mesos/3rdparty/stout/include -isystem /mesos/build/3rdparty/http_parser-2.6.2/src/http_parser-2.6.2 -isystem /mesos/build/3rdparty/libev-4.22/src/libev-4.22 -I/mesos/3rdparty/libprocess/include    -o CMakeFiles/process-0.0.1.dir/libev_poll.cpp.o -c /mesos/3rdparty/libprocess/src/libev_poll.cpp
/usr/bin/cmake -E cmake_progress_report /mesos/build/CMakeFiles 
[ 33%] Building CXX object src/CMakeFiles/mesos-protobufs.dir/messages/log.pb.cc.o
cd /mesos/build/src && /usr/bin/g++   -DBUILD_FLAGS=\"\" -DBUILD_JAVA_JVM_LIBRARY=\"\" -DHAS_AUTHENTICATION=1 -DLIBDIR=\"/usr/local/libmesos\" -DPICOJSON_USE_INT64 -DPKGDATADIR=\"/usr/local/share/mesos\" -DPKGLIBEXECDIR=\"/usr/local/libexec/mesos\" -DUSE_CMAKE_BUILD_CONFIG -DUSE_STATIC_LIB -DVERSION=\"1.4.0\" -D__STDC_FORMAT_MACROS -Dmesos_protobufs_EXPORTS -O2 -std=c++11 -g -fPIC -I/mesos/build/include -I/mesos/build/include/mesos -I/mesos/build/src -I/mesos/src -isystem /mesos/build/3rdparty/protobuf-2.6.1/src/protobuf-2.6.1-lib/lib/include -isystem /mesos/3rdparty/libprocess/include -isystem /usr/include/apr-1.0 -isystem /mesos/build/3rdparty/boost-1.53.0/src/boost-1.53.0 -isystem /mesos/build/3rdparty/elfio-3.2/src/elfio-3.2 -isystem /mesos/build/3rdparty/glog-0.3.3/src/glog-0.3.3-lib/lib/include -isystem /mesos/build/3rdparty/nvml-352.79/src/nvml-352.79 -isystem /mesos/build/3rdparty/picojson-1.3.0/src/picojson-1.3.0 -isystem /usr/include/subversion-1 -isystem /mesos/3rdparty/stout/include -isystem /mesos/build/3rdparty/http_parser-2.6.2/src/http_parser-2.6.2 -isystem /mesos/build/3rdparty/libev-4.22/src/libev-4.22 -isystem /mesos/build/3rdparty/zookeeper-3.4.8/src/zookeeper-3.4.8/src/c/include -isystem /mesos/build/3rdparty/zookeeper-3.4.8/src/zookeeper-3.4.8/src/c/generated -isystem /mesos/build/3rdparty/leveldb-1.19/src/leveldb-1.19/include -I/mesos/include    -o CMakeFiles/mesos-protobufs.dir/messages/log.pb.cc.o -c /mesos/build/src/messages/log.pb.cc
/usr/bin/cmake -E cmake_progress_report /mesos/build/CMakeFiles 
[ 33%] Building CXX object 3rdparty/stout/tests/CMakeFiles/stout-tests.dir/some_tests.cpp.o
cd /mesos/build/3rdparty/stout/tests && /usr/bin/g++   -DBUILD_FLAGS=\"\" -DBUILD_JAVA_JVM_LIBRARY=\"\" -DHAS_AUTHENTICATION=1 -DLIBDIR=\"/usr/local/libmesos\" -DPICOJSON_USE_INT64 -DPKGDATADIR=\"/usr/local/share/mesos\" -DPKGLIBEXECDIR=\"/usr/local/libexec/mesos\" -DUSE_CMAKE_BUILD_CONFIG -DUSE_STATIC_LIB -DVERSION=\"1.4.0\" -D__STDC_FORMAT_MACROS -O2 -std=c++11 -g -fPIE -isystem /usr/include/apr-1.0 -isystem /mesos/build/3rdparty/boost-1.53.0/src/boost-1.53.0 -isystem /mesos/build/3rdparty/elfio-3.2/src/elfio-3.2 -isystem /mesos/build/3rdparty/glog-0.3.3/src/glog-0.3.3-lib/lib/include -isystem /mesos/build/3rdparty/nvml-352.79/src/nvml-352.79 -isystem /mesos/build/3rdparty/picojson-1.3.0/src/picojson-1.3.0 -isystem /mesos/build/3rdparty/protobuf-2.6.1/src/protobuf-2.6.1-lib/lib/include -isystem /usr/include/subversion-1 -isystem /mesos/build/3rdparty/gmock-1.7.0/src/gmock-1.7.0/include -isystem /mesos/build/3rdparty/gmock-1.7.0/src/gmock-1.7.0/gtest/include -I/mesos/3rdparty/stout/include    -o CMakeFiles/stout-tests.dir/some_tests.cpp.o -c /mesos/3rdparty/stout/tests/some_tests.cpp
/usr/bin/cmake -E cmake_progress_report /mesos/build/CMakeFiles 
[ 33%] Building CXX object 3rdparty/stout/tests/CMakeFiles/stout-tests.dir/strings_tests.cpp.o
cd /mesos/build/3rdparty/stout/tests && /usr/bin/g++   -DBUILD_FLAGS=\"\" -DBUILD_JAVA_JVM_LIBRARY=\"\" -DHAS_AUTHENTICATION=1 -DLIBDIR=\"/usr/local/libmesos\" -DPICOJSON_USE_INT64 -DPKGDATADIR=\"/usr/local/share/mesos\" -DPKGLIBEXECDIR=\"/usr/local/libexec/mesos\" -DUSE_CMAKE_BUILD_CONFIG -DUSE_STATIC_LIB -DVERSION=\"1.4.0\" -D__STDC_FORMAT_MACROS -O2 -std=c++11 -g -fPIE -isystem /usr/include/apr-1.0 -isystem /mesos/build/3rdparty/boost-1.53.0/src/boost-1.53.0 -isystem /mesos/build/3rdparty/elfio-3.2/src/elfio-3.2 -isystem /mesos/build/3rdparty/glog-0.3.3/src/glog-0.3.3-lib/lib/include -isystem /mesos/build/3rdparty/nvml-352.79/src/nvml-352.79 -isystem /mesos/build/3rdparty/picojson-1.3.0/src/picojson-1.3.0 -isystem /mesos/build/3rdparty/protobuf-2.6.1/src/protobuf-2.6.1-lib/lib/include -isystem /usr/include/subversion-1 -isystem /mesos/build/3rdparty/gmock-1.7.0/src/gmock-1.7.0/include -isystem /mesos/build/3rdparty/gmock-1.7.0/src/gmock-1.7.0/gtest/include -I/mesos/3rdparty/stout/include    -o CMakeFiles/stout-tests.dir/strings_tests.cpp.o -c /mesos/3rdparty/stout/tests/strings_tests.cpp
/usr/bin/cmake -E cmake_progress_report /mesos/build/CMakeFiles 
[ 33%] Building CXX object src/CMakeFiles/mesos-protobufs.dir/messages/messages.pb.cc.o
cd /mesos/build/src && /usr/bin/g++   -DBUILD_FLAGS=\"\" -DBUILD_JAVA_JVM_LIBRARY=\"\" -DHAS_AUTHENTICATION=1 -DLIBDIR=\"/usr/local/libmesos\" -DPICOJSON_USE_INT64 -DPKGDATADIR=\"/usr/local/share/mesos\" -DPKGLIBEXECDIR=\"/usr/local/libexec/mesos\" -DUSE_CMAKE_BUILD_CONFIG -DUSE_STATIC_LIB -DVERSION=\"1.4.0\" -D__STDC_FORMAT_MACROS -Dmesos_protobufs_EXPORTS -O2 -std=c++11 -g -fPIC -I/mesos/build/include -I/mesos/build/include/mesos -I/mesos/build/src -I/mesos/src -isystem /mesos/build/3rdparty/protobuf-2.6.1/src/protobuf-2.6.1-lib/lib/include -isystem /mesos/3rdparty/libprocess/include -isystem /usr/include/apr-1.0 -isystem /mesos/build/3rdparty/boost-1.53.0/src/boost-1.53.0 -isystem /mesos/build/3rdparty/elfio-3.2/src/elfio-3.2 -isystem /mesos/build/3rdparty/glog-0.3.3/src/glog-0.3.3-lib/lib/include -isystem /mesos/build/3rdparty/nvml-352.79/src/nvml-352.79 -isystem /mesos/build/3rdparty/picojson-1.3.0/src/picojson-1.3.0 -isystem /usr/include/subversion-1 -isystem /mesos/3rdparty/stout/include -isystem /mesos/build/3rdparty/http_parser-2.6.2/src/http_parser-2.6.2 -isystem /mesos/build/3rdparty/libev-4.22/src/libev-4.22 -isystem /mesos/build/3rdparty/zookeeper-3.4.8/src/zookeeper-3.4.8/src/c/include -isystem /mesos/build/3rdparty/zookeeper-3.4.8/src/zookeeper-3.4.8/src/c/generated -isystem /mesos/build/3rdparty/leveldb-1.19/src/leveldb-1.19/include -I/mesos/include    -o CMakeFiles/mesos-protobufs.dir/messages/messages.pb.cc.o -c /mesos/build/src/messages/messages.pb.cc
In file included from /mesos/build/src/messages/messages.pb.cc:5:0:
/mesos/build/src/messages/messages.pb.h:29:58: fatal error: mesos/resource_provider/resource_provider.pb.h: No such file or directory
 #include "mesos/resource_provider/resource_provider.pb.h"
                                                          ^
compilation terminated.
make[3]: *** [src/CMakeFiles/mesos-protobufs.dir/messages/messages.pb.cc.o] Error 1
make[3]: *** Waiting for unfinished jobs....
/usr/bin/cmake -E cmake_progress_report /mesos/build/CMakeFiles 
[ 33%] Building CXX object 3rdparty/stout/tests/CMakeFiles/stout-tests.dir/subcommand_tests.cpp.o
cd /mesos/build/3rdparty/stout/tests && /usr/bin/g++   -DBUILD_FLAGS=\"\" -DBUILD_JAVA_JVM_LIBRARY=\"\" -DHAS_AUTHENTICATION=1 -DLIBDIR=\"/usr/local/libmesos\" -DPICOJSON_USE_INT64 -DPKGDATADIR=\"/usr/local/share/mesos\" -DPKGLIBEXECDIR=\"/usr/local/libexec/mesos\" -DUSE_CMAKE_BUILD_CONFIG -DUSE_STATIC_LIB -DVERSION=\"1.4.0\" -D__STDC_FORMAT_MACROS -O2 -std=c++11 -g -fPIE -isystem /usr/include/apr-1.0 -isystem /mesos/build/3rdparty/boost-1.53.0/src/boost-1.53.0 -isystem /mesos/build/3rdparty/elfio-3.2/src/elfio-3.2 -isystem /mesos/build/3rdparty/glog-0.3.3/src/glog-0.3.3-lib/lib/include -isystem /mesos/build/3rdparty/nvml-352.79/src/nvml-352.79 -isystem /mesos/build/3rdparty/picojson-1.3.0/src/picojson-1.3.0 -isystem /mesos/build/3rdparty/protobuf-2.6.1/src/protobuf-2.6.1-lib/lib/include -isystem /usr/include/subversion-1 -isystem /mesos/build/3rdparty/gmock-1.7.0/src/gmock-1.7.0/include -isystem /mesos/build/3rdparty/gmock-1.7.0/src/gmock-1.7.0/gtest/include -I/mesos/3rdparty/stout/include    -o CMakeFiles/stout-tests.dir/subcommand_tests.cpp.o -c /mesos/3rdparty/stout/tests/subcommand_tests.cpp
/usr/bin/cmake -E cmake_progress_report /mesos/build/CMakeFiles 
[ 33%] Building CXX object 3rdparty/stout/tests/CMakeFiles/stout-tests.dir/try_tests.cpp.o
cd /mesos/build/3rdparty/stout/tests && /usr/bin/g++   -DBUILD_FLAGS=\"\" -DBUILD_JAVA_JVM_LIBRARY=\"\" -DHAS_AUTHENTICATION=1 -DLIBDIR=\"/usr/local/libmesos\" -DPICOJSON_USE_INT64 -DPKGDATADIR=\"/usr/local/share/mesos\" -DPKGLIBEXECDIR=\"/usr/local/libexec/mesos\" -DUSE_CMAKE_BUILD_CONFIG -DUSE_STATIC_LIB -DVERSION=\"1.4.0\" -D__STDC_FORMAT_MACROS -O2 -std=c++11 -g -fPIE -isystem /usr/include/apr-1.0 -isystem /mesos/build/3rdparty/boost-1.53.0/src/boost-1.53.0 -isystem /mesos/build/3rdparty/elfio-3.2/src/elfio-3.2 -isystem /mesos/build/3rdparty/glog-0.3.3/src/glog-0.3.3-lib/lib/include -isystem /mesos/build/3rdparty/nvml-352.79/src/nvml-352.79 -isystem /mesos/build/3rdparty/picojson-1.3.0/src/picojson-1.3.0 -isystem /mesos/build/3rdparty/protobuf-2.6.1/src/protobuf-2.6.1-lib/lib/include -isystem /usr/include/subversion-1 -isystem /mesos/build/3rdparty/gmock-1.7.0/src/gmock-1.7.0/include -isystem /mesos/build/3rdparty/gmock-1.7.0/src/gmock-1.7.0/gtest/include -I/mesos/3rdparty/stout/include    -o CMakeFiles/stout-tests.dir/try_tests.cpp.o -c /mesos/3rdparty/stout/tests/try_tests.cpp
/usr/bin/cmake -E cmake_progress_report /mesos/build/CMakeFiles 92
[ 34%] Building CXX object 3rdparty/stout/tests/CMakeFiles/stout-tests.dir/uuid_tests.cpp.o
cd /mesos/build/3rdparty/stout/tests && /usr/bin/g++   -DBUILD_FLAGS=\"\" -DBUILD_JAVA_JVM_LIBRARY=\"\" -DHAS_AUTHENTICATION=1 -DLIBDIR=\"/usr/local/libmesos\" -DPICOJSON_USE_INT64 -DPKGDATADIR=\"/usr/local/share/mesos\" -DPKGLIBEXECDIR=\"/usr/local/libexec/mesos\" -DUSE_CMAKE_BUILD_CONFIG -DUSE_STATIC_LIB -DVERSION=\"1.4.0\" -D__STDC_FORMAT_MACROS -O2 -std=c++11 -g -fPIE -isystem /usr/include/apr-1.0 -isystem /mesos/build/3rdparty/boost-1.53.0/src/boost-1.53.0 -isystem /mesos/build/3rdparty/elfio-3.2/src/elfio-3.2 -isystem /mesos/build/3rdparty/glog-0.3.3/src/glog-0.3.3-lib/lib/include -isystem /mesos/build/3rdparty/nvml-352.79/src/nvml-352.79 -isystem /mesos/build/3rdparty/picojson-1.3.0/src/picojson-1.3.0 -isystem /mesos/build/3rdparty/protobuf-2.6.1/src/protobuf-2.6.1-lib/lib/include -isystem /usr/include/subversion-1 -isystem /mesos/build/3rdparty/gmock-1.7.0/src/gmock-1.7.0/include -isystem /mesos/build/3rdparty/gmock-1.7.0/src/gmock-1.7.0/gtest/include -I/mesos/3rdparty/stout/include    -o CMakeFiles/stout-tests.dir/uuid_tests.cpp.o -c /mesos/3rdparty/stout/tests/uuid_tests.cpp
/usr/bin/cmake -E cmake_progress_report /mesos/build/CMakeFiles 
[ 34%] Building CXX object 3rdparty/stout/tests/CMakeFiles/stout-tests.dir/version_tests.cpp.o
cd /mesos/build/3rdparty/stout/tests && /usr/bin/g++   -DBUILD_FLAGS=\"\" -DBUILD_JAVA_JVM_LIBRARY=\"\" -DHAS_AUTHENTICATION=1 -DLIBDIR=\"/usr/local/libmesos\" -DPICOJSON_USE_INT64 -DPKGDATADIR=\"/usr/local/share/mesos\" -DPKGLIBEXECDIR=\"/usr/local/libexec/mesos\" -DUSE_CMAKE_BUILD_CONFIG -DUSE_STATIC_LIB -DVERSION=\"1.4.0\" -D__STDC_FORMAT_MACROS -O2 -std=c++11 -g -fPIE -isystem /usr/include/apr-1.0 -isystem /mesos/build/3rdparty/boost-1.53.0/src/boost-1.53.0 -isystem /mesos/build/3rdparty/elfio-3.2/src/elfio-3.2 -isystem /mesos/build/3rdparty/glog-0.3.3/src/glog-0.3.3-lib/lib/include -isystem /mesos/build/3rdparty/nvml-352.79/src/nvml-352.79 -isystem /mesos/build/3rdparty/picojson-1.3.0/src/picojson-1.3.0 -isystem /mesos/build/3rdparty/protobuf-2.6.1/src/protobuf-2.6.1-lib/lib/include -isystem /usr/include/subversion-1 -isystem /mesos/build/3rdparty/gmock-1.7.0/src/gmock-1.7.0/include -isystem /mesos/build/3rdparty/gmock-1.7.0/src/gmock-1.7.0/gtest/include -I/mesos/3rdparty/stout/include    -o CMakeFiles/stout-tests.dir/version_tests.cpp.o -c /mesos/3rdparty/stout/tests/version_tests.cpp
/usr/bin/cmake -E cmake_progress_report /mesos/build/CMakeFiles 
[ 34%] Building CXX object 3rdparty/stout/tests/CMakeFiles/stout-tests.dir/path_tests.cpp.o
cd /mesos/build/3rdparty/stout/tests && /usr/bin/g++   -DBUILD_FLAGS=\"\" -DBUILD_JAVA_JVM_LIBRARY=\"\" -DHAS_AUTHENTICATION=1 -DLIBDIR=\"/usr/local/libmesos\" -DPICOJSON_USE_INT64 -DPKGDATADIR=\"/usr/local/share/mesos\" -DPKGLIBEXECDIR=\"/usr/local/libexec/mesos\" -DUSE_CMAKE_BUILD_CONFIG -DUSE_STATIC_LIB -DVERSION=\"1.4.0\" -D__STDC_FORMAT_MACROS -O2 -std=c++11 -g -fPIE -isystem /usr/include/apr-1.0 -isystem /mesos/build/3rdparty/boost-1.53.0/src/boost-1.53.0 -isystem /mesos/build/3rdparty/elfio-3.2/src/elfio-3.2 -isystem /mesos/build/3rdparty/glog-0.3.3/src/glog-0.3.3-lib/lib/include -isystem /mesos/build/3rdparty/nvml-352.79/src/nvml-352.79 -isystem /mesos/build/3rdparty/picojson-1.3.0/src/picojson-1.3.0 -isystem /mesos/build/3rdparty/protobuf-2.6.1/src/protobuf-2.6.1-lib/lib/include -isystem /usr/include/subversion-1 -isystem /mesos/build/3rdparty/gmock-1.7.0/src/gmock-1.7.0/include -isystem /mesos/build/3rdparty/gmock-1.7.0/src/gmock-1.7.0/gtest/include -I/mesos/3rdparty/stout/include    -o CMakeFiles/stout-tests.dir/path_tests.cpp.o -c /mesos/3rdparty/stout/tests/path_tests.cpp
/usr/bin/cmake -E cmake_progress_report /mesos/build/CMakeFiles 
[ 34%] Building CXX object 3rdparty/stout/tests/CMakeFiles/stout-tests.dir/protobuf_tests.cpp.o
cd /mesos/build/3rdparty/stout/tests && /usr/bin/g++   -DBUILD_FLAGS=\"\" -DBUILD_JAVA_JVM_LIBRARY=\"\" -DHAS_AUTHENTICATION=1 -DLIBDIR=\"/usr/local/libmesos\" -DPICOJSON_USE_INT64 -DPKGDATADIR=\"/usr/local/share/mesos\" -DPKGLIBEXECDIR=\"/usr/local/libexec/mesos\" -DUSE_CMAKE_BUILD_CONFIG -DUSE_STATIC_LIB -DVERSION=\"1.4.0\" -D__STDC_FORMAT_MACROS -O2 -std=c++11 -g -fPIE -isystem /usr/include/apr-1.0 -isystem /mesos/build/3rdparty/boost-1.53.0/src/boost-1.53.0 -isystem /mesos/build/3rdparty/elfio-3.2/src/elfio-3.2 -isystem /mesos/build/3rdparty/glog-0.3.3/src/glog-0.3.3-lib/lib/include -isystem /mesos/build/3rdparty/nvml-352.79/src/nvml-352.79 -isystem /mesos/build/3rdparty/picojson-1.3.0/src/picojson-1.3.0 -isystem /mesos/build/3rdparty/protobuf-2.6.1/src/protobuf-2.6.1-lib/lib/include -isystem /usr/include/subversion-1 -isystem /mesos/build/3rdparty/gmock-1.7.0/src/gmock-1.7.0/include -isystem /mesos/build/3rdparty/gmock-1.7.0/src/gmock-1.7.0/gtest/include -I/mesos/3rdparty/stout/include    -o CMakeFiles/stout-tests.dir/protobuf_tests.cpp.o -c /mesos/3rdparty/stout/tests/protobuf_tests.cpp
/usr/bin/cmake -E cmake_progress_report /mesos/build/CMakeFiles 
[ 34%] Building CXX object 3rdparty/stout/tests/CMakeFiles/stout-tests.dir/protobuf_tests.pb.cc.o
cd /mesos/build/3rdparty/stout/tests && /usr/bin/g++   -DBUILD_FLAGS=\"\" -DBUILD_JAVA_JVM_LIBRARY=\"\" -DHAS_AUTHENTICATION=1 -DLIBDIR=\"/usr/local/libmesos\" -DPICOJSON_USE_INT64 -DPKGDATADIR=\"/usr/local/share/mesos\" -DPKGLIBEXECDIR=\"/usr/local/libexec/mesos\" -DUSE_CMAKE_BUILD_CONFIG -DUSE_STATIC_LIB -DVERSION=\"1.4.0\" -D__STDC_FORMAT_MACROS -O2 -std=c++11 -g -fPIE -isystem /usr/include/apr-1.0 -isystem /mesos/build/3rdparty/boost-1.53.0/src/boost-1.53.0 -isystem /mesos/build/3rdparty/elfio-3.2/src/elfio-3.2 -isystem /mesos/build/3rdparty/glog-0.3.3/src/glog-0.3.3-lib/lib/include -isystem /mesos/build/3rdparty/nvml-352.79/src/nvml-352.79 -isystem /mesos/build/3rdparty/picojson-1.3.0/src/picojson-1.3.0 -isystem /mesos/build/3rdparty/protobuf-2.6.1/src/protobuf-2.6.1-lib/lib/include -isystem /usr/include/subversion-1 -isystem /mesos/build/3rdparty/gmock-1.7.0/src/gmock-1.7.0/include -isystem /mesos/build/3rdparty/gmock-1.7.0/src/gmock-1.7.0/gtest/include -I/mesos/3rdparty/stout/include    -o CMakeFiles/stout-tests.dir/protobuf_tests.pb.cc.o -c /mesos/3rdparty/stout/tests/protobuf_tests.pb.cc
/usr/bin/cmake -E cmake_progress_report /mesos/build/CMakeFiles 
[ 34%] Building CXX object 3rdparty/stout/tests/CMakeFiles/stout-tests.dir/svn_tests.cpp.o
cd /mesos/build/3rdparty/stout/tests && /usr/bin/g++   -DBUILD_FLAGS=\"\" -DBUILD_JAVA_JVM_LIBRARY=\"\" -DHAS_AUTHENTICATION=1 -DLIBDIR=\"/usr/local/libmesos\" -DPICOJSON_USE_INT64 -DPKGDATADIR=\"/usr/local/share/mesos\" -DPKGLIBEXECDIR=\"/usr/local/libexec/mesos\" -DUSE_CMAKE_BUILD_CONFIG -DUSE_STATIC_LIB -DVERSION=\"1.4.0\" -D__STDC_FORMAT_MACROS -O2 -std=c++11 -g -fPIE -isystem /usr/include/apr-1.0 -isystem /mesos/build/3rdparty/boost-1.53.0/src/boost-1.53.0 -isystem /mesos/build/3rdparty/elfio-3.2/src/elfio-3.2 -isystem /mesos/build/3rdparty/glog-0.3.3/src/glog-0.3.3-lib/lib/include -isystem /mesos/build/3rdparty/nvml-352.79/src/nvml-352.79 -isystem /mesos/build/3rdparty/picojson-1.3.0/src/picojson-1.3.0 -isystem /mesos/build/3rdparty/protobuf-2.6.1/src/protobuf-2.6.1-lib/lib/include -isystem /usr/include/subversion-1 -isystem /mesos/build/3rdparty/gmock-1.7.0/src/gmock-1.7.0/include -isystem /mesos/build/3rdparty/gmock-1.7.0/src/gmock-1.7.0/gtest/include -I/mesos/3rdparty/stout/include    -o CMakeFiles/stout-tests.dir/svn_tests.cpp.o -c /mesos/3rdparty/stout/tests/svn_tests.cpp
/usr/bin/cmake -E cmake_progress_report /mesos/build/CMakeFiles 93
[ 35%] Building CXX object 3rdparty/stout/tests/CMakeFiles/stout-tests.dir/proc_tests.cpp.o
cd /mesos/build/3rdparty/stout/tests && /usr/bin/g++   -DBUILD_FLAGS=\"\" -DBUILD_JAVA_JVM_LIBRARY=\"\" -DHAS_AUTHENTICATION=1 -DLIBDIR=\"/usr/local/libmesos\" -DPICOJSON_USE_INT64 -DPKGDATADIR=\"/usr/local/share/mesos\" -DPKGLIBEXECDIR=\"/usr/local/libexec/mesos\" -DUSE_CMAKE_BUILD_CONFIG -DUSE_STATIC_LIB -DVERSION=\"1.4.0\" -D__STDC_FORMAT_MACROS -O2 -std=c++11 -g -fPIE -isystem /usr/include/apr-1.0 -isystem /mesos/build/3rdparty/boost-1.53.0/src/boost-1.53.0 -isystem /mesos/build/3rdparty/elfio-3.2/src/elfio-3.2 -isystem /mesos/build/3rdparty/glog-0.3.3/src/glog-0.3.3-lib/lib/include -isystem /mesos/build/3rdparty/nvml-352.79/src/nvml-352.79 -isystem /mesos/build/3rdparty/picojson-1.3.0/src/picojson-1.3.0 -isystem /mesos/build/3rdparty/protobuf-2.6.1/src/protobuf-2.6.1-lib/lib/include -isystem /usr/include/subversion-1 -isystem /mesos/build/3rdparty/gmock-1.7.0/src/gmock-1.7.0/include -isystem /mesos/build/3rdparty/gmock-1.7.0/src/gmock-1.7.0/gtest/include -I/mesos/3rdparty/stout/include    -o CMakeFiles/stout-tests.dir/proc_tests.cpp.o -c /mesos/3rdparty/stout/tests/proc_tests.cpp
/usr/bin/cmake -E cmake_progress_report /mesos/build/CMakeFiles 
[ 35%] Building CXX object 3rdparty/stout/tests/CMakeFiles/stout-tests.dir/os/env_tests.cpp.o
cd /mesos/build/3rdparty/stout/tests && /usr/bin/g++   -DBUILD_FLAGS=\"\" -DBUILD_JAVA_JVM_LIBRARY=\"\" -DHAS_AUTHENTICATION=1 -DLIBDIR=\"/usr/local/libmesos\" -DPICOJSON_USE_INT64 -DPKGDATADIR=\"/usr/local/share/mesos\" -DPKGLIBEXECDIR=\"/usr/local/libexec/mesos\" -DUSE_CMAKE_BUILD_CONFIG -DUSE_STATIC_LIB -DVERSION=\"1.4.0\" -D__STDC_FORMAT_MACROS -O2 -std=c++11 -g -fPIE -isystem /usr/include/apr-1.0 -isystem /mesos/build/3rdparty/boost-1.53.0/src/boost-1.53.0 -isystem /mesos/build/3rdparty/elfio-3.2/src/elfio-3.2 -isystem /mesos/build/3rdparty/glog-0.3.3/src/glog-0.3.3-lib/lib/include -isystem /mesos/build/3rdparty/nvml-352.79/src/nvml-352.79 -isystem /mesos/build/3rdparty/picojson-1.3.0/src/picojson-1.3.0 -isystem /mesos/build/3rdparty/protobuf-2.6.1/src/protobuf-2.6.1-lib/lib/include -isystem /usr/include/subversion-1 -isystem /mesos/build/3rdparty/gmock-1.7.0/src/gmock-1.7.0/include -isystem /mesos/build/3rdparty/gmock-1.7.0/src/gmock-1.7.0/gtest/include -I/mesos/3rdparty/stout/include    -o CMakeFiles/stout-tests.dir/os/env_tests.cpp.o -c /mesos/3rdparty/stout/tests/os/env_tests.cpp
Linking CXX shared library libprocess-0.0.1.so
cd /mesos/build/3rdparty/libprocess/src && /usr/bin/cmake -E cmake_link_script CMakeFiles/process-0.0.1.dir/link.txt --verbose=1
/usr/bin/g++  -fPIC  -O2 -std=c++11 -g   -shared -Wl,-soname,libprocess-0.0.1.so.0 -o libprocess-0.0.1.so.0.0.1 CMakeFiles/process-0.0.1.dir/subprocess_posix.cpp.o CMakeFiles/process-0.0.1.dir/authenticator_manager.cpp.o CMakeFiles/process-0.0.1.dir/authenticator.cpp.o CMakeFiles/process-0.0.1.dir/clock.cpp.o CMakeFiles/process-0.0.1.dir/firewall.cpp.o CMakeFiles/process-0.0.1.dir/help.cpp.o CMakeFiles/process-0.0.1.dir/http.cpp.o CMakeFiles/process-0.0.1.dir/io.cpp.o CMakeFiles/process-0.0.1.dir/latch.cpp.o CMakeFiles/process-0.0.1.dir/logging.cpp.o CMakeFiles/process-0.0.1.dir/metrics/metrics.cpp.o CMakeFiles/process-0.0.1.dir/mime.cpp.o CMakeFiles/process-0.0.1.dir/pid.cpp.o CMakeFiles/process-0.0.1.dir/poll_socket.cpp.o CMakeFiles/process-0.0.1.dir/profiler.cpp.o CMakeFiles/process-0.0.1.dir/process.cpp.o CMakeFiles/process-0.0.1.dir/reap.cpp.o CMakeFiles/process-0.0.1.dir/socket.cpp.o CMakeFiles/process-0.0.1.dir/subprocess.cpp.o CMakeFiles/process-0.0.1.dir/time.cpp.o CMakeFiles/process-0.0.1.dir/timeseries.cpp.o CMakeFiles/process-0.0.1.dir/libev.cpp.o CMakeFiles/process-0.0.1.dir/libev_poll.cpp.o  -L/mesos/build/3rdparty/glog-0.3.3/src/glog-0.3.3-lib/lib/lib  -L/mesos/build/3rdparty/protobuf-2.6.1/src/protobuf-2.6.1-lib/lib/lib  -L/mesos/build/3rdparty/http_parser-2.6.2/src/http_parser-2.6.2-build  -L/mesos/build/3rdparty/libev-4.22/src/libev-4.22-build/.libs -lapr-1 -lcurl -lglog -lsvn_delta-1 -lsvn_diff-1 -lsvn_subr-1 -lprotobuf -ldl -lapr-1 -lrt -lhttp_parser -lev -lrt -lz -lpthread -lhttp_parser -lev -lz -lpthread -Wl,-rpath,/mesos/build/3rdparty/glog-0.3.3/src/glog-0.3.3-lib/lib/lib:/mesos/build/3rdparty/protobuf-2.6.1/src/protobuf-2.6.1-lib/lib/lib:/mesos/build/3rdparty/http_parser-2.6.2/src/http_parser-2.6.2-build:/mesos/build/3rdparty/libev-4.22/src/libev-4.22-build/.libs 
cd /mesos/build/3rdparty/libprocess/src && /usr/bin/cmake -E cmake_symlink_library libprocess-0.0.1.so.0.0.1 libprocess-0.0.1.so.0 libprocess-0.0.1.so
make[3]: Leaving directory `/mesos/build'
/usr/bin/cmake -E cmake_progress_report /mesos/build/CMakeFiles  83 84 85 86
[ 35%] Built target process-0.0.1
make -f 3rdparty/libprocess/src/tests/CMakeFiles/test-linkee.dir/build.make 3rdparty/libprocess/src/tests/CMakeFiles/test-linkee.dir/depend
make[3]: Entering directory `/mesos/build'
cd /mesos/build && /usr/bin/cmake -E cmake_depends "Unix Makefiles" /mesos /mesos/3rdparty/libprocess/src/tests /mesos/build /mesos/build/3rdparty/libprocess/src/tests /mesos/build/3rdparty/libprocess/src/tests/CMakeFiles/test-linkee.dir/DependInfo.cmake --color=
Scanning dependencies of target test-linkee
make[3]: Leaving directory `/mesos/build'
make -f 3rdparty/libprocess/src/tests/CMakeFiles/test-linkee.dir/build.make 3rdparty/libprocess/src/tests/CMakeFiles/test-linkee.dir/build
make[3]: Entering directory `/mesos/build'
/usr/bin/cmake -E cmake_progress_report /mesos/build/CMakeFiles 
[ 35%] Building CXX object 3rdparty/libprocess/src/tests/CMakeFiles/test-linkee.dir/test_linkee.cpp.o
cd /mesos/build/3rdparty/libprocess/src/tests && /usr/bin/g++   -DBUILD_DIR=\"/mesos/build/3rdparty/libprocess/src/tests\" -DBUILD_FLAGS=\"\" -DBUILD_JAVA_JVM_LIBRARY=\"\" -DHAS_AUTHENTICATION=1 -DLIBDIR=\"/usr/local/libmesos\" -DPICOJSON_USE_INT64 -DPKGDATADIR=\"/usr/local/share/mesos\" -DPKGLIBEXECDIR=\"/usr/local/libexec/mesos\" -DUSE_CMAKE_BUILD_CONFIG -DUSE_STATIC_LIB -DVERSION=\"1.4.0\" -D__STDC_FORMAT_MACROS -O2 -std=c++11 -g -fPIE -I/usr/include/apr-1.0 -I/mesos/build/3rdparty/boost-1.53.0/src/boost-1.53.0 -I/mesos/build/3rdparty/elfio-3.2/src/elfio-3.2 -I/mesos/build/3rdparty/glog-0.3.3/src/glog-0.3.3-lib/lib/include -I/mesos/build/3rdparty/nvml-352.79/src/nvml-352.79 -I/mesos/build/3rdparty/picojson-1.3.0/src/picojson-1.3.0 -I/mesos/build/3rdparty/protobuf-2.6.1/src/protobuf-2.6.1-lib/lib/include -I/usr/include/subversion-1 -I/mesos/3rdparty/stout/include -I/mesos/build/3rdparty/http_parser-2.6.2/src/http_parser-2.6.2 -I/mesos/build/3rdparty/libev-4.22/src/libev-4.22 -I/mesos/build/3rdparty/gmock-1.7.0/src/gmock-1.7.0/include -I/mesos/build/3rdparty/gmock-1.7.0/src/gmock-1.7.0/gtest/include -I/mesos/3rdparty/libprocess/src/tests/src -I/mesos/3rdparty/libprocess/include -I/mesos/3rdparty/libprocess/src/tests/..    -o CMakeFiles/test-linkee.dir/test_linkee.cpp.o -c /mesos/3rdparty/libprocess/src/tests/test_linkee.cpp
/usr/bin/cmake -E cmake_progress_report /mesos/build/CMakeFiles 
[ 35%] Building CXX object 3rdparty/stout/tests/CMakeFiles/stout-tests.dir/os/filesystem_tests.cpp.o
cd /mesos/build/3rdparty/stout/tests && /usr/bin/g++   -DBUILD_FLAGS=\"\" -DBUILD_JAVA_JVM_LIBRARY=\"\" -DHAS_AUTHENTICATION=1 -DLIBDIR=\"/usr/local/libmesos\" -DPICOJSON_USE_INT64 -DPKGDATADIR=\"/usr/local/share/mesos\" -DPKGLIBEXECDIR=\"/usr/local/libexec/mesos\" -DUSE_CMAKE_BUILD_CONFIG -DUSE_STATIC_LIB -DVERSION=\"1.4.0\" -D__STDC_FORMAT_MACROS -O2 -std=c++11 -g -fPIE -isystem /usr/include/apr-1.0 -isystem /mesos/build/3rdparty/boost-1.53.0/src/boost-1.53.0 -isystem /mesos/build/3rdparty/elfio-3.2/src/elfio-3.2 -isystem /mesos/build/3rdparty/glog-0.3.3/src/glog-0.3.3-lib/lib/include -isystem /mesos/build/3rdparty/nvml-352.79/src/nvml-352.79 -isystem /mesos/build/3rdparty/picojson-1.3.0/src/picojson-1.3.0 -isystem /mesos/build/3rdparty/protobuf-2.6.1/src/protobuf-2.6.1-lib/lib/include -isystem /usr/include/subversion-1 -isystem /mesos/build/3rdparty/gmock-1.7.0/src/gmock-1.7.0/include -isystem /mesos/build/3rdparty/gmock-1.7.0/src/gmock-1.7.0/gtest/include -I/mesos/3rdparty/stout/include    -o CMakeFiles/stout-tests.dir/os/filesystem_tests.cpp.o -c /mesos/3rdparty/stout/tests/os/filesystem_tests.cpp
make[3]: Leaving directory `/mesos/build'
make[2]: *** [src/CMakeFiles/mesos-protobufs.dir/all] Error 2
make[2]: *** Waiting for unfinished jobs....
/usr/bin/cmake -E cmake_progress_report /mesos/build/CMakeFiles 
[ 35%] Building CXX object 3rdparty/stout/tests/CMakeFiles/stout-tests.dir/os/process_tests.cpp.o
cd /mesos/build/3rdparty/stout/tests && /usr/bin/g++   -DBUILD_FLAGS=\"\" -DBUILD_JAVA_JVM_LIBRARY=\"\" -DHAS_AUTHENTICATION=1 -DLIBDIR=\"/usr/local/libmesos\" -DPICOJSON_USE_INT64 -DPKGDATADIR=\"/usr/local/share/mesos\" -DPKGLIBEXECDIR=\"/usr/local/libexec/mesos\" -DUSE_CMAKE_BUILD_CONFIG -DUSE_STATIC_LIB -DVERSION=\"1.4.0\" -D__STDC_FORMAT_MACROS -O2 -std=c++11 -g -fPIE -isystem /usr/include/apr-1.0 -isystem /mesos/build/3rdparty/boost-1.53.0/src/boost-1.53.0 -isystem /mesos/build/3rdparty/elfio-3.2/src/elfio-3.2 -isystem /mesos/build/3rdparty/glog-0.3.3/src/glog-0.3.3-lib/lib/include -isystem /mesos/build/3rdparty/nvml-352.79/src/nvml-352.79 -isystem /mesos/build/3rdparty/picojson-1.3.0/src/picojson-1.3.0 -isystem /mesos/build/3rdparty/protobuf-2.6.1/src/protobuf-2.6.1-lib/lib/include -isystem /usr/include/subversion-1 -isystem /mesos/build/3rdparty/gmock-1.7.0/src/gmock-1.7.0/include -isystem /mesos/build/3rdparty/gmock-1.7.0/src/gmock-1.7.0/gtest/include -I/mesos/3rdparty/stout/include    -o CMakeFiles/stout-tests.dir/os/process_tests.cpp.o -c /mesos/3rdparty/stout/tests/os/process_tests.cpp
/usr/bin/cmake -E cmake_progress_report /mesos/build/CMakeFiles 
[ 35%] Building CXX object 3rdparty/stout/tests/CMakeFiles/stout-tests.dir/os/rmdir_tests.cpp.o
cd /mesos/build/3rdparty/stout/tests && /usr/bin/g++   -DBUILD_FLAGS=\"\" -DBUILD_JAVA_JVM_LIBRARY=\"\" -DHAS_AUTHENTICATION=1 -DLIBDIR=\"/usr/local/libmesos\" -DPICOJSON_USE_INT64 -DPKGDATADIR=\"/usr/local/share/mesos\" -DPKGLIBEXECDIR=\"/usr/local/libexec/mesos\" -DUSE_CMAKE_BUILD_CONFIG -DUSE_STATIC_LIB -DVERSION=\"1.4.0\" -D__STDC_FORMAT_MACROS -O2 -std=c++11 -g -fPIE -isystem /usr/include/apr-1.0 -isystem /mesos/build/3rdparty/boost-1.53.0/src/boost-1.53.0 -isystem /mesos/build/3rdparty/elfio-3.2/src/elfio-3.2 -isystem /mesos/build/3rdparty/glog-0.3.3/src/glog-0.3.3-lib/lib/include -isystem /mesos/build/3rdparty/nvml-352.79/src/nvml-352.79 -isystem /mesos/build/3rdparty/picojson-1.3.0/src/picojson-1.3.0 -isystem /mesos/build/3rdparty/protobuf-2.6.1/src/protobuf-2.6.1-lib/lib/include -isystem /usr/include/subversion-1 -isystem /mesos/build/3rdparty/gmock-1.7.0/src/gmock-1.7.0/include -isystem /mesos/build/3rdparty/gmock-1.7.0/src/gmock-1.7.0/gtest/include -I/mesos/3rdparty/stout/include    -o CMakeFiles/stout-tests.dir/os/rmdir_tests.cpp.o -c /mesos/3rdparty/stout/tests/os/rmdir_tests.cpp
/usr/bin/cmake -E cmake_progress_report /mesos/build/CMakeFiles 
[ 35%] Building CXX object 3rdparty/stout/tests/CMakeFiles/stout-tests.dir/os/socket_tests.cpp.o
cd /mesos/build/3rdparty/stout/tests && /usr/bin/g++   -DBUILD_FLAGS=\"\" -DBUILD_JAVA_JVM_LIBRARY=\"\" -DHAS_AUTHENTICATION=1 -DLIBDIR=\"/usr/local/libmesos\" -DPICOJSON_USE_INT64 -DPKGDATADIR=\"/usr/local/share/mesos\" -DPKGLIBEXECDIR=\"/usr/local/libexec/mesos\" -DUSE_CMAKE_BUILD_CONFIG -DUSE_STATIC_LIB -DVERSION=\"1.4.0\" -D__STDC_FORMAT_MACROS -O2 -std=c++11 -g -fPIE -isystem /usr/include/apr-1.0 -isystem /mesos/build/3rdparty/boost-1.53.0/src/boost-1.53.0 -isystem /mesos/build/3rdparty/elfio-3.2/src/elfio-3.2 -isystem /mesos/build/3rdparty/glog-0.3.3/src/glog-0.3.3-lib/lib/include -isystem /mesos/build/3rdparty/nvml-352.79/src/nvml-352.79 -isystem /mesos/build/3rdparty/picojson-1.3.0/src/picojson-1.3.0 -isystem /mesos/build/3rdparty/protobuf-2.6.1/src/protobuf-2.6.1-lib/lib/include -isystem /usr/include/subversion-1 -isystem /mesos/build/3rdparty/gmock-1.7.0/src/gmock-1.7.0/include -isystem /mesos/build/3rdparty/gmock-1.7.0/src/gmock-1.7.0/gtest/include -I/mesos/3rdparty/stout/include    -o CMakeFiles/stout-tests.dir/os/socket_tests.cpp.o -c /mesos/3rdparty/stout/tests/os/socket_tests.cpp
/usr/bin/cmake -E cmake_progress_report /mesos/build/CMakeFiles 
[ 35%] Building CXX object 3rdparty/stout/tests/CMakeFiles/stout-tests.dir/os/strerror_tests.cpp.o
cd /mesos/build/3rdparty/stout/tests && /usr/bin/g++   -DBUILD_FLAGS=\"\" -DBUILD_JAVA_JVM_LIBRARY=\"\" -DHAS_AUTHENTICATION=1 -DLIBDIR=\"/usr/local/libmesos\" -DPICOJSON_USE_INT64 -DPKGDATADIR=\"/usr/local/share/mesos\" -DPKGLIBEXECDIR=\"/usr/local/libexec/mesos\" -DUSE_CMAKE_BUILD_CONFIG -DUSE_STATIC_LIB -DVERSION=\"1.4.0\" -D__STDC_FORMAT_MACROS -O2 -std=c++11 -g -fPIE -isystem /usr/include/apr-1.0 -isystem /mesos/build/3rdparty/boost-1.53.0/src/boost-1.53.0 -isystem /mesos/build/3rdparty/elfio-3.2/src/elfio-3.2 -isystem /mesos/build/3rdparty/glog-0.3.3/src/glog-0.3.3-lib/lib/include -isystem /mesos/build/3rdparty/nvml-352.79/src/nvml-352.79 -isystem /mesos/build/3rdparty/picojson-1.3.0/src/picojson-1.3.0 -isystem /mesos/build/3rdparty/protobuf-2.6.1/src/protobuf-2.6.1-lib/lib/include -isystem /usr/include/subversion-1 -isystem /mesos/build/3rdparty/gmock-1.7.0/src/gmock-1.7.0/include -isystem /mesos/build/3rdparty/gmock-1.7.0/src/gmock-1.7.0/gtest/include -I/mesos/3rdparty/stout/include    -o CMakeFiles/stout-tests.dir/os/strerror_tests.cpp.o -c /mesos/3rdparty/stout/tests/os/strerror_tests.cpp
/usr/bin/cmake -E cmake_progress_report /mesos/build/CMakeFiles 94
[ 36%] Building CXX object 3rdparty/stout/tests/CMakeFiles/stout-tests.dir/os/systems_tests.cpp.o
cd /mesos/build/3rdparty/stout/tests && /usr/bin/g++   -DBUILD_FLAGS=\"\" -DBUILD_JAVA_JVM_LIBRARY=\"\" -DHAS_AUTHENTICATION=1 -DLIBDIR=\"/usr/local/libmesos\" -DPICOJSON_USE_INT64 -DPKGDATADIR=\"/usr/local/share/mesos\" -DPKGLIBEXECDIR=\"/usr/local/libexec/mesos\" -DUSE_CMAKE_BUILD_CONFIG -DUSE_STATIC_LIB -DVERSION=\"1.4.0\" -D__STDC_FORMAT_MACROS -O2 -std=c++11 -g -fPIE -isystem /usr/include/apr-1.0 -isystem /mesos/build/3rdparty/boost-1.53.0/src/boost-1.53.0 -isystem /mesos/build/3rdparty/elfio-3.2/src/elfio-3.2 -isystem /mesos/build/3rdparty/glog-0.3.3/src/glog-0.3.3-lib/lib/include -isystem /mesos/build/3rdparty/nvml-352.79/src/nvml-352.79 -isystem /mesos/build/3rdparty/picojson-1.3.0/src/picojson-1.3.0 -isystem /mesos/build/3rdparty/protobuf-2.6.1/src/protobuf-2.6.1-lib/lib/include -isystem /usr/include/subversion-1 -isystem /mesos/build/3rdparty/gmock-1.7.0/src/gmock-1.7.0/include -isystem /mesos/build/3rdparty/gmock-1.7.0/src/gmock-1.7.0/gtest/include -I/mesos/3rdparty/stout/include    -o CMakeFiles/stout-tests.dir/os/systems_tests.cpp.o -c /mesos/3rdparty/stout/tests/os/systems_tests.cpp
/usr/bin/cmake -E cmake_progress_report /mesos/build/CMakeFiles 
[ 36%] Building CXX object 3rdparty/stout/tests/CMakeFiles/stout-tests.dir/os/sendfile_tests.cpp.o
cd /mesos/build/3rdparty/stout/tests && /usr/bin/g++   -DBUILD_FLAGS=\"\" -DBUILD_JAVA_JVM_LIBRARY=\"\" -DHAS_AUTHENTICATION=1 -DLIBDIR=\"/usr/local/libmesos\" -DPICOJSON_USE_INT64 -DPKGDATADIR=\"/usr/local/share/mesos\" -DPKGLIBEXECDIR=\"/usr/local/libexec/mesos\" -DUSE_CMAKE_BUILD_CONFIG -DUSE_STATIC_LIB -DVERSION=\"1.4.0\" -D__STDC_FORMAT_MACROS -O2 -std=c++11 -g -fPIE -isystem /usr/include/apr-1.0 -isystem /mesos/build/3rdparty/boost-1.53.0/src/boost-1.53.0 -isystem /mesos/build/3rdparty/elfio-3.2/src/elfio-3.2 -isystem /mesos/build/3rdparty/glog-0.3.3/src/glog-0.3.3-lib/lib/include -isystem /mesos/build/3rdparty/nvml-352.79/src/nvml-352.79 -isystem /mesos/build/3rdparty/picojson-1.3.0/src/picojson-1.3.0 -isystem /mesos/build/3rdparty/protobuf-2.6.1/src/protobuf-2.6.1-lib/lib/include -isystem /usr/include/subversion-1 -isystem /mesos/build/3rdparty/gmock-1.7.0/src/gmock-1.7.0/include -isystem /mesos/build/3rdparty/gmock-1.7.0/src/gmock-1.7.0/gtest/include -I/mesos/3rdparty/stout/include    -o CMakeFiles/stout-tests.dir/os/sendfile_tests.cpp.o -c /mesos/3rdparty/stout/tests/os/sendfile_tests.cpp
/usr/bin/cmake -E cmake_progress_report /mesos/build/CMakeFiles 
[ 36%] Linking CXX executable test-linkee
cd /mesos/build/3rdparty/libprocess/src/tests && /usr/bin/cmake -E cmake_link_script CMakeFiles/test-linkee.dir/link.txt --verbose=1
Building CXX object 3rdparty/stout/tests/CMakeFiles/stout-tests.dir/os/signals_tests.cpp.o
cd /mesos/build/3rdparty/stout/tests && /usr/bin/g++   -DBUILD_FLAGS=\"\" -DBUILD_JAVA_JVM_LIBRARY=\"\" -DHAS_AUTHENTICATION=1 -DLIBDIR=\"/usr/local/libmesos\" -DPICOJSON_USE_INT64 -DPKGDATADIR=\"/usr/local/share/mesos\" -DPKGLIBEXECDIR=\"/usr/local/libexec/mesos\" -DUSE_CMAKE_BUILD_CONFIG -DUSE_STATIC_LIB -DVERSION=\"1.4.0\" -D__STDC_FORMAT_MACROS -O2 -std=c++11 -g -fPIE -isystem /usr/include/apr-1.0 -isystem /mesos/build/3rdparty/boost-1.53.0/src/boost-1.53.0 -isystem /mesos/build/3rdparty/elfio-3.2/src/elfio-3.2 -isystem /mesos/build/3rdparty/glog-0.3.3/src/glog-0.3.3-lib/lib/include -isystem /mesos/build/3rdparty/nvml-352.79/src/nvml-352.79 -isystem /mesos/build/3rdparty/picojson-1.3.0/src/picojson-1.3.0 -isystem /mesos/build/3rdparty/protobuf-2.6.1/src/protobuf-2.6.1-lib/lib/include -isystem /usr/include/subversion-1 -isystem /mesos/build/3rdparty/gmock-1.7.0/src/gmock-1.7.0/include -isystem /mesos/build/3rdparty/gmock-1.7.0/src/gmock-1.7.0/gtest/include -I/mesos/3rdparty/stout/include    -o CMakeFiles/stout-tests.dir/os/signals_tests.cpp.o -c /mesos/3rdparty/stout/tests/os/signals_tests.cpp
/usr/bin/g++    -O2 -std=c++11 -g    CMakeFiles/test-linkee.dir/test_linkee.cpp.o  -o test-linkee  -L/mesos/build/3rdparty/glog-0.3.3/src/glog-0.3.3-lib/lib/lib  -L/mesos/build/3rdparty/protobuf-2.6.1/src/protobuf-2.6.1-lib/lib/lib  -L/mesos/build/3rdparty/http_parser-2.6.2/src/http_parser-2.6.2-build  -L/mesos/build/3rdparty/libev-4.22/src/libev-4.22-build/.libs  -L/mesos/build/3rdparty/libprocess/..  -L/mesos/build/3rdparty/gmock-1.7.0/src/gmock-1.7.0-lib/lib  -L/mesos/build/3rdparty/gmock-1.7.0/src/gmock-1.7.0-build/gtest/lib/.libs -rdynamic ../libprocess-0.0.1.so.0.0.1 -lapr-1 -lcurl -lglog -lsvn_delta-1 -lsvn_diff-1 -lsvn_subr-1 -lprotobuf -ldl -lapr-1 -lrt -lhttp_parser -lev -lrt -lz -lpthread -lgmock -lgtest -lhttp_parser -lev -lz -lpthread -Wl,-rpath,/mesos/build/3rdparty/glog-0.3.3/src/glog-0.3.3-lib/lib/lib:/mesos/build/3rdparty/protobuf-2.6.1/src/protobuf-2.6.1-lib/lib/lib:/mesos/build/3rdparty/http_parser-2.6.2/src/http_parser-2.6.2-build:/mesos/build/3rdparty/libev-4.22/src/libev-4.22-build/.libs:/mesos/build/3rdparty/libprocess/..:/mesos/build/3rdparty/gmock-1.7.0/src/gmock-1.7.0-lib/lib:/mesos/build/3rdparty/gmock-1.7.0/src/gmock-1.7.0-build/gtest/lib/.libs:/mesos/build/3rdparty/libprocess/src 
make[3]: Leaving directory `/mesos/build'
/usr/bin/cmake -E cmake_progress_report /mesos/build/CMakeFiles 
[ 36%] Built target test-linkee
Linking CXX executable stout-tests
cd /mesos/build/3rdparty/stout/tests && /usr/bin/cmake -E cmake_link_script CMakeFiles/stout-tests.dir/link.txt --verbose=1
/usr/bin/g++    -O2 -std=c++11 -g    CMakeFiles/stout-tests.dir/base64_tests.cpp.o CMakeFiles/stout-tests.dir/bits_tests.cpp.o CMakeFiles/stout-tests.dir/bytes_tests.cpp.o CMakeFiles/stout-tests.dir/cache_tests.cpp.o CMakeFiles/stout-tests.dir/duration_tests.cpp.o CMakeFiles/stout-tests.dir/dynamiclibrary_tests.cpp.o CMakeFiles/stout-tests.dir/error_tests.cpp.o CMakeFiles/stout-tests.dir/flags_tests.cpp.o CMakeFiles/stout-tests.dir/gzip_tests.cpp.o CMakeFiles/stout-tests.dir/hashmap_tests.cpp.o CMakeFiles/stout-tests.dir/hashset_tests.cpp.o CMakeFiles/stout-tests.dir/interval_tests.cpp.o CMakeFiles/stout-tests.dir/ip_tests.cpp.o CMakeFiles/stout-tests.dir/json_tests.cpp.o CMakeFiles/stout-tests.dir/jsonify_tests.cpp.o CMakeFiles/stout-tests.dir/linkedhashmap_tests.cpp.o CMakeFiles/stout-tests.dir/mac_tests.cpp.o CMakeFiles/stout-tests.dir/main.cpp.o CMakeFiles/stout-tests.dir/multimap_tests.cpp.o CMakeFiles/stout-tests.dir/none_tests.cpp.o CMakeFiles/stout-tests.dir/numify_tests.cpp.o CMakeFiles/stout-tests.dir/option_tests.cpp.o CMakeFiles/stout-tests.dir/os_tests.cpp.o CMakeFiles/stout-tests.dir/recordio_tests.cpp.o CMakeFiles/stout-tests.dir/result_tests.cpp.o CMakeFiles/stout-tests.dir/some_tests.cpp.o CMakeFiles/stout-tests.dir/strings_tests.cpp.o CMakeFiles/stout-tests.dir/subcommand_tests.cpp.o CMakeFiles/stout-tests.dir/try_tests.cpp.o CMakeFiles/stout-tests.dir/uuid_tests.cpp.o CMakeFiles/stout-tests.dir/version_tests.cpp.o CMakeFiles/stout-tests.dir/path_tests.cpp.o CMakeFiles/stout-tests.dir/protobuf_tests.cpp.o CMakeFiles/stout-tests.dir/protobuf_tests.pb.cc.o CMakeFiles/stout-tests.dir/svn_tests.cpp.o CMakeFiles/stout-tests.dir/proc_tests.cpp.o CMakeFiles/stout-tests.dir/os/env_tests.cpp.o CMakeFiles/stout-tests.dir/os/filesystem_tests.cpp.o CMakeFiles/stout-tests.dir/os/process_tests.cpp.o CMakeFiles/stout-tests.dir/os/rmdir_tests.cpp.o CMakeFiles/stout-tests.dir/os/socket_tests.cpp.o CMakeFiles/stout-tests.dir/os/strerror_tests.cpp.o CMakeFiles/stout-tests.dir/os/systems_tests.cpp.o CMakeFiles/stout-tests.dir/os/sendfile_tests.cpp.o CMakeFiles/stout-tests.dir/os/signals_tests.cpp.o  -o stout-tests  -L/mesos/build/3rdparty/glog-0.3.3/src/glog-0.3.3-lib/lib/lib  -L/mesos/build/3rdparty/protobuf-2.6.1/src/protobuf-2.6.1-lib/lib/lib  -L/mesos/build/3rdparty/gmock-1.7.0/src/gmock-1.7.0-lib/lib  -L/mesos/build/3rdparty/gmock-1.7.0/src/gmock-1.7.0-build/gtest/lib/.libs -rdynamic -lapr-1 -lcurl -lglog -lsvn_delta-1 -lsvn_diff-1 -lsvn_subr-1 -lprotobuf -ldl -lapr-1 -lrt -lpthread -lapr-1 -lcurl -lglog -lsvn_delta-1 -lsvn_diff-1 -lsvn_subr-1 -lprotobuf -ldl -lapr-1 -lrt -lpthread -lapr-1 -lcurl -lglog -lsvn_delta-1 -lsvn_diff-1 -lsvn_subr-1 -lprotobuf -ldl -lapr-1 -lrt -lpthread -lapr-1 -lcurl -lglog -lsvn_delta-1 -lsvn_diff-1 -lsvn_subr-1 -lprotobuf -ldl -lapr-1 -lrt -lgmock -lgtest -lpthread -lgmock -lgtest -Wl,-rpath,/mesos/build/3rdparty/glog-0.3.3/src/glog-0.3.3-lib/lib/lib:/mesos/build/3rdparty/protobuf-2.6.1/src/protobuf-2.6.1-lib/lib/lib:/mesos/build/3rdparty/gmock-1.7.0/src/gmock-1.7.0-lib/lib:/mesos/build/3rdparty/gmock-1.7.0/src/gmock-1.7.0-build/gtest/lib/.libs 
make[3]: Leaving directory `/mesos/build'
/usr/bin/cmake -E cmake_progress_report /mesos/build/CMakeFiles  88 89 90 91 92 93 94
[ 36%] Built target stout-tests
make[2]: Leaving directory `/mesos/build'
make[1]: *** [CMakeFiles/check.dir/rule] Error 2
make: *** [check] Error 2
make[1]: Leaving directory `/mesos/build'
+ docker rmi mesos-1494265356-9015
Untagged: mesos-1494265356-9015:latest
Deleted: sha256:2cb7a93a26f53c651d9d05050aefcae6a7512d9474ebc67a83c69e7560c04d96
Deleted: sha256:621a888a73985e8deb8d5819a577d4eb4dda8252c6ed75ff23cc1313c826b7f0
Deleted: sha256:c0e78c05fe6ab2a09651cbb324066870adbf0b9fd8f6a735f1e7f3d50721c131
Deleted: sha256:2cebbccce95f8595e33053ae6b4a1fc8206c1c9bad7a4080b7f88917dbfcaa05
Deleted: sha256:cee3e8704eb0dec16318b74bcd7800a2cbf3c871dda88c6e57e3ca9644eb92f2
Deleted: sha256:7ef49b34116fb6bfc13ea9d9b476b0f0cb8b2f4e2ae411976336f0c8f799a144
Deleted: sha256:05e908ecd00e0592a21b6ef90785a7d5a61abaed84def562e56ab737ebc0ce66
Deleted: sha256:8338d5082d885f1a644aa9d18790103ac13a7399b6a49da267bb0854ebacc757
Deleted: sha256:652045556d8b698b3dbf51a8d8e948180cdba23394bcc084048aeeb5860eee20
Deleted: sha256:8e10d1d9010143eaf29ffcb050d88457f6d6229675706b9cbd041a83e6906e23
Deleted: sha256:44a743d6d208bd272917c01788208d7d61b9b26ed9d14118d71c60558db26ca3
Deleted: sha256:e7bdcf67ea72a42074674f3f35c505b9040863f332cad6a8b9907c4a4ab529e9
Deleted: sha256:8e2b1c2acae68eb151699915d961e966bb355fcd20e8443362199a0e02b3bb1a
Deleted: sha256:b97f8a7caf6fe603e53ef922a1b24a30f380d0096afb8645d1dc0ba1dac3dab9
Deleted: sha256:be9f04ff48efe409b3f4266da8c177fc487ebb58f3ae29cdc6128e93b410eed7
Deleted: sha256:ef30b81911a4de3b76159304c6dc2da3bf1ab228642e40dca42cc3d05c6c44e4
Deleted: sha256:d80ccf6b5cc5b8bd4950866f6345e57ff5362ffb0b12ded4d65f5246a904fa1c
Deleted: sha256:1e6f6122a4be0d13fb35bcbfc0f38a0453b516bfc05094f8da8bae4ff27c7db2
Deleted: sha256:e27558bb48ecc130559e7c0ddd92c8f3329226aa13c5996695e98074e6297324
Deleted: sha256:c89e2dbe5c1b9abda1b20f914ec5b1254bcfc647ac6673eae8334295c5dda6c2
Deleted: sha256:0fb0e7ae3d8c075c975484b2187dc0ab63433a573765398726982b2bc6dc76ef
Deleted: sha256:33cc9b4085373fd191b713fc59232de5f26d9074b69b2a74e42bb56b7272be4b
Deleted: sha256:aa8221c2ace37eac0eeb9176989bb9a9af4e62dd4916c45e97d556fd7c5cb3b9
Deleted: sha256:1bb73a7f7d67d5bf08262ff0b817996bb40b877796194bc44be8018d8406f38c
Build step 'Execute shell' marked build as failure
Not sending mail to unregistered user neil.conway@gmail.com
Not sending mail to unregistered user toenshoff@me.com
Not sending mail to unregistered user yujie.jay@gmail.com

Mime
View raw message