mesos-builds mailing list archives

Site index · List index
Message view « Date » · « Thread »
Top « Date » · « Thread »
From Apache Jenkins Server <jenk...@builds.apache.org>
Subject Build failed in Jenkins: Mesos-Buildbot » autotools,gcc,--verbose,GLOG_v=1 MESOS_VERBOSE=1,centos:7,(docker||Hadoop)&&(!ubuntu-us1)&&(!ubuntu-eu2) #3679
Date Mon, 15 May 2017 23:03:28 GMT
See <https://builds.apache.org/job/Mesos-Buildbot/BUILDTOOL=autotools,COMPILER=gcc,CONFIGURATION=--verbose,ENVIRONMENT=GLOG_v=1%20MESOS_VERBOSE=1,OS=centos%3A7,label_exp=(docker%7C%7CHadoop)&&(!ubuntu-us1)&&(!ubuntu-eu2)/3679/display/redirect?page=changes>

Changes:

[xujyan] Validate DESTROY operation in `Resources::apply()`.

------------------------------------------
[...truncated 27.15 MB...]
[ RUN      ] Endpoint/SlaveEndpointTest.AuthorizedRequest/2
I0515 23:03:24.392190 31825 containerizer.cpp:221] Using isolation: posix/cpu,posix/mem,filesystem/posix,network/cni
W0515 23:03:24.392608 31825 backend.cpp:76] Failed to create 'aufs' backend: AufsBackend requires
root privileges
W0515 23:03:24.392696 31825 backend.cpp:76] Failed to create 'bind' backend: BindBackend requires
root privileges
I0515 23:03:24.392735 31825 provisioner.cpp:249] Using default backend 'copy'
I0515 23:03:24.395856 31861 slave.cpp:225] Mesos agent started on (748)@172.17.0.3:37997
I0515 23:03:24.395877 31861 slave.cpp:226] Flags at startup: --acls="" --appc_simple_discovery_uri_prefix="http://"
--appc_store_dir="/tmp/mesos/store/appc" --authenticate_http_readonly="true" --authenticate_http_readwrite="true"
--authenticatee="crammd5" --authentication_backoff_factor="1secs" --authorizer="local" --cgroups_cpu_enable_pids_and_tids_count="false"
--cgroups_enable_cfs="false" --cgroups_hierarchy="/sys/fs/cgroup" --cgroups_limit_swap="false"
--cgroups_root="mesos" --container_disk_watch_interval="15secs" --containerizers="mesos" --credential="/tmp/Endpoint_SlaveEndpointTest_AuthorizedRequest_2_K5qtsF/credential"
--default_role="*" --disk_watch_interval="1mins" --docker="docker" --docker_kill_orphans="true"
--docker_registry="https://registry-1.docker.io" --docker_remove_delay="6hrs" --docker_socket="/var/run/docker.sock"
--docker_stop_timeout="0ns" --docker_store_dir="/tmp/mesos/store/docker" --docker_volume_checkpoint_dir="/var/run/mesos/isolators/docker/volume"
--enforce_container_disk_quota="false" --executor_registration_timeout="1mins" --executor_shutdown_grace_period="5secs"
--fetcher_cache_dir="/tmp/Endpoint_SlaveEndpointTest_AuthorizedRequest_2_K5qtsF/fetch" --fetcher_cache_size="2GB"
--frameworks_home="" --gc_delay="1weeks" --gc_disk_headroom="0.1" --hadoop_home="" --help="false"
--hostname_lookup="true" --http_command_executor="false" --http_credentials="/tmp/Endpoint_SlaveEndpointTest_AuthorizedRequest_2_K5qtsF/http_credentials"
--http_heartbeat_interval="30secs" --initialize_driver_logging="true" --isolation="posix/cpu,posix/mem"
--launcher="posix" --launcher_dir="/mesos/mesos-1.4.0/_build/src" --logbufsecs="0" --logging_level="INFO"
--max_completed_executors_per_framework="150" --oversubscribed_resources_interval="15secs"
--perf_duration="10secs" --perf_interval="1mins" --port="5051" --qos_correction_interval_min="0ns"
--quiet="false" --recover="reconnect" --recovery_timeout="15mins" --registration_backoff_factor="10ms"
--resources="cpus:2;gpus:0;mem:1024;disk:1024;ports:[31000-32000]" --revocable_cpu_low_priority="true"
--runtime_dir="/tmp/Endpoint_SlaveEndpointTest_AuthorizedRequest_2_K5qtsF" --sandbox_directory="/mnt/mesos/sandbox"
--strict="true" --switch_user="true" --systemd_enable_support="true" --systemd_runtime_directory="/run/systemd/system"
--version="false" --work_dir="/tmp/Endpoint_SlaveEndpointTest_AuthorizedRequest_2_3Jmr4V"
I0515 23:03:24.396273 31861 credentials.hpp:86] Loading credential for authentication from
'/tmp/Endpoint_SlaveEndpointTest_AuthorizedRequest_2_K5qtsF/credential'
I0515 23:03:24.396396 31861 slave.cpp:258] Agent using credential for: test-principal
I0515 23:03:24.396416 31861 credentials.hpp:37] Loading credentials for authentication from
'/tmp/Endpoint_SlaveEndpointTest_AuthorizedRequest_2_K5qtsF/http_credentials'
I0515 23:03:24.396610 31861 http.cpp:975] Creating default 'basic' HTTP authenticator for
realm 'mesos-agent-readonly'
I0515 23:03:24.396739 31861 http.cpp:975] Creating default 'basic' HTTP authenticator for
realm 'mesos-agent-readwrite'
I0515 23:03:24.397903 31861 slave.cpp:529] Agent resources: cpus(*):2; mem(*):1024; disk(*):1024;
ports(*):[31000-32000]
I0515 23:03:24.397975 31861 slave.cpp:537] Agent attributes: [  ]
I0515 23:03:24.397987 31861 slave.cpp:542] Agent hostname: c809bf5962bb
I0515 23:03:24.398104 31853 status_update_manager.cpp:177] Pausing sending status updates
I0515 23:03:24.399309 31851 state.cpp:62] Recovering state from '/tmp/Endpoint_SlaveEndpointTest_AuthorizedRequest_2_3Jmr4V/meta'
I0515 23:03:24.399665 31862 status_update_manager.cpp:203] Recovering status update manager
I0515 23:03:24.399850 31865 containerizer.cpp:608] Recovering containerizer
I0515 23:03:24.401155 31854 provisioner.cpp:410] Provisioner recovery complete
I0515 23:03:24.401517 31858 slave.cpp:5974] Finished recovery
I0515 23:03:24.401962 31858 slave.cpp:6156] Querying resource estimator for oversubscribable
resources
I0515 23:03:24.402206 31858 slave.cpp:6170] Received oversubscribable resources {} from the
resource estimator
I0515 23:03:24.404198 31848 process.cpp:3730] Handling HTTP event for process 'slave(748)'
with path: '/slave(748)/containers'
I0515 23:03:24.405395 31867 http.cpp:1115] HTTP GET for /slave(748)/containers from 172.17.0.3:56818
I0515 23:03:24.405465 31867 http.cpp:936] Authorizing principal 'test-principal' to GET the
'/containers' endpoint
I0515 23:03:24.408588 31853 slave.cpp:794] Agent terminating
[       OK ] Endpoint/SlaveEndpointTest.AuthorizedRequest/2 (24 ms)
[ RUN      ] Endpoint/SlaveEndpointTest.UnauthorizedRequest/0
I0515 23:03:24.416883 31825 containerizer.cpp:221] Using isolation: posix/cpu,posix/mem,filesystem/posix,network/cni
W0515 23:03:24.417328 31825 backend.cpp:76] Failed to create 'aufs' backend: AufsBackend requires
root privileges
W0515 23:03:24.417418 31825 backend.cpp:76] Failed to create 'bind' backend: BindBackend requires
root privileges
I0515 23:03:24.417455 31825 provisioner.cpp:249] Using default backend 'copy'
I0515 23:03:24.420151 31863 slave.cpp:225] Mesos agent started on (749)@172.17.0.3:37997
I0515 23:03:24.420202 31863 slave.cpp:226] Flags at startup: --acls="" --appc_simple_discovery_uri_prefix="http://"
--appc_store_dir="/tmp/mesos/store/appc" --authenticate_http_readonly="true" --authenticate_http_readwrite="true"
--authenticatee="crammd5" --authentication_backoff_factor="1secs" --authorizer="local" --cgroups_cpu_enable_pids_and_tids_count="false"
--cgroups_enable_cfs="false" --cgroups_hierarchy="/sys/fs/cgroup" --cgroups_limit_swap="false"
--cgroups_root="mesos" --container_disk_watch_interval="15secs" --containerizers="mesos" --credential="/tmp/Endpoint_SlaveEndpointTest_UnauthorizedRequest_0_1j65cB/credential"
--default_role="*" --disk_watch_interval="1mins" --docker="docker" --docker_kill_orphans="true"
--docker_registry="https://registry-1.docker.io" --docker_remove_delay="6hrs" --docker_socket="/var/run/docker.sock"
--docker_stop_timeout="0ns" --docker_store_dir="/tmp/mesos/store/docker" --docker_volume_checkpoint_dir="/var/run/mesos/isolators/docker/volume"
--enforce_container_disk_quota="false" --executor_registration_timeout="1mins" --executor_shutdown_grace_period="5secs"
--fetcher_cache_dir="/tmp/Endpoint_SlaveEndpointTest_UnauthorizedRequest_0_1j65cB/fetch" --fetcher_cache_size="2GB"
--frameworks_home="" --gc_delay="1weeks" --gc_disk_headroom="0.1" --hadoop_home="" --help="false"
--hostname_lookup="true" --http_command_executor="false" --http_credentials="/tmp/Endpoint_SlaveEndpointTest_UnauthorizedRequest_0_1j65cB/http_credentials"
--http_heartbeat_interval="30secs" --initialize_driver_logging="true" --isolation="posix/cpu,posix/mem"
--launcher="posix" --launcher_dir="/mesos/mesos-1.4.0/_build/src" --logbufsecs="0" --logging_level="INFO"
--max_completed_executors_per_framework="150" --oversubscribed_resources_interval="15secs"
--perf_duration="10secs" --perf_interval="1mins" --port="5051" --qos_correction_interval_min="0ns"
--quiet="false" --recover="reconnect" --recovery_timeout="15mins" --registration_backoff_factor="10ms"
--resources="cpus:2;gpus:0;mem:1024;disk:1024;ports:[31000-32000]" --revocable_cpu_low_priority="true"
--runtime_dir="/tmp/Endpoint_SlaveEndpointTest_UnauthorizedRequest_0_1j65cB" --sandbox_directory="/mnt/mesos/sandbox"
--strict="true" --switch_user="true" --systemd_enable_support="true" --systemd_runtime_directory="/run/systemd/system"
--version="false" --work_dir="/tmp/Endpoint_SlaveEndpointTest_UnauthorizedRequest_0_cY1nLR"
I0515 23:03:24.420524 31863 credentials.hpp:86] Loading credential for authentication from
'/tmp/Endpoint_SlaveEndpointTest_UnauthorizedRequest_0_1j65cB/credential'
I0515 23:03:24.420696 31863 slave.cpp:258] Agent using credential for: test-principal
I0515 23:03:24.420717 31863 credentials.hpp:37] Loading credentials for authentication from
'/tmp/Endpoint_SlaveEndpointTest_UnauthorizedRequest_0_1j65cB/http_credentials'
I0515 23:03:24.420943 31863 http.cpp:975] Creating default 'basic' HTTP authenticator for
realm 'mesos-agent-readonly'
I0515 23:03:24.421077 31863 http.cpp:975] Creating default 'basic' HTTP authenticator for
realm 'mesos-agent-readwrite'
I0515 23:03:24.422317 31863 slave.cpp:529] Agent resources: cpus(*):2; mem(*):1024; disk(*):1024;
ports(*):[31000-32000]
I0515 23:03:24.422390 31863 slave.cpp:537] Agent attributes: [  ]
I0515 23:03:24.422404 31863 slave.cpp:542] Agent hostname: c809bf5962bb
I0515 23:03:24.422539 31853 status_update_manager.cpp:177] Pausing sending status updates
I0515 23:03:24.423748 31846 state.cpp:62] Recovering state from '/tmp/Endpoint_SlaveEndpointTest_UnauthorizedRequest_0_cY1nLR/meta'
I0515 23:03:24.424090 31856 status_update_manager.cpp:203] Recovering status update manager
I0515 23:03:24.424268 31846 containerizer.cpp:608] Recovering containerizer
I0515 23:03:24.425539 31850 provisioner.cpp:410] Provisioner recovery complete
I0515 23:03:24.425938 31863 slave.cpp:5974] Finished recovery
I0515 23:03:24.426383 31863 slave.cpp:6156] Querying resource estimator for oversubscribable
resources
I0515 23:03:24.426725 31867 slave.cpp:6170] Received oversubscribable resources {} from the
resource estimator
I0515 23:03:24.429033 31860 process.cpp:3730] Handling HTTP event for process 'slave(749)'
with path: '/slave(749)/monitor/statistics'
I0515 23:03:24.430204 31845 http.cpp:1115] HTTP GET for /slave(749)/monitor/statistics from
172.17.0.3:56820
I0515 23:03:24.430281 31845 http.cpp:936] Authorizing principal 'test-principal' to GET the
'/monitor/statistics' endpoint
I0515 23:03:24.432344 31846 slave.cpp:794] Agent terminating
[       OK ] Endpoint/SlaveEndpointTest.UnauthorizedRequest/0 (24 ms)
[ RUN      ] Endpoint/SlaveEndpointTest.UnauthorizedRequest/1
I0515 23:03:24.441426 31825 containerizer.cpp:221] Using isolation: posix/cpu,posix/mem,filesystem/posix,network/cni
W0515 23:03:24.441905 31825 backend.cpp:76] Failed to create 'aufs' backend: AufsBackend requires
root privileges
W0515 23:03:24.442025 31825 backend.cpp:76] Failed to create 'bind' backend: BindBackend requires
root privileges
I0515 23:03:24.442065 31825 provisioner.cpp:249] Using default backend 'copy'
I0515 23:03:24.444958 31867 slave.cpp:225] Mesos agent started on (750)@172.17.0.3:37997
I0515 23:03:24.444983 31867 slave.cpp:226] Flags at startup: --acls="" --appc_simple_discovery_uri_prefix="http://"
--appc_store_dir="/tmp/mesos/store/appc" --authenticate_http_readonly="true" --authenticate_http_readwrite="true"
--authenticatee="crammd5" --authentication_backoff_factor="1secs" --authorizer="local" --cgroups_cpu_enable_pids_and_tids_count="false"
--cgroups_enable_cfs="false" --cgroups_hierarchy="/sys/fs/cgroup" --cgroups_limit_swap="false"
--cgroups_root="mesos" --container_disk_watch_interval="15secs" --containerizers="mesos" --credential="/tmp/Endpoint_SlaveEndpointTest_UnauthorizedRequest_1_0cChcx/credential"
--default_role="*" --disk_watch_interval="1mins" --docker="docker" --docker_kill_orphans="true"
--docker_registry="https://registry-1.docker.io" --docker_remove_delay="6hrs" --docker_socket="/var/run/docker.sock"
--docker_stop_timeout="0ns" --docker_store_dir="/tmp/mesos/store/docker" --docker_volume_checkpoint_dir="/var/run/mesos/isolators/docker/volume"
--enforce_container_disk_quota="false" --executor_registration_timeout="1mins" --executor_shutdown_grace_period="5secs"
--fetcher_cache_dir="/tmp/Endpoint_SlaveEndpointTest_UnauthorizedRequest_1_0cChcx/fetch" --fetcher_cache_size="2GB"
--frameworks_home="" --gc_delay="1weeks" --gc_disk_headroom="0.1" --hadoop_home="" --help="false"
--hostname_lookup="true" --http_command_executor="false" --http_credentials="/tmp/Endpoint_SlaveEndpointTest_UnauthorizedRequest_1_0cChcx/http_credentials"
--http_heartbeat_interval="30secs" --initialize_driver_logging="true" --isolation="posix/cpu,posix/mem"
--launcher="posix" --launcher_dir="/mesos/mesos-1.4.0/_build/src" --logbufsecs="0" --logging_level="INFO"
--max_completed_executors_per_framework="150" --oversubscribed_resources_interval="15secs"
--perf_duration="10secs" --perf_interval="1mins" --port="5051" --qos_correction_interval_min="0ns"
--quiet="false" --recover="reconnect" --recovery_timeout="15mins" --registration_backoff_factor="10ms"
--resources="cpus:2;gpus:0;mem:1024;disk:1024;ports:[31000-32000]" --revocable_cpu_low_priority="true"
--runtime_dir="/tmp/Endpoint_SlaveEndpointTest_UnauthorizedRequest_1_0cChcx" --sandbox_directory="/mnt/mesos/sandbox"
--strict="true" --switch_user="true" --systemd_enable_support="true" --systemd_runtime_directory="/run/systemd/system"
--version="false" --work_dir="/tmp/Endpoint_SlaveEndpointTest_UnauthorizedRequest_1_YPgVGN"
I0515 23:03:24.445372 31867 credentials.hpp:86] Loading credential for authentication from
'/tmp/Endpoint_SlaveEndpointTest_UnauthorizedRequest_1_0cChcx/credential'
I0515 23:03:24.445520 31867 slave.cpp:258] Agent using credential for: test-principal
I0515 23:03:24.445541 31867 credentials.hpp:37] Loading credentials for authentication from
'/tmp/Endpoint_SlaveEndpointTest_UnauthorizedRequest_1_0cChcx/http_credentials'
I0515 23:03:24.445762 31867 http.cpp:975] Creating default 'basic' HTTP authenticator for
realm 'mesos-agent-readonly'
I0515 23:03:24.445919 31867 http.cpp:975] Creating default 'basic' HTTP authenticator for
realm 'mesos-agent-readwrite'
I0515 23:03:24.447219 31867 slave.cpp:529] Agent resources: cpus(*):2; mem(*):1024; disk(*):1024;
ports(*):[31000-32000]
I0515 23:03:24.447299 31867 slave.cpp:537] Agent attributes: [  ]
I0515 23:03:24.447317 31867 slave.cpp:542] Agent hostname: c809bf5962bb
I0515 23:03:24.447499 31866 status_update_manager.cpp:177] Pausing sending status updates
I0515 23:03:24.449033 31847 state.cpp:62] Recovering state from '/tmp/Endpoint_SlaveEndpointTest_UnauthorizedRequest_1_YPgVGN/meta'
I0515 23:03:24.449431 31846 status_update_manager.cpp:203] Recovering status update manager
I0515 23:03:24.449620 31862 containerizer.cpp:608] Recovering containerizer
I0515 23:03:24.451076 31867 provisioner.cpp:410] Provisioner recovery complete
I0515 23:03:24.451422 31845 slave.cpp:5974] Finished recovery
I0515 23:03:24.451885 31845 slave.cpp:6156] Querying resource estimator for oversubscribable
resources
I0515 23:03:24.452149 31851 slave.cpp:6170] Received oversubscribable resources {} from the
resource estimator
I0515 23:03:24.454916 31855 process.cpp:3730] Handling HTTP event for process 'slave(750)'
with path: '/slave(750)/monitor/statistics.json'
I0515 23:03:24.456171 31867 http.cpp:1115] HTTP GET for /slave(750)/monitor/statistics.json
from 172.17.0.3:56822
I0515 23:03:24.456238 31867 http.cpp:936] Authorizing principal 'test-principal' to GET the
'/monitor/statistics.json' endpoint
I0515 23:03:24.458256 31844 slave.cpp:794] Agent terminating
[       OK ] Endpoint/SlaveEndpointTest.UnauthorizedRequest/1 (25 ms)
[ RUN      ] Endpoint/SlaveEndpointTest.UnauthorizedRequest/2
I0515 23:03:24.467352 31825 containerizer.cpp:221] Using isolation: posix/cpu,posix/mem,filesystem/posix,network/cni
W0515 23:03:24.467825 31825 backend.cpp:76] Failed to create 'aufs' backend: AufsBackend requires
root privileges
W0515 23:03:24.467928 31825 backend.cpp:76] Failed to create 'bind' backend: BindBackend requires
root privileges
I0515 23:03:24.467962 31825 provisioner.cpp:249] Using default backend 'copy'
I0515 23:03:24.470818 31867 slave.cpp:225] Mesos agent started on (751)@172.17.0.3:37997
I0515 23:03:24.470842 31867 slave.cpp:226] Flags at startup: --acls="" --appc_simple_discovery_uri_prefix="http://"
--appc_store_dir="/tmp/mesos/store/appc" --authenticate_http_readonly="true" --authenticate_http_readwrite="true"
--authenticatee="crammd5" --authentication_backoff_factor="1secs" --authorizer="local" --cgroups_cpu_enable_pids_and_tids_count="false"
--cgroups_enable_cfs="false" --cgroups_hierarchy="/sys/fs/cgroup" --cgroups_limit_swap="false"
--cgroups_root="mesos" --container_disk_watch_interval="15secs" --containerizers="mesos" --credential="/tmp/Endpoint_SlaveEndpointTest_UnauthorizedRequest_2_iMJPqt/credential"
--default_role="*" --disk_watch_interval="1mins" --docker="docker" --docker_kill_orphans="true"
--docker_registry="https://registry-1.docker.io" --docker_remove_delay="6hrs" --docker_socket="/var/run/docker.sock"
--docker_stop_timeout="0ns" --docker_store_dir="/tmp/mesos/store/docker" --docker_volume_checkpoint_dir="/var/run/mesos/isolators/docker/volume"
--enforce_container_disk_quota="false" --executor_registration_timeout="1mins" --executor_shutdown_grace_period="5secs"
--fetcher_cache_dir="/tmp/Endpoint_SlaveEndpointTest_UnauthorizedRequest_2_iMJPqt/fetch" --fetcher_cache_size="2GB"
--frameworks_home="" --gc_delay="1weeks" --gc_disk_headroom="0.1" --hadoop_home="" --help="false"
--hostname_lookup="true" --http_command_executor="false" --http_credentials="/tmp/Endpoint_SlaveEndpointTest_UnauthorizedRequest_2_iMJPqt/http_credentials"
--http_heartbeat_interval="30secs" --initialize_driver_logging="true" --isolation="posix/cpu,posix/mem"
--launcher="posix" --launcher_dir="/mesos/mesos-1.4.0/_build/src" --logbufsecs="0" --logging_level="INFO"
--max_completed_executors_per_framework="150" --oversubscribed_resources_interval="15secs"
--perf_duration="10secs" --perf_interval="1mins" --port="5051" --qos_correction_interval_min="0ns"
--quiet="false" --recover="reconnect" --recovery_timeout="15mins" --registration_backoff_factor="10ms"
--resources="cpus:2;gpus:0;mem:1024;disk:1024;ports:[31000-32000]" --revocable_cpu_low_priority="true"
--runtime_dir="/tmp/Endpoint_SlaveEndpointTest_UnauthorizedRequest_2_iMJPqt" --sandbox_directory="/mnt/mesos/sandbox"
--strict="true" --switch_user="true" --systemd_enable_support="true" --systemd_runtime_directory="/run/systemd/system"
--version="false" --work_dir="/tmp/Endpoint_SlaveEndpointTest_UnauthorizedRequest_2_z4lCRJ"
I0515 23:03:24.471209 31867 credentials.hpp:86] Loading credential for authentication from
'/tmp/Endpoint_SlaveEndpointTest_UnauthorizedRequest_2_iMJPqt/credential'
I0515 23:03:24.471352 31867 slave.cpp:258] Agent using credential for: test-principal
I0515 23:03:24.471374 31867 credentials.hpp:37] Loading credentials for authentication from
'/tmp/Endpoint_SlaveEndpointTest_UnauthorizedRequest_2_iMJPqt/http_credentials'
I0515 23:03:24.471590 31867 http.cpp:975] Creating default 'basic' HTTP authenticator for
realm 'mesos-agent-readonly'
I0515 23:03:24.471779 31867 http.cpp:975] Creating default 'basic' HTTP authenticator for
realm 'mesos-agent-readwrite'
I0515 23:03:24.473011 31867 slave.cpp:529] Agent resources: cpus(*):2; mem(*):1024; disk(*):1024;
ports(*):[31000-32000]
I0515 23:03:24.473088 31867 slave.cpp:537] Agent attributes: [  ]
I0515 23:03:24.473101 31867 slave.cpp:542] Agent hostname: c809bf5962bb
I0515 23:03:24.473238 31855 status_update_manager.cpp:177] Pausing sending status updates
I0515 23:03:24.474670 31858 state.cpp:62] Recovering state from '/tmp/Endpoint_SlaveEndpointTest_UnauthorizedRequest_2_z4lCRJ/meta'
I0515 23:03:24.475033 31865 status_update_manager.cpp:203] Recovering status update manager
I0515 23:03:24.475281 31851 containerizer.cpp:608] Recovering containerizer
I0515 23:03:24.476685 31864 provisioner.cpp:410] Provisioner recovery complete
I0515 23:03:24.477144 31855 slave.cpp:5974] Finished recovery
I0515 23:03:24.477623 31855 slave.cpp:6156] Querying resource estimator for oversubscribable
resources
I0515 23:03:24.477886 31855 slave.cpp:6170] Received oversubscribable resources {} from the
resource estimator
I0515 23:03:24.480554 31853 process.cpp:3730] Handling HTTP event for process 'slave(751)'
with path: '/slave(751)/containers'
I0515 23:03:24.481789 31846 http.cpp:1115] HTTP GET for /slave(751)/containers from 172.17.0.3:56824
I0515 23:03:24.481869 31846 http.cpp:936] Authorizing principal 'test-principal' to GET the
'/containers' endpoint
I0515 23:03:24.484071 31848 slave.cpp:794] Agent terminating
[       OK ] Endpoint/SlaveEndpointTest.UnauthorizedRequest/2 (25 ms)
[ RUN      ] Endpoint/SlaveEndpointTest.NoAuthorizer/0
I0515 23:03:24.493860 31825 containerizer.cpp:221] Using isolation: posix/cpu,posix/mem,filesystem/posix,network/cni
W0515 23:03:24.494330 31825 backend.cpp:76] Failed to create 'aufs' backend: AufsBackend requires
root privileges
W0515 23:03:24.494431 31825 backend.cpp:76] Failed to create 'bind' backend: BindBackend requires
root privileges
I0515 23:03:24.494465 31825 provisioner.cpp:249] Using default backend 'copy'
I0515 23:03:24.496018 31825 cluster.cpp:448] Creating default 'local' authorizer
I0515 23:03:24.497560 31863 slave.cpp:225] Mesos agent started on (752)@172.17.0.3:37997
I0515 23:03:24.497583 31863 slave.cpp:226] Flags at startup: --acls="" --appc_simple_discovery_uri_prefix="http://"
--appc_store_dir="/tmp/mesos/store/appc" --authenticate_http_readonly="true" --authenticate_http_readwrite="true"
--authenticatee="crammd5" --authentication_backoff_factor="1secs" --authorizer="local" --cgroups_cpu_enable_pids_and_tids_count="false"
--cgroups_enable_cfs="false" --cgroups_hierarchy="/sys/fs/cgroup" --cgroups_limit_swap="false"
--cgroups_root="mesos" --container_disk_watch_interval="15secs" --containerizers="mesos" --credential="/tmp/Endpoint_SlaveEndpointTest_NoAuthorizer_0_j0SVUp/credential"
--default_role="*" --disk_watch_interval="1mins" --docker="docker" --docker_kill_orphans="true"
--docker_registry="https://registry-1.docker.io" --docker_remove_delay="6hrs" --docker_socket="/var/run/docker.sock"
--docker_stop_timeout="0ns" --docker_store_dir="/tmp/mesos/store/docker" --docker_volume_checkpoint_dir="/var/run/mesos/isolators/docker/volume"
--enforce_container_disk_quota="false" --executor_registration_timeout="1mins" --executor_shutdown_grace_period="5secs"
--fetcher_cache_dir="/tmp/Endpoint_SlaveEndpointTest_NoAuthorizer_0_j0SVUp/fetch" --fetcher_cache_size="2GB"
--frameworks_home="" --gc_delay="1weeks" --gc_disk_headroom="0.1" --hadoop_home="" --help="false"
--hostname_lookup="true" --http_command_executor="false" --http_credentials="/tmp/Endpoint_SlaveEndpointTest_NoAuthorizer_0_j0SVUp/http_credentials"
--http_heartbeat_interval="30secs" --initialize_driver_logging="true" --isolation="posix/cpu,posix/mem"
--launcher="posix" --launcher_dir="/mesos/mesos-1.4.0/_build/src" --logbufsecs="0" --logging_level="INFO"
--max_completed_executors_per_framework="150" --oversubscribed_resources_interval="15secs"
--perf_duration="10secs" --perf_interval="1mins" --port="5051" --qos_correction_interval_min="0ns"
--quiet="false" --recover="reconnect" --recovery_timeout="15mins" --registration_backoff_factor="10ms"
--resources="cpus:2;gpus:0;mem:1024;disk:1024;ports:[31000-32000]" --revocable_cpu_low_priority="true"
--runtime_dir="/tmp/Endpoint_SlaveEndpointTest_NoAuthorizer_0_j0SVUp" --sandbox_directory="/mnt/mesos/sandbox"
--strict="true" --switch_user="true" --systemd_enable_support="true" --systemd_runtime_directory="/run/systemd/system"
--version="false" --work_dir="/tmp/Endpoint_SlaveEndpointTest_NoAuthorizer_0_e09NhG"
I0515 23:03:24.497972 31863 credentials.hpp:86] Loading credential for authentication from
'/tmp/Endpoint_SlaveEndpointTest_NoAuthorizer_0_j0SVUp/credential'
I0515 23:03:24.498129 31863 slave.cpp:258] Agent using credential for: test-principal
I0515 23:03:24.498159 31863 credentials.hpp:37] Loading credentials for authentication from
'/tmp/Endpoint_SlaveEndpointTest_NoAuthorizer_0_j0SVUp/http_credentials'
I0515 23:03:24.498431 31863 http.cpp:975] Creating default 'basic' HTTP authenticator for
realm 'mesos-agent-readonly'
I0515 23:03:24.498668 31863 http.cpp:975] Creating default 'basic' HTTP authenticator for
realm 'mesos-agent-readwrite'
I0515 23:03:24.499915 31863 slave.cpp:529] Agent resources: cpus(*):2; mem(*):1024; disk(*):1024;
ports(*):[31000-32000]
I0515 23:03:24.499994 31863 slave.cpp:537] Agent attributes: [  ]
I0515 23:03:24.500012 31863 slave.cpp:542] Agent hostname: c809bf5962bb
I0515 23:03:24.500176 31861 status_update_manager.cpp:177] Pausing sending status updates
I0515 23:03:24.501682 31845 state.cpp:62] Recovering state from '/tmp/Endpoint_SlaveEndpointTest_NoAuthorizer_0_e09NhG/meta'
I0515 23:03:24.502080 31859 status_update_manager.cpp:203] Recovering status update manager
I0515 23:03:24.502279 31857 containerizer.cpp:608] Recovering containerizer
I0515 23:03:24.503804 31861 provisioner.cpp:410] Provisioner recovery complete
I0515 23:03:24.504178 31863 slave.cpp:5974] Finished recovery
I0515 23:03:24.504685 31863 slave.cpp:6156] Querying resource estimator for oversubscribable
resources
I0515 23:03:24.504966 31856 slave.cpp:6170] Received oversubscribable resources {} from the
resource estimator
I0515 23:03:24.507633 31860 process.cpp:3730] Handling HTTP event for process 'slave(752)'
with path: '/slave(752)/monitor/statistics'
I0515 23:03:24.508929 31850 http.cpp:1115] HTTP GET for /slave(752)/monitor/statistics from
172.17.0.3:56826
I0515 23:03:24.509018 31850 http.cpp:936] Authorizing principal 'test-principal' to GET the
'/monitor/statistics' endpoint
I0515 23:03:24.512054 31857 slave.cpp:794] Agent terminating
[       OK ] Endpoint/SlaveEndpointTest.NoAuthorizer/0 (27 ms)
[ RUN      ] Endpoint/SlaveEndpointTest.NoAuthorizer/1
I0515 23:03:24.521894 31825 containerizer.cpp:221] Using isolation: posix/cpu,posix/mem,filesystem/posix,network/cni
W0515 23:03:24.522363 31825 backend.cpp:76] Failed to create 'aufs' backend: AufsBackend requires
root privileges
W0515 23:03:24.522464 31825 backend.cpp:76] Failed to create 'bind' backend: BindBackend requires
root privileges
I0515 23:03:24.522509 31825 provisioner.cpp:249] Using default backend 'copy'
I0515 23:03:24.523950 31825 cluster.cpp:448] Creating default 'local' authorizer
I0515 23:03:24.525400 31854 slave.cpp:225] Mesos agent started on (753)@172.17.0.3:37997
I0515 23:03:24.525441 31854 slave.cpp:226] Flags at startup: --acls="" --appc_simple_discovery_uri_prefix="http://"
--appc_store_dir="/tmp/mesos/store/appc" --authenticate_http_readonly="true" --authenticate_http_readwrite="true"
--authenticatee="crammd5" --authentication_backoff_factor="1secs" --authorizer="local" --cgroups_cpu_enable_pids_and_tids_count="false"
--cgroups_enable_cfs="false" --cgroups_hierarchy="/sys/fs/cgroup" --cgroups_limit_swap="false"
--cgroups_root="mesos" --container_disk_watch_interval="15secs" --containerizers="mesos" --credential="/tmp/Endpoint_SlaveEndpointTest_NoAuthorizer_1_ljKvFm/credential"
--default_role="*" --disk_watch_interval="1mins" --docker="docker" --docker_kill_orphans="true"
--docker_registry="https://registry-1.docker.io" --docker_remove_delay="6hrs" --docker_socket="/var/run/docker.sock"
--docker_stop_timeout="0ns" --docker_store_dir="/tmp/mesos/store/docker" --docker_volume_checkpoint_dir="/var/run/mesos/isolators/docker/volume"
--enforce_container_disk_quota="false" --executor_registration_timeout="1mins" --executor_shutdown_grace_period="5secs"
--fetcher_cache_dir="/tmp/Endpoint_SlaveEndpointTest_NoAuthorizer_1_ljKvFm/fetch" --fetcher_cache_size="2GB"
--frameworks_home="" --gc_delay="1weeks" --gc_disk_headroom="0.1" --hadoop_home="" --help="false"
--hostname_lookup="true" --http_command_executor="false" --http_credentials="/tmp/Endpoint_SlaveEndpointTest_NoAuthorizer_1_ljKvFm/http_credentials"
--http_heartbeat_interval="30secs" --initialize_driver_logging="true" --isolation="posix/cpu,posix/mem"
--launcher="posix" --launcher_dir="/mesos/mesos-1.4.0/_build/src" --logbufsecs="0" --logging_level="INFO"
--max_completed_executors_per_framework="150" --oversubscribed_resources_interval="15secs"
--perf_duration="10secs" --perf_interval="1mins" --port="5051" --qos_correction_interval_min="0ns"
--quiet="false" --recover="reconnect" --recovery_timeout="15mins" --registration_backoff_factor="10ms"
--resources="cpus:2;gpus:0;mem:1024;disk:1024;ports:[31000-32000]" --revocable_cpu_low_priority="true"
--runtime_dir="/tmp/Endpoint_SlaveEndpointTest_NoAuthorizer_1_ljKvFm" --sandbox_directory="/mnt/mesos/sandbox"
--strict="true" --switch_user="true" --systemd_enable_support="true" --systemd_runtime_directory="/run/systemd/system"
--version="false" --work_dir="/tmp/Endpoint_SlaveEndpointTest_NoAuthorizer_1_RKXeYC"
I0515 23:03:24.525835 31854 credentials.hpp:86] Loading credential for authentication from
'/tmp/Endpoint_SlaveEndpointTest_NoAuthorizer_1_ljKvFm/credential'
I0515 23:03:24.525979 31854 slave.cpp:258] Agent using credential for: test-principal
I0515 23:03:24.526000 31854 credentials.hpp:37] Loading credentials for authentication from
'/tmp/Endpoint_SlaveEndpointTest_NoAuthorizer_1_ljKvFm/http_credentials'
I0515 23:03:24.526221 31854 http.cpp:975] Creating default 'basic' HTTP authenticator for
realm 'mesos-agent-readonly'
I0515 23:03:24.526353 31854 http.cpp:975] Creating default 'basic' HTTP authenticator for
realm 'mesos-agent-readwrite'
I0515 23:03:24.527758 31854 slave.cpp:529] Agent resources: cpus(*):2; mem(*):1024; disk(*):1024;
ports(*):[31000-32000]
I0515 23:03:24.527834 31854 slave.cpp:537] Agent attributes: [  ]
I0515 23:03:24.527848 31854 slave.cpp:542] Agent hostname: c809bf5962bb
I0515 23:03:24.527976 31859 status_update_manager.cpp:177] Pausing sending status updates
I0515 23:03:24.529332 31850 state.cpp:62] Recovering state from '/tmp/Endpoint_SlaveEndpointTest_NoAuthorizer_1_RKXeYC/meta'
I0515 23:03:24.529678 31845 status_update_manager.cpp:203] Recovering status update manager
I0515 23:03:24.529870 31855 containerizer.cpp:608] Recovering containerizer
I0515 23:03:24.531280 31858 provisioner.cpp:410] Provisioner recovery complete
I0515 23:03:24.531673 31856 slave.cpp:5974] Finished recovery
I0515 23:03:24.532158 31856 slave.cpp:6156] Querying resource estimator for oversubscribable
resources
I0515 23:03:24.532414 31847 slave.cpp:6170] Received oversubscribable resources {} from the
resource estimator
I0515 23:03:24.534883 31859 process.cpp:3730] Handling HTTP event for process 'slave(753)'
with path: '/slave(753)/monitor/statistics.json'
I0515 23:03:24.536168 31856 http.cpp:1115] HTTP GET for /slave(753)/monitor/statistics.json
from 172.17.0.3:56828
I0515 23:03:24.536247 31856 http.cpp:936] Authorizing principal 'test-principal' to GET the
'/monitor/statistics.json' endpoint
I0515 23:03:24.539481 31850 slave.cpp:794] Agent terminating
[       OK ] Endpoint/SlaveEndpointTest.NoAuthorizer/1 (26 ms)
[ RUN      ] Endpoint/SlaveEndpointTest.NoAuthorizer/2
I0515 23:03:24.548823 31825 containerizer.cpp:221] Using isolation: posix/cpu,posix/mem,filesystem/posix,network/cni
W0515 23:03:24.549274 31825 backend.cpp:76] Failed to create 'aufs' backend: AufsBackend requires
root privileges
W0515 23:03:24.549377 31825 backend.cpp:76] Failed to create 'bind' backend: BindBackend requires
root privileges
I0515 23:03:24.549413 31825 provisioner.cpp:249] Using default backend 'copy'
I0515 23:03:24.550779 31825 cluster.cpp:448] Creating default 'local' authorizer
I0515 23:03:24.552276 31848 slave.cpp:225] Mesos agent started on (754)@172.17.0.3:37997
I0515 23:03:24.552296 31848 slave.cpp:226] Flags at startup: --acls="" --appc_simple_discovery_uri_prefix="http://"
--appc_store_dir="/tmp/mesos/store/appc" --authenticate_http_readonly="true" --authenticate_http_readwrite="true"
--authenticatee="crammd5" --authentication_backoff_factor="1secs" --authorizer="local" --cgroups_cpu_enable_pids_and_tids_count="false"
--cgroups_enable_cfs="false" --cgroups_hierarchy="/sys/fs/cgroup" --cgroups_limit_swap="false"
--cgroups_root="mesos" --container_disk_watch_interval="15secs" --containerizers="mesos" --credential="/tmp/Endpoint_SlaveEndpointTest_NoAuthorizer_2_r20gGj/credential"
--default_role="*" --disk_watch_interval="1mins" --docker="docker" --docker_kill_orphans="true"
--docker_registry="https://registry-1.docker.io" --docker_remove_delay="6hrs" --docker_socket="/var/run/docker.sock"
--docker_stop_timeout="0ns" --docker_store_dir="/tmp/mesos/store/docker" --docker_volume_checkpoint_dir="/var/run/mesos/isolators/docker/volume"
--enforce_container_disk_quota="false" --executor_registration_timeout="1mins" --executor_shutdown_grace_period="5secs"
--fetcher_cache_dir="/tmp/Endpoint_SlaveEndpointTest_NoAuthorizer_2_r20gGj/fetch" --fetcher_cache_size="2GB"
--frameworks_home="" --gc_delay="1weeks" --gc_disk_headroom="0.1" --hadoop_home="" --help="false"
--hostname_lookup="true" --http_command_executor="false" --http_credentials="/tmp/Endpoint_SlaveEndpointTest_NoAuthorizer_2_r20gGj/http_credentials"
--http_heartbeat_interval="30secs" --initialize_driver_logging="true" --isolation="posix/cpu,posix/mem"
--launcher="posix" --launcher_dir="/mesos/mesos-1.4.0/_build/src" --logbufsecs="0" --logging_level="INFO"
--max_completed_executors_per_framework="150" --oversubscribed_resources_interval="15secs"
--perf_duration="10secs" --perf_interval="1mins" --port="5051" --qos_correction_interval_min="0ns"
--quiet="false" --recover="reconnect" --recovery_timeout="15mins" --registration_backoff_factor="10ms"
--resources="cpus:2;gpus:0;mem:1024;disk:1024;ports:[31000-32000]" --revocable_cpu_low_priority="true"
--runtime_dir="/tmp/Endpoint_SlaveEndpointTest_NoAuthorizer_2_r20gGj" --sandbox_directory="/mnt/mesos/sandbox"
--strict="true" --switch_user="true" --systemd_enable_support="true" --systemd_runtime_directory="/run/systemd/system"
--version="false" --work_dir="/tmp/Endpoint_SlaveEndpointTest_NoAuthorizer_2_cbxYUz"
I0515 23:03:24.552654 31848 credentials.hpp:86] Loading credential for authentication from
'/tmp/Endpoint_SlaveEndpointTest_NoAuthorizer_2_r20gGj/credential'
I0515 23:03:24.552826 31848 slave.cpp:258] Agent using credential for: test-principal
I0515 23:03:24.552850 31848 credentials.hpp:37] Loading credentials for authentication from
'/tmp/Endpoint_SlaveEndpointTest_NoAuthorizer_2_r20gGj/http_credentials'
I0515 23:03:24.553089 31848 http.cpp:975] Creating default 'basic' HTTP authenticator for
realm 'mesos-agent-readonly'
I0515 23:03:24.553246 31848 http.cpp:975] Creating default 'basic' HTTP authenticator for
realm 'mesos-agent-readwrite'
I0515 23:03:24.554608 31848 slave.cpp:529] Agent resources: cpus(*):2; mem(*):1024; disk(*):1024;
ports(*):[31000-32000]
I0515 23:03:24.554682 31848 slave.cpp:537] Agent attributes: [  ]
I0515 23:03:24.554697 31848 slave.cpp:542] Agent hostname: c809bf5962bb
I0515 23:03:24.554816 31866 status_update_manager.cpp:177] Pausing sending status updates
I0515 23:03:24.556236 31858 state.cpp:62] Recovering state from '/tmp/Endpoint_SlaveEndpointTest_NoAuthorizer_2_cbxYUz/meta'
I0515 23:03:24.556632 31850 status_update_manager.cpp:203] Recovering status update manager
I0515 23:03:24.556802 31846 containerizer.cpp:608] Recovering containerizer
I0515 23:03:24.558099 31850 provisioner.cpp:410] Provisioner recovery complete
I0515 23:03:24.558470 31855 slave.cpp:5974] Finished recovery
I0515 23:03:24.558933 31855 slave.cpp:6156] Querying resource estimator for oversubscribable
resources
I0515 23:03:24.559216 31844 slave.cpp:6170] Received oversubscribable resources {} from the
resource estimator
I0515 23:03:24.561499 31850 process.cpp:3730] Handling HTTP event for process 'slave(754)'
with path: '/slave(754)/containers'
I0515 23:03:24.562711 31862 http.cpp:1115] HTTP GET for /slave(754)/containers from 172.17.0.3:56830
I0515 23:03:24.562784 31862 http.cpp:936] Authorizing principal 'test-principal' to GET the
'/containers' endpoint
I0515 23:03:24.565744 31851 slave.cpp:794] Agent terminating
[       OK ] Endpoint/SlaveEndpointTest.NoAuthorizer/2 (25 ms)
[----------] 9 tests from Endpoint/SlaveEndpointTest (234 ms total)

[----------] Global test environment tear-down
[==========] 1575 tests from 175 test cases ran. (604526 ms total)
[  PASSED  ] 1574 tests.
[  FAILED  ] 1 test, listed below:
[  FAILED  ] DefaultExecutorCheckTest.CommandCheckDeliveredAndReconciled

 1 FAILED TEST
  YOU HAVE 19 DISABLED TESTS

E0515 23:03:24.621899 31868 process.cpp:950] Failed to accept socket: future discarded
make[4]: *** [check-local] Error 1
make[4]: Leaving directory `/mesos/mesos-1.4.0/_build/src'
make[3]: *** [check-am] Error 2
make[3]: Leaving directory `/mesos/mesos-1.4.0/_build/src'
make[2]: *** [check] Error 2
make[2]: Leaving directory `/mesos/mesos-1.4.0/_build/src'
make[1]: *** [check-recursive] Error 1
make[1]: Leaving directory `/mesos/mesos-1.4.0/_build'
make: *** [distcheck] Error 1
+ docker rmi mesos-1494886930-15719
Untagged: mesos-1494886930-15719:latest
Deleted: sha256:bcc231bfd29689bd50c997275667c3b09f63ce85815aea83e8b2075079d3fbb6
Deleted: sha256:a2ee899a4af7c1b7ea159b79b8078ed5f52e3eb2b6cbb41650e1e666afc3e648
Deleted: sha256:b15970d13a7e1b3c15db1cdde3ee0a04262458556bb0ff374318d7009a8e9f7d
Deleted: sha256:ea1263006c8e0cd8d4b1001e927b2e5f3d7a9ff9fc39aea286b38e6a79a299b0
Deleted: sha256:9d14ec77497182e463672b44261470d84599cc26dd0066ec4c8f9aad248dcaa4
Deleted: sha256:2c1b77ca59555967dc30a498071565f6891cdb23c4b138187bc4297e2bf03a18
Deleted: sha256:b8d24f4213aed195554c1f066c6e4268d3ffc3c215895b4bf99dec310b1422a1
Deleted: sha256:0252f02789ce7dd508f519d9b3989acd773910641abdfea70b8958770c49ba87
Deleted: sha256:c82f3971e657264644e60395a88a91d6daac968f2e1a045022cbc79b3ced9f5f
Deleted: sha256:3fe1331c00565afaeebee75551ea1e6997b3611be4aff0879ed3650185e85c0d
Deleted: sha256:195bce3290bdaaa2da5ce33fdcabb4dbe27a4145eaa45f7e30f13d18f8c80a87
Deleted: sha256:211d5006e364ae0d0697c5af4b37245f5202d0fea663fb892c037a46d30f998c
Deleted: sha256:3bef1e731b8367ea74a024770c154647d75d5a1516d8cd2fe5c2ce725c4ee9c9
Deleted: sha256:32be65916b4fad360ec7cb9ded40d2756883bf7a41cb7df6f385f8019857060c
Deleted: sha256:cf8d47ef95f05fb9ee252ba2093afb2c625b2eab074c811127d40bdbc836fe11
Deleted: sha256:e7b7f2fd112018ecad603d838962df519941cb04e330ce838d92266025ae57ec
Deleted: sha256:764d62c07e8dce60f64bb3bb906c13d5712481ac259094bebb424c1c23a262e6
Deleted: sha256:8debc1ef6cbcb9635b9b2b2aee6489bdaeed14c3f48c8d12a2224b63bed00b07
Deleted: sha256:28fd0449a1d5b77f8430684cd69fd41ad4521f464918512152dc9734a16cf8d8
Deleted: sha256:ef5cf81b3fe8ba49a84c54bfefa7f9f233b9ba19d221b2388b28173e4549d3eb
Deleted: sha256:ddf0b5eac3f968a4c5ffa959ab61fa47b2d3404d3ad3c7007c002eddf9b5030b
Deleted: sha256:83d87642cda76d53284a4fff31ac0c4c0bc57ae05482191b1cc7bb9562ab53f0
Deleted: sha256:80c4f04e610d6c3b1d513c95f9aab124c6e106b06453c536bb3f590d5b7fa580
Deleted: sha256:1e17d1b32e92d51acc3db553b702fd63ba21cd7da8085219629db78f56f24838
Deleted: sha256:56c5bb73408989d8890d56787ae98d79220aa62b34ed9e0a0384e540963cf6e4
Build step 'Execute shell' marked build as failure
Not sending mail to unregistered user xujyan@apple.com

Mime
View raw message