mesos-builds mailing list archives

Site index · List index
Message view « Date » · « Thread »
Top « Date » · « Thread »
From Apache Jenkins Server <jenk...@builds.apache.org>
Subject Build failed in Jenkins: Mesos-Buildbot » cmake,clang,--verbose,GLOG_v=1 MESOS_VERBOSE=1,ubuntu:14.04,(docker||Hadoop)&&(!ubuntu-us1)&&(!ubuntu-eu2) #3742
Date Mon, 29 May 2017 17:12:08 GMT
See <https://builds.apache.org/job/Mesos-Buildbot/BUILDTOOL=cmake,COMPILER=clang,CONFIGURATION=--verbose,ENVIRONMENT=GLOG_v=1%20MESOS_VERBOSE=1,OS=ubuntu%3A14.04,label_exp=(docker%7C%7CHadoop)&&(!ubuntu-us1)&&(!ubuntu-eu2)/3742/display/redirect>

------------------------------------------
[...truncated 27.42 MB...]
I0529 17:11:59.465250 30607 http.cpp:1115] HTTP GET for /slave(747)/monitor/statistics.json
from 172.17.0.2:47703
I0529 17:11:59.465287 30607 http.cpp:936] Authorizing principal 'test-principal' to GET the
'/monitor/statistics.json' endpoint
I0529 17:11:59.466558 30601 slave.cpp:801] Agent terminating
[       OK ] Endpoint/SlaveEndpointTest.AuthorizedRequest/1 (11 ms)
[ RUN      ] Endpoint/SlaveEndpointTest.AuthorizedRequest/2
I0529 17:11:59.471083 30601 containerizer.cpp:230] Using isolation: posix/cpu,posix/mem,filesystem/posix,network/cni,environment_secret
W0529 17:11:59.471323 30601 backend.cpp:76] Failed to create 'aufs' backend: AufsBackend requires
root privileges
W0529 17:11:59.471376 30601 backend.cpp:76] Failed to create 'bind' backend: BindBackend requires
root privileges
I0529 17:11:59.471395 30601 provisioner.cpp:255] Using default backend 'copy'
I0529 17:11:59.472198 30611 slave.cpp:232] Mesos agent started on (748)@172.17.0.2:40840
I0529 17:11:59.472225 30611 slave.cpp:233] Flags at startup: --acls="" --appc_simple_discovery_uri_prefix="http://"
--appc_store_dir="/tmp/mesos/store/appc" --authenticate_http_readonly="true" --authenticate_http_readwrite="true"
--authenticatee="crammd5" --authentication_backoff_factor="1secs" --authorizer="local" --cgroups_cpu_enable_pids_and_tids_count="false"
--cgroups_enable_cfs="false" --cgroups_hierarchy="/sys/fs/cgroup" --cgroups_limit_swap="false"
--cgroups_root="mesos" --container_disk_watch_interval="15secs" --containerizers="mesos" --credential="/tmp/Endpoint_SlaveEndpointTest_AuthorizedRequest_2_2defE7/credential"
--default_role="*" --disk_watch_interval="1mins" --docker="docker" --docker_kill_orphans="true"
--docker_registry="https://registry-1.docker.io" --docker_remove_delay="6hrs" --docker_socket="/var/run/docker.sock"
--docker_stop_timeout="0ns" --docker_store_dir="/tmp/mesos/store/docker" --docker_volume_checkpoint_dir="/var/run/mesos/isolators/docker/volume"
--enforce_container_disk_quota="false" --executor_registration_timeout="1mins" --executor_reregistration_timeout="2secs"
--executor_shutdown_grace_period="5secs" --fetcher_cache_dir="/tmp/Endpoint_SlaveEndpointTest_AuthorizedRequest_2_2defE7/fetch"
--fetcher_cache_size="2GB" --frameworks_home="" --gc_delay="1weeks" --gc_disk_headroom="0.1"
--hadoop_home="" --help="false" --hostname_lookup="true" --http_command_executor="false" --http_credentials="/tmp/Endpoint_SlaveEndpointTest_AuthorizedRequest_2_2defE7/http_credentials"
--http_heartbeat_interval="30secs" --initialize_driver_logging="true" --isolation="posix/cpu,posix/mem"
--launcher="posix" --launcher_dir="/mesos/build/src" --logbufsecs="0" --logging_level="INFO"
--max_completed_executors_per_framework="150" --oversubscribed_resources_interval="15secs"
--perf_duration="10secs" --perf_interval="1mins" --port="5051" --qos_correction_interval_min="0ns"
--quiet="false" --recover="reconnect" --recovery_timeout="15mins" --registration_backoff_factor="10ms"
--resources="cpus:2;gpus:0;mem:1024;disk:1024;ports:[31000-32000]" --revocable_cpu_low_priority="true"
--runtime_dir="/tmp/Endpoint_SlaveEndpointTest_AuthorizedRequest_2_2defE7" --sandbox_directory="/mnt/mesos/sandbox"
--strict="true" --switch_user="true" --systemd_enable_support="true" --systemd_runtime_directory="/run/systemd/system"
--version="false" --work_dir="/tmp/Endpoint_SlaveEndpointTest_AuthorizedRequest_2_6AOpPj"
I0529 17:11:59.472470 30611 credentials.hpp:86] Loading credential for authentication from
'/tmp/Endpoint_SlaveEndpointTest_AuthorizedRequest_2_2defE7/credential'
I0529 17:11:59.472561 30611 slave.cpp:265] Agent using credential for: test-principal
I0529 17:11:59.472579 30611 credentials.hpp:37] Loading credentials for authentication from
'/tmp/Endpoint_SlaveEndpointTest_AuthorizedRequest_2_2defE7/http_credentials'
I0529 17:11:59.472692 30611 http.cpp:975] Creating default 'basic' HTTP authenticator for
realm 'mesos-agent-readonly'
I0529 17:11:59.472757 30611 http.cpp:975] Creating default 'basic' HTTP authenticator for
realm 'mesos-agent-readwrite'
I0529 17:11:59.473237 30611 slave.cpp:536] Agent resources: cpus(*):2; mem(*):1024; disk(*):1024;
ports(*):[31000-32000]
I0529 17:11:59.473279 30611 slave.cpp:544] Agent attributes: [  ]
I0529 17:11:59.473291 30611 slave.cpp:549] Agent hostname: 7111186168cb
I0529 17:11:59.473387 30610 status_update_manager.cpp:177] Pausing sending status updates
I0529 17:11:59.473776 30612 state.cpp:62] Recovering state from '/tmp/Endpoint_SlaveEndpointTest_AuthorizedRequest_2_6AOpPj/meta'
I0529 17:11:59.474014 30617 status_update_manager.cpp:203] Recovering status update manager
I0529 17:11:59.474078 30617 containerizer.cpp:582] Recovering containerizer
I0529 17:11:59.474598 30609 provisioner.cpp:416] Provisioner recovery complete
I0529 17:11:59.474792 30604 slave.cpp:6083] Finished recovery
I0529 17:11:59.475188 30604 slave.cpp:6265] Querying resource estimator for oversubscribable
resources
I0529 17:11:59.475395 30604 slave.cpp:6279] Received oversubscribable resources {} from the
resource estimator
I0529 17:11:59.476205 30603 process.cpp:3730] Handling HTTP event for process 'slave(748)'
with path: '/slave(748)/containers'
I0529 17:11:59.476598 30602 http.cpp:1115] HTTP GET for /slave(748)/containers from 172.17.0.2:47704
I0529 17:11:59.476639 30602 http.cpp:936] Authorizing principal 'test-principal' to GET the
'/containers' endpoint
I0529 17:11:59.478245 30615 slave.cpp:801] Agent terminating
[       OK ] Endpoint/SlaveEndpointTest.AuthorizedRequest/2 (11 ms)
[ RUN      ] Endpoint/SlaveEndpointTest.UnauthorizedRequest/0
I0529 17:11:59.485780 30601 containerizer.cpp:230] Using isolation: posix/cpu,posix/mem,filesystem/posix,network/cni,environment_secret
W0529 17:11:59.486047 30601 backend.cpp:76] Failed to create 'aufs' backend: AufsBackend requires
root privileges
W0529 17:11:59.486133 30601 backend.cpp:76] Failed to create 'bind' backend: BindBackend requires
root privileges
I0529 17:11:59.486232 30601 provisioner.cpp:255] Using default backend 'copy'
I0529 17:11:59.487372 30611 slave.cpp:232] Mesos agent started on (749)@172.17.0.2:40840
I0529 17:11:59.487500 30611 slave.cpp:233] Flags at startup: --acls="" --appc_simple_discovery_uri_prefix="http://"
--appc_store_dir="/tmp/mesos/store/appc" --authenticate_http_readonly="true" --authenticate_http_readwrite="true"
--authenticatee="crammd5" --authentication_backoff_factor="1secs" --authorizer="local" --cgroups_cpu_enable_pids_and_tids_count="false"
--cgroups_enable_cfs="false" --cgroups_hierarchy="/sys/fs/cgroup" --cgroups_limit_swap="false"
--cgroups_root="mesos" --container_disk_watch_interval="15secs" --containerizers="mesos" --credential="/tmp/Endpoint_SlaveEndpointTest_UnauthorizedRequest_0_isYg3k/credential"
--default_role="*" --disk_watch_interval="1mins" --docker="docker" --docker_kill_orphans="true"
--docker_registry="https://registry-1.docker.io" --docker_remove_delay="6hrs" --docker_socket="/var/run/docker.sock"
--docker_stop_timeout="0ns" --docker_store_dir="/tmp/mesos/store/docker" --docker_volume_checkpoint_dir="/var/run/mesos/isolators/docker/volume"
--enforce_container_disk_quota="false" --executor_registration_timeout="1mins" --executor_reregistration_timeout="2secs"
--executor_shutdown_grace_period="5secs" --fetcher_cache_dir="/tmp/Endpoint_SlaveEndpointTest_UnauthorizedRequest_0_isYg3k/fetch"
--fetcher_cache_size="2GB" --frameworks_home="" --gc_delay="1weeks" --gc_disk_headroom="0.1"
--hadoop_home="" --help="false" --hostname_lookup="true" --http_command_executor="false" --http_credentials="/tmp/Endpoint_SlaveEndpointTest_UnauthorizedRequest_0_isYg3k/http_credentials"
--http_heartbeat_interval="30secs" --initialize_driver_logging="true" --isolation="posix/cpu,posix/mem"
--launcher="posix" --launcher_dir="/mesos/build/src" --logbufsecs="0" --logging_level="INFO"
--max_completed_executors_per_framework="150" --oversubscribed_resources_interval="15secs"
--perf_duration="10secs" --perf_interval="1mins" --port="5051" --qos_correction_interval_min="0ns"
--quiet="false" --recover="reconnect" --recovery_timeout="15mins" --registration_backoff_factor="10ms"
--resources="cpus:2;gpus:0;mem:1024;disk:1024;ports:[31000-32000]" --revocable_cpu_low_priority="true"
--runtime_dir="/tmp/Endpoint_SlaveEndpointTest_UnauthorizedRequest_0_isYg3k" --sandbox_directory="/mnt/mesos/sandbox"
--strict="true" --switch_user="true" --systemd_enable_support="true" --systemd_runtime_directory="/run/systemd/system"
--version="false" --work_dir="/tmp/Endpoint_SlaveEndpointTest_UnauthorizedRequest_0_wzz5bx"
I0529 17:11:59.487730 30611 credentials.hpp:86] Loading credential for authentication from
'/tmp/Endpoint_SlaveEndpointTest_UnauthorizedRequest_0_isYg3k/credential'
I0529 17:11:59.487848 30611 slave.cpp:265] Agent using credential for: test-principal
I0529 17:11:59.487879 30611 credentials.hpp:37] Loading credentials for authentication from
'/tmp/Endpoint_SlaveEndpointTest_UnauthorizedRequest_0_isYg3k/http_credentials'
I0529 17:11:59.488116 30611 http.cpp:975] Creating default 'basic' HTTP authenticator for
realm 'mesos-agent-readonly'
I0529 17:11:59.488248 30611 http.cpp:975] Creating default 'basic' HTTP authenticator for
realm 'mesos-agent-readwrite'
I0529 17:11:59.488708 30611 slave.cpp:536] Agent resources: cpus(*):2; mem(*):1024; disk(*):1024;
ports(*):[31000-32000]
I0529 17:11:59.488740 30611 slave.cpp:544] Agent attributes: [  ]
I0529 17:11:59.488749 30611 slave.cpp:549] Agent hostname: 7111186168cb
I0529 17:11:59.488842 30605 status_update_manager.cpp:177] Pausing sending status updates
I0529 17:11:59.489231 30611 state.cpp:62] Recovering state from '/tmp/Endpoint_SlaveEndpointTest_UnauthorizedRequest_0_wzz5bx/meta'
I0529 17:11:59.489358 30611 status_update_manager.cpp:203] Recovering status update manager
I0529 17:11:59.489408 30611 containerizer.cpp:582] Recovering containerizer
I0529 17:11:59.489964 30617 provisioner.cpp:416] Provisioner recovery complete
I0529 17:11:59.490193 30613 slave.cpp:6083] Finished recovery
I0529 17:11:59.490636 30613 slave.cpp:6265] Querying resource estimator for oversubscribable
resources
I0529 17:11:59.490830 30605 slave.cpp:6279] Received oversubscribable resources {} from the
resource estimator
I0529 17:11:59.491550 30612 process.cpp:3730] Handling HTTP event for process 'slave(749)'
with path: '/slave(749)/monitor/statistics'
I0529 17:11:59.491937 30603 http.cpp:1115] HTTP GET for /slave(749)/monitor/statistics from
172.17.0.2:47705
I0529 17:11:59.491973 30603 http.cpp:936] Authorizing principal 'test-principal' to GET the
'/monitor/statistics' endpoint
I0529 17:11:59.492928 30608 slave.cpp:801] Agent terminating
[       OK ] Endpoint/SlaveEndpointTest.UnauthorizedRequest/0 (12 ms)
[ RUN      ] Endpoint/SlaveEndpointTest.UnauthorizedRequest/1
I0529 17:11:59.498716 30601 containerizer.cpp:230] Using isolation: posix/cpu,posix/mem,filesystem/posix,network/cni,environment_secret
W0529 17:11:59.499052 30601 backend.cpp:76] Failed to create 'aufs' backend: AufsBackend requires
root privileges
W0529 17:11:59.499095 30601 backend.cpp:76] Failed to create 'bind' backend: BindBackend requires
root privileges
I0529 17:11:59.499111 30601 provisioner.cpp:255] Using default backend 'copy'
I0529 17:11:59.500389 30609 slave.cpp:232] Mesos agent started on (750)@172.17.0.2:40840
I0529 17:11:59.500416 30609 slave.cpp:233] Flags at startup: --acls="" --appc_simple_discovery_uri_prefix="http://"
--appc_store_dir="/tmp/mesos/store/appc" --authenticate_http_readonly="true" --authenticate_http_readwrite="true"
--authenticatee="crammd5" --authentication_backoff_factor="1secs" --authorizer="local" --cgroups_cpu_enable_pids_and_tids_count="false"
--cgroups_enable_cfs="false" --cgroups_hierarchy="/sys/fs/cgroup" --cgroups_limit_swap="false"
--cgroups_root="mesos" --container_disk_watch_interval="15secs" --containerizers="mesos" --credential="/tmp/Endpoint_SlaveEndpointTest_UnauthorizedRequest_1_JewTAy/credential"
--default_role="*" --disk_watch_interval="1mins" --docker="docker" --docker_kill_orphans="true"
--docker_registry="https://registry-1.docker.io" --docker_remove_delay="6hrs" --docker_socket="/var/run/docker.sock"
--docker_stop_timeout="0ns" --docker_store_dir="/tmp/mesos/store/docker" --docker_volume_checkpoint_dir="/var/run/mesos/isolators/docker/volume"
--enforce_container_disk_quota="false" --executor_registration_timeout="1mins" --executor_reregistration_timeout="2secs"
--executor_shutdown_grace_period="5secs" --fetcher_cache_dir="/tmp/Endpoint_SlaveEndpointTest_UnauthorizedRequest_1_JewTAy/fetch"
--fetcher_cache_size="2GB" --frameworks_home="" --gc_delay="1weeks" --gc_disk_headroom="0.1"
--hadoop_home="" --help="false" --hostname_lookup="true" --http_command_executor="false" --http_credentials="/tmp/Endpoint_SlaveEndpointTest_UnauthorizedRequest_1_JewTAy/http_credentials"
--http_heartbeat_interval="30secs" --initialize_driver_logging="true" --isolation="posix/cpu,posix/mem"
--launcher="posix" --launcher_dir="/mesos/build/src" --logbufsecs="0" --logging_level="INFO"
--max_completed_executors_per_framework="150" --oversubscribed_resources_interval="15secs"
--perf_duration="10secs" --perf_interval="1mins" --port="5051" --qos_correction_interval_min="0ns"
--quiet="false" --recover="reconnect" --recovery_timeout="15mins" --registration_backoff_factor="10ms"
--resources="cpus:2;gpus:0;mem:1024;disk:1024;ports:[31000-32000]" --revocable_cpu_low_priority="true"
--runtime_dir="/tmp/Endpoint_SlaveEndpointTest_UnauthorizedRequest_1_JewTAy" --sandbox_directory="/mnt/mesos/sandbox"
--strict="true" --switch_user="true" --systemd_enable_support="true" --systemd_runtime_directory="/run/systemd/system"
--version="false" --work_dir="/tmp/Endpoint_SlaveEndpointTest_UnauthorizedRequest_1_cRlFHK"
I0529 17:11:59.500716 30609 credentials.hpp:86] Loading credential for authentication from
'/tmp/Endpoint_SlaveEndpointTest_UnauthorizedRequest_1_JewTAy/credential'
I0529 17:11:59.500803 30609 slave.cpp:265] Agent using credential for: test-principal
I0529 17:11:59.500818 30609 credentials.hpp:37] Loading credentials for authentication from
'/tmp/Endpoint_SlaveEndpointTest_UnauthorizedRequest_1_JewTAy/http_credentials'
I0529 17:11:59.500931 30609 http.cpp:975] Creating default 'basic' HTTP authenticator for
realm 'mesos-agent-readonly'
I0529 17:11:59.501001 30609 http.cpp:975] Creating default 'basic' HTTP authenticator for
realm 'mesos-agent-readwrite'
I0529 17:11:59.501401 30609 slave.cpp:536] Agent resources: cpus(*):2; mem(*):1024; disk(*):1024;
ports(*):[31000-32000]
I0529 17:11:59.501431 30609 slave.cpp:544] Agent attributes: [  ]
I0529 17:11:59.501440 30609 slave.cpp:549] Agent hostname: 7111186168cb
I0529 17:11:59.501499 30608 status_update_manager.cpp:177] Pausing sending status updates
I0529 17:11:59.501915 30615 state.cpp:62] Recovering state from '/tmp/Endpoint_SlaveEndpointTest_UnauthorizedRequest_1_cRlFHK/meta'
I0529 17:11:59.502148 30614 status_update_manager.cpp:203] Recovering status update manager
I0529 17:11:59.502287 30610 containerizer.cpp:582] Recovering containerizer
I0529 17:11:59.502794 30609 provisioner.cpp:416] Provisioner recovery complete
I0529 17:11:59.502959 30606 slave.cpp:6083] Finished recovery
I0529 17:11:59.503439 30606 slave.cpp:6265] Querying resource estimator for oversubscribable
resources
I0529 17:11:59.503527 30606 slave.cpp:6279] Received oversubscribable resources {} from the
resource estimator
I0529 17:11:59.504202 30617 process.cpp:3730] Handling HTTP event for process 'slave(750)'
with path: '/slave(750)/monitor/statistics.json'
I0529 17:11:59.504621 30607 http.cpp:1115] HTTP GET for /slave(750)/monitor/statistics.json
from 172.17.0.2:47706
I0529 17:11:59.504657 30607 http.cpp:936] Authorizing principal 'test-principal' to GET the
'/monitor/statistics.json' endpoint
I0529 17:11:59.505691 30615 slave.cpp:801] Agent terminating
[       OK ] Endpoint/SlaveEndpointTest.UnauthorizedRequest/1 (13 ms)
[ RUN      ] Endpoint/SlaveEndpointTest.UnauthorizedRequest/2
I0529 17:11:59.510726 30601 containerizer.cpp:230] Using isolation: posix/cpu,posix/mem,filesystem/posix,network/cni,environment_secret
W0529 17:11:59.511018 30601 backend.cpp:76] Failed to create 'aufs' backend: AufsBackend requires
root privileges
W0529 17:11:59.511065 30601 backend.cpp:76] Failed to create 'bind' backend: BindBackend requires
root privileges
I0529 17:11:59.511083 30601 provisioner.cpp:255] Using default backend 'copy'
I0529 17:11:59.512154 30606 slave.cpp:232] Mesos agent started on (751)@172.17.0.2:40840
I0529 17:11:59.512181 30606 slave.cpp:233] Flags at startup: --acls="" --appc_simple_discovery_uri_prefix="http://"
--appc_store_dir="/tmp/mesos/store/appc" --authenticate_http_readonly="true" --authenticate_http_readwrite="true"
--authenticatee="crammd5" --authentication_backoff_factor="1secs" --authorizer="local" --cgroups_cpu_enable_pids_and_tids_count="false"
--cgroups_enable_cfs="false" --cgroups_hierarchy="/sys/fs/cgroup" --cgroups_limit_swap="false"
--cgroups_root="mesos" --container_disk_watch_interval="15secs" --containerizers="mesos" --credential="/tmp/Endpoint_SlaveEndpointTest_UnauthorizedRequest_2_mozGgM/credential"
--default_role="*" --disk_watch_interval="1mins" --docker="docker" --docker_kill_orphans="true"
--docker_registry="https://registry-1.docker.io" --docker_remove_delay="6hrs" --docker_socket="/var/run/docker.sock"
--docker_stop_timeout="0ns" --docker_store_dir="/tmp/mesos/store/docker" --docker_volume_checkpoint_dir="/var/run/mesos/isolators/docker/volume"
--enforce_container_disk_quota="false" --executor_registration_timeout="1mins" --executor_reregistration_timeout="2secs"
--executor_shutdown_grace_period="5secs" --fetcher_cache_dir="/tmp/Endpoint_SlaveEndpointTest_UnauthorizedRequest_2_mozGgM/fetch"
--fetcher_cache_size="2GB" --frameworks_home="" --gc_delay="1weeks" --gc_disk_headroom="0.1"
--hadoop_home="" --help="false" --hostname_lookup="true" --http_command_executor="false" --http_credentials="/tmp/Endpoint_SlaveEndpointTest_UnauthorizedRequest_2_mozGgM/http_credentials"
--http_heartbeat_interval="30secs" --initialize_driver_logging="true" --isolation="posix/cpu,posix/mem"
--launcher="posix" --launcher_dir="/mesos/build/src" --logbufsecs="0" --logging_level="INFO"
--max_completed_executors_per_framework="150" --oversubscribed_resources_interval="15secs"
--perf_duration="10secs" --perf_interval="1mins" --port="5051" --qos_correction_interval_min="0ns"
--quiet="false" --recover="reconnect" --recovery_timeout="15mins" --registration_backoff_factor="10ms"
--resources="cpus:2;gpus:0;mem:1024;disk:1024;ports:[31000-32000]" --revocable_cpu_low_priority="true"
--runtime_dir="/tmp/Endpoint_SlaveEndpointTest_UnauthorizedRequest_2_mozGgM" --sandbox_directory="/mnt/mesos/sandbox"
--strict="true" --switch_user="true" --systemd_enable_support="true" --systemd_runtime_directory="/run/systemd/system"
--version="false" --work_dir="/tmp/Endpoint_SlaveEndpointTest_UnauthorizedRequest_2_qiOrlY"
I0529 17:11:59.512552 30606 credentials.hpp:86] Loading credential for authentication from
'/tmp/Endpoint_SlaveEndpointTest_UnauthorizedRequest_2_mozGgM/credential'
I0529 17:11:59.512696 30606 slave.cpp:265] Agent using credential for: test-principal
I0529 17:11:59.512717 30606 credentials.hpp:37] Loading credentials for authentication from
'/tmp/Endpoint_SlaveEndpointTest_UnauthorizedRequest_2_mozGgM/http_credentials'
I0529 17:11:59.512830 30606 http.cpp:975] Creating default 'basic' HTTP authenticator for
realm 'mesos-agent-readonly'
I0529 17:11:59.512895 30606 http.cpp:975] Creating default 'basic' HTTP authenticator for
realm 'mesos-agent-readwrite'
I0529 17:11:59.513383 30606 slave.cpp:536] Agent resources: cpus(*):2; mem(*):1024; disk(*):1024;
ports(*):[31000-32000]
I0529 17:11:59.513432 30606 slave.cpp:544] Agent attributes: [  ]
I0529 17:11:59.513440 30606 slave.cpp:549] Agent hostname: 7111186168cb
I0529 17:11:59.513581 30610 status_update_manager.cpp:177] Pausing sending status updates
I0529 17:11:59.514036 30607 state.cpp:62] Recovering state from '/tmp/Endpoint_SlaveEndpointTest_UnauthorizedRequest_2_qiOrlY/meta'
I0529 17:11:59.514166 30607 status_update_manager.cpp:203] Recovering status update manager
I0529 17:11:59.514329 30608 containerizer.cpp:582] Recovering containerizer
I0529 17:11:59.514861 30607 provisioner.cpp:416] Provisioner recovery complete
I0529 17:11:59.515038 30609 slave.cpp:6083] Finished recovery
I0529 17:11:59.515504 30609 slave.cpp:6265] Querying resource estimator for oversubscribable
resources
I0529 17:11:59.515615 30613 slave.cpp:6279] Received oversubscribable resources {} from the
resource estimator
I0529 17:11:59.516305 30615 process.cpp:3730] Handling HTTP event for process 'slave(751)'
with path: '/slave(751)/containers'
I0529 17:11:59.516703 30605 http.cpp:1115] HTTP GET for /slave(751)/containers from 172.17.0.2:47707
I0529 17:11:59.516746 30605 http.cpp:936] Authorizing principal 'test-principal' to GET the
'/containers' endpoint
I0529 17:11:59.517467 30610 slave.cpp:801] Agent terminating
[       OK ] Endpoint/SlaveEndpointTest.UnauthorizedRequest/2 (16 ms)
[ RUN      ] Endpoint/SlaveEndpointTest.NoAuthorizer/0
I0529 17:11:59.529255 30601 containerizer.cpp:230] Using isolation: posix/cpu,posix/mem,filesystem/posix,network/cni,environment_secret
W0529 17:11:59.529645 30601 backend.cpp:76] Failed to create 'aufs' backend: AufsBackend requires
root privileges
W0529 17:11:59.529767 30601 backend.cpp:76] Failed to create 'bind' backend: BindBackend requires
root privileges
I0529 17:11:59.529791 30601 provisioner.cpp:255] Using default backend 'copy'
I0529 17:11:59.531587 30601 cluster.cpp:448] Creating default 'local' authorizer
I0529 17:11:59.537247 30611 slave.cpp:232] Mesos agent started on (752)@172.17.0.2:40840
I0529 17:11:59.537286 30611 slave.cpp:233] Flags at startup: --acls="" --appc_simple_discovery_uri_prefix="http://"
--appc_store_dir="/tmp/mesos/store/appc" --authenticate_http_readonly="true" --authenticate_http_readwrite="true"
--authenticatee="crammd5" --authentication_backoff_factor="1secs" --authorizer="local" --cgroups_cpu_enable_pids_and_tids_count="false"
--cgroups_enable_cfs="false" --cgroups_hierarchy="/sys/fs/cgroup" --cgroups_limit_swap="false"
--cgroups_root="mesos" --container_disk_watch_interval="15secs" --containerizers="mesos" --credential="/tmp/Endpoint_SlaveEndpointTest_NoAuthorizer_0_YLiO6Z/credential"
--default_role="*" --disk_watch_interval="1mins" --docker="docker" --docker_kill_orphans="true"
--docker_registry="https://registry-1.docker.io" --docker_remove_delay="6hrs" --docker_socket="/var/run/docker.sock"
--docker_stop_timeout="0ns" --docker_store_dir="/tmp/mesos/store/docker" --docker_volume_checkpoint_dir="/var/run/mesos/isolators/docker/volume"
--enforce_container_disk_quota="false" --executor_registration_timeout="1mins" --executor_reregistration_timeout="2secs"
--executor_shutdown_grace_period="5secs" --fetcher_cache_dir="/tmp/Endpoint_SlaveEndpointTest_NoAuthorizer_0_YLiO6Z/fetch"
--fetcher_cache_size="2GB" --frameworks_home="" --gc_delay="1weeks" --gc_disk_headroom="0.1"
--hadoop_home="" --help="false" --hostname_lookup="true" --http_command_executor="false" --http_credentials="/tmp/Endpoint_SlaveEndpointTest_NoAuthorizer_0_YLiO6Z/http_credentials"
--http_heartbeat_interval="30secs" --initialize_driver_logging="true" --isolation="posix/cpu,posix/mem"
--launcher="posix" --launcher_dir="/mesos/build/src" --logbufsecs="0" --logging_level="INFO"
--max_completed_executors_per_framework="150" --oversubscribed_resources_interval="15secs"
--perf_duration="10secs" --perf_interval="1mins" --port="5051" --qos_correction_interval_min="0ns"
--quiet="false" --recover="reconnect" --recovery_timeout="15mins" --registration_backoff_factor="10ms"
--resources="cpus:2;gpus:0;mem:1024;disk:1024;ports:[31000-32000]" --revocable_cpu_low_priority="true"
--runtime_dir="/tmp/Endpoint_SlaveEndpointTest_NoAuthorizer_0_YLiO6Z" --sandbox_directory="/mnt/mesos/sandbox"
--strict="true" --switch_user="true" --systemd_enable_support="true" --systemd_runtime_directory="/run/systemd/system"
--version="false" --work_dir="/tmp/Endpoint_SlaveEndpointTest_NoAuthorizer_0_NuyK8b"
I0529 17:11:59.537596 30611 credentials.hpp:86] Loading credential for authentication from
'/tmp/Endpoint_SlaveEndpointTest_NoAuthorizer_0_YLiO6Z/credential'
I0529 17:11:59.537757 30611 slave.cpp:265] Agent using credential for: test-principal
I0529 17:11:59.537775 30611 credentials.hpp:37] Loading credentials for authentication from
'/tmp/Endpoint_SlaveEndpointTest_NoAuthorizer_0_YLiO6Z/http_credentials'
I0529 17:11:59.537904 30611 http.cpp:975] Creating default 'basic' HTTP authenticator for
realm 'mesos-agent-readonly'
I0529 17:11:59.537988 30611 http.cpp:975] Creating default 'basic' HTTP authenticator for
realm 'mesos-agent-readwrite'
I0529 17:11:59.538502 30611 slave.cpp:536] Agent resources: cpus(*):2; mem(*):1024; disk(*):1024;
ports(*):[31000-32000]
I0529 17:11:59.538548 30611 slave.cpp:544] Agent attributes: [  ]
I0529 17:11:59.538558 30611 slave.cpp:549] Agent hostname: 7111186168cb
I0529 17:11:59.538647 30612 status_update_manager.cpp:177] Pausing sending status updates
I0529 17:11:59.539036 30611 state.cpp:62] Recovering state from '/tmp/Endpoint_SlaveEndpointTest_NoAuthorizer_0_NuyK8b/meta'
I0529 17:11:59.539199 30611 status_update_manager.cpp:203] Recovering status update manager
I0529 17:11:59.539269 30611 containerizer.cpp:582] Recovering containerizer
I0529 17:11:59.539875 30609 provisioner.cpp:416] Provisioner recovery complete
I0529 17:11:59.540068 30603 slave.cpp:6083] Finished recovery
I0529 17:11:59.540540 30603 slave.cpp:6265] Querying resource estimator for oversubscribable
resources
I0529 17:11:59.540716 30603 slave.cpp:6279] Received oversubscribable resources {} from the
resource estimator
I0529 17:11:59.541735 30617 process.cpp:3730] Handling HTTP event for process 'slave(752)'
with path: '/slave(752)/monitor/statistics'
I0529 17:11:59.542151 30616 http.cpp:1115] HTTP GET for /slave(752)/monitor/statistics from
172.17.0.2:47708
I0529 17:11:59.542199 30616 http.cpp:936] Authorizing principal 'test-principal' to GET the
'/monitor/statistics' endpoint
I0529 17:11:59.543455 30613 slave.cpp:801] Agent terminating
[       OK ] Endpoint/SlaveEndpointTest.NoAuthorizer/0 (33 ms)
[ RUN      ] Endpoint/SlaveEndpointTest.NoAuthorizer/1
I0529 17:11:59.562758 30601 containerizer.cpp:230] Using isolation: posix/cpu,posix/mem,filesystem/posix,network/cni,environment_secret
W0529 17:11:59.563110 30601 backend.cpp:76] Failed to create 'aufs' backend: AufsBackend requires
root privileges
W0529 17:11:59.563159 30601 backend.cpp:76] Failed to create 'bind' backend: BindBackend requires
root privileges
I0529 17:11:59.563201 30601 provisioner.cpp:255] Using default backend 'copy'
I0529 17:11:59.564190 30601 cluster.cpp:448] Creating default 'local' authorizer
I0529 17:11:59.564867 30615 slave.cpp:232] Mesos agent started on (753)@172.17.0.2:40840
I0529 17:11:59.565116 30615 slave.cpp:233] Flags at startup: --acls="" --appc_simple_discovery_uri_prefix="http://"
--appc_store_dir="/tmp/mesos/store/appc" --authenticate_http_readonly="true" --authenticate_http_readwrite="true"
--authenticatee="crammd5" --authentication_backoff_factor="1secs" --authorizer="local" --cgroups_cpu_enable_pids_and_tids_count="false"
--cgroups_enable_cfs="false" --cgroups_hierarchy="/sys/fs/cgroup" --cgroups_limit_swap="false"
--cgroups_root="mesos" --container_disk_watch_interval="15secs" --containerizers="mesos" --credential="/tmp/Endpoint_SlaveEndpointTest_NoAuthorizer_1_vZtwhe/credential"
--default_role="*" --disk_watch_interval="1mins" --docker="docker" --docker_kill_orphans="true"
--docker_registry="https://registry-1.docker.io" --docker_remove_delay="6hrs" --docker_socket="/var/run/docker.sock"
--docker_stop_timeout="0ns" --docker_store_dir="/tmp/mesos/store/docker" --docker_volume_checkpoint_dir="/var/run/mesos/isolators/docker/volume"
--enforce_container_disk_quota="false" --executor_registration_timeout="1mins" --executor_reregistration_timeout="2secs"
--executor_shutdown_grace_period="5secs" --fetcher_cache_dir="/tmp/Endpoint_SlaveEndpointTest_NoAuthorizer_1_vZtwhe/fetch"
--fetcher_cache_size="2GB" --frameworks_home="" --gc_delay="1weeks" --gc_disk_headroom="0.1"
--hadoop_home="" --help="false" --hostname_lookup="true" --http_command_executor="false" --http_credentials="/tmp/Endpoint_SlaveEndpointTest_NoAuthorizer_1_vZtwhe/http_credentials"
--http_heartbeat_interval="30secs" --initialize_driver_logging="true" --isolation="posix/cpu,posix/mem"
--launcher="posix" --launcher_dir="/mesos/build/src" --logbufsecs="0" --logging_level="INFO"
--max_completed_executors_per_framework="150" --oversubscribed_resources_interval="15secs"
--perf_duration="10secs" --perf_interval="1mins" --port="5051" --qos_correction_interval_min="0ns"
--quiet="false" --recover="reconnect" --recovery_timeout="15mins" --registration_backoff_factor="10ms"
--resources="cpus:2;gpus:0;mem:1024;disk:1024;ports:[31000-32000]" --revocable_cpu_low_priority="true"
--runtime_dir="/tmp/Endpoint_SlaveEndpointTest_NoAuthorizer_1_vZtwhe" --sandbox_directory="/mnt/mesos/sandbox"
--strict="true" --switch_user="true" --systemd_enable_support="true" --systemd_runtime_directory="/run/systemd/system"
--version="false" --work_dir="/tmp/Endpoint_SlaveEndpointTest_NoAuthorizer_1_7ciXdq"
I0529 17:11:59.565297 30615 credentials.hpp:86] Loading credential for authentication from
'/tmp/Endpoint_SlaveEndpointTest_NoAuthorizer_1_vZtwhe/credential'
I0529 17:11:59.565431 30615 slave.cpp:265] Agent using credential for: test-principal
I0529 17:11:59.565466 30615 credentials.hpp:37] Loading credentials for authentication from
'/tmp/Endpoint_SlaveEndpointTest_NoAuthorizer_1_vZtwhe/http_credentials'
I0529 17:11:59.565639 30615 http.cpp:975] Creating default 'basic' HTTP authenticator for
realm 'mesos-agent-readonly'
I0529 17:11:59.565702 30615 http.cpp:975] Creating default 'basic' HTTP authenticator for
realm 'mesos-agent-readwrite'
I0529 17:11:59.566226 30615 slave.cpp:536] Agent resources: cpus(*):2; mem(*):1024; disk(*):1024;
ports(*):[31000-32000]
I0529 17:11:59.566259 30615 slave.cpp:544] Agent attributes: [  ]
I0529 17:11:59.566267 30615 slave.cpp:549] Agent hostname: 7111186168cb
I0529 17:11:59.566339 30605 status_update_manager.cpp:177] Pausing sending status updates
I0529 17:11:59.566761 30615 state.cpp:62] Recovering state from '/tmp/Endpoint_SlaveEndpointTest_NoAuthorizer_1_7ciXdq/meta'
I0529 17:11:59.566910 30612 status_update_manager.cpp:203] Recovering status update manager
I0529 17:11:59.566974 30612 containerizer.cpp:582] Recovering containerizer
I0529 17:11:59.567545 30612 provisioner.cpp:416] Provisioner recovery complete
I0529 17:11:59.567697 30612 slave.cpp:6083] Finished recovery
I0529 17:11:59.568130 30612 slave.cpp:6265] Querying resource estimator for oversubscribable
resources
I0529 17:11:59.568298 30612 slave.cpp:6279] Received oversubscribable resources {} from the
resource estimator
I0529 17:11:59.569177 30607 process.cpp:3730] Handling HTTP event for process 'slave(753)'
with path: '/slave(753)/monitor/statistics.json'
I0529 17:11:59.569648 30609 http.cpp:1115] HTTP GET for /slave(753)/monitor/statistics.json
from 172.17.0.2:47709
I0529 17:11:59.569694 30609 http.cpp:936] Authorizing principal 'test-principal' to GET the
'/monitor/statistics.json' endpoint
I0529 17:11:59.570895 30602 slave.cpp:801] Agent terminating
[       OK ] Endpoint/SlaveEndpointTest.NoAuthorizer/1 (14 ms)
[ RUN      ] Endpoint/SlaveEndpointTest.NoAuthorizer/2
I0529 17:11:59.576277 30601 containerizer.cpp:230] Using isolation: posix/cpu,posix/mem,filesystem/posix,network/cni,environment_secret
W0529 17:11:59.576556 30601 backend.cpp:76] Failed to create 'aufs' backend: AufsBackend requires
root privileges
W0529 17:11:59.576603 30601 backend.cpp:76] Failed to create 'bind' backend: BindBackend requires
root privileges
I0529 17:11:59.576624 30601 provisioner.cpp:255] Using default backend 'copy'
I0529 17:11:59.577286 30601 cluster.cpp:448] Creating default 'local' authorizer
I0529 17:11:59.577857 30605 slave.cpp:232] Mesos agent started on (754)@172.17.0.2:40840
I0529 17:11:59.577882 30605 slave.cpp:233] Flags at startup: --acls="" --appc_simple_discovery_uri_prefix="http://"
--appc_store_dir="/tmp/mesos/store/appc" --authenticate_http_readonly="true" --authenticate_http_readwrite="true"
--authenticatee="crammd5" --authentication_backoff_factor="1secs" --authorizer="local" --cgroups_cpu_enable_pids_and_tids_count="false"
--cgroups_enable_cfs="false" --cgroups_hierarchy="/sys/fs/cgroup" --cgroups_limit_swap="false"
--cgroups_root="mesos" --container_disk_watch_interval="15secs" --containerizers="mesos" --credential="/tmp/Endpoint_SlaveEndpointTest_NoAuthorizer_2_NXXGDs/credential"
--default_role="*" --disk_watch_interval="1mins" --docker="docker" --docker_kill_orphans="true"
--docker_registry="https://registry-1.docker.io" --docker_remove_delay="6hrs" --docker_socket="/var/run/docker.sock"
--docker_stop_timeout="0ns" --docker_store_dir="/tmp/mesos/store/docker" --docker_volume_checkpoint_dir="/var/run/mesos/isolators/docker/volume"
--enforce_container_disk_quota="false" --executor_registration_timeout="1mins" --executor_reregistration_timeout="2secs"
--executor_shutdown_grace_period="5secs" --fetcher_cache_dir="/tmp/Endpoint_SlaveEndpointTest_NoAuthorizer_2_NXXGDs/fetch"
--fetcher_cache_size="2GB" --frameworks_home="" --gc_delay="1weeks" --gc_disk_headroom="0.1"
--hadoop_home="" --help="false" --hostname_lookup="true" --http_command_executor="false" --http_credentials="/tmp/Endpoint_SlaveEndpointTest_NoAuthorizer_2_NXXGDs/http_credentials"
--http_heartbeat_interval="30secs" --initialize_driver_logging="true" --isolation="posix/cpu,posix/mem"
--launcher="posix" --launcher_dir="/mesos/build/src" --logbufsecs="0" --logging_level="INFO"
--max_completed_executors_per_framework="150" --oversubscribed_resources_interval="15secs"
--perf_duration="10secs" --perf_interval="1mins" --port="5051" --qos_correction_interval_min="0ns"
--quiet="false" --recover="reconnect" --recovery_timeout="15mins" --registration_backoff_factor="10ms"
--resources="cpus:2;gpus:0;mem:1024;disk:1024;ports:[31000-32000]" --revocable_cpu_low_priority="true"
--runtime_dir="/tmp/Endpoint_SlaveEndpointTest_NoAuthorizer_2_NXXGDs" --sandbox_directory="/mnt/mesos/sandbox"
--strict="true" --switch_user="true" --systemd_enable_support="true" --systemd_runtime_directory="/run/systemd/system"
--version="false" --work_dir="/tmp/Endpoint_SlaveEndpointTest_NoAuthorizer_2_y66OxE"
I0529 17:11:59.578200 30605 credentials.hpp:86] Loading credential for authentication from
'/tmp/Endpoint_SlaveEndpointTest_NoAuthorizer_2_NXXGDs/credential'
I0529 17:11:59.578335 30605 slave.cpp:265] Agent using credential for: test-principal
I0529 17:11:59.578351 30605 credentials.hpp:37] Loading credentials for authentication from
'/tmp/Endpoint_SlaveEndpointTest_NoAuthorizer_2_NXXGDs/http_credentials'
I0529 17:11:59.578471 30605 http.cpp:975] Creating default 'basic' HTTP authenticator for
realm 'mesos-agent-readonly'
I0529 17:11:59.578536 30605 http.cpp:975] Creating default 'basic' HTTP authenticator for
realm 'mesos-agent-readwrite'
I0529 17:11:59.578922 30605 slave.cpp:536] Agent resources: cpus(*):2; mem(*):1024; disk(*):1024;
ports(*):[31000-32000]
I0529 17:11:59.578951 30605 slave.cpp:544] Agent attributes: [  ]
I0529 17:11:59.578956 30605 slave.cpp:549] Agent hostname: 7111186168cb
I0529 17:11:59.579092 30607 status_update_manager.cpp:177] Pausing sending status updates
I0529 17:11:59.579322 30609 state.cpp:62] Recovering state from '/tmp/Endpoint_SlaveEndpointTest_NoAuthorizer_2_y66OxE/meta'
I0529 17:11:59.579427 30609 status_update_manager.cpp:203] Recovering status update manager
I0529 17:11:59.579494 30609 containerizer.cpp:582] Recovering containerizer
I0529 17:11:59.580174 30602 provisioner.cpp:416] Provisioner recovery complete
I0529 17:11:59.580369 30606 slave.cpp:6083] Finished recovery
I0529 17:11:59.580862 30606 slave.cpp:6265] Querying resource estimator for oversubscribable
resources
I0529 17:11:59.581081 30610 slave.cpp:6279] Received oversubscribable resources {} from the
resource estimator
I0529 17:11:59.581789 30607 process.cpp:3730] Handling HTTP event for process 'slave(754)'
with path: '/slave(754)/containers'
I0529 17:11:59.582168 30606 http.cpp:1115] HTTP GET for /slave(754)/containers from 172.17.0.2:47710
I0529 17:11:59.582206 30606 http.cpp:936] Authorizing principal 'test-principal' to GET the
'/containers' endpoint
I0529 17:11:59.583326 30603 slave.cpp:801] Agent terminating
[       OK ] Endpoint/SlaveEndpointTest.NoAuthorizer/2 (12 ms)
[----------] 9 tests from Endpoint/SlaveEndpointTest (147 ms total)

[----------] Global test environment tear-down
[==========] 1533 tests from 168 test cases ran. (338852 ms total)
[  PASSED  ] 1532 tests.
[  FAILED  ] 1 test, listed below:
[  FAILED  ] ContentType/AgentAPIStreamingTest.AttachInputToNestedContainerSession/1, where
GetParam() = application/json

 1 FAILED TEST
  YOU HAVE 22 DISABLED TESTS

E0529 17:11:59.934612 30618 process.cpp:950] Failed to accept socket: future discarded
make[3]: *** [CMakeFiles/check] Error 1
make[3]: Leaving directory `/mesos/build'
make[2]: *** [CMakeFiles/check.dir/all] Error 2
make[2]: Leaving directory `/mesos/build'
make[1]: *** [CMakeFiles/check.dir/rule] Error 2
make[1]: Leaving directory `/mesos/build'
make: *** [check] Error 2
+ docker rmi mesos-1496074701-31374
Untagged: mesos-1496074701-31374:latest
Deleted: sha256:234417780fc59578826c43bae2b405582eeb5369d445275908dd20e97aa72a81
Deleted: sha256:2adcde9c3469a3f39bddc23d092cfeb0412242443edea3490f5e32f2b106f506
Deleted: sha256:312b057f275448fcaf6c4e5a2b6f39bed5c5cf06e88388aa018acf5834a511df
Deleted: sha256:9f83cff724a0811d981c0856d357979c3673e65f4743cc8d6025f4c65fe57ce4
Deleted: sha256:183da1f932f64a249ca38771ec90d0e479385bb6ac062e6791c3566bfc3edf5b
Deleted: sha256:94ca2c3af0737ea5d1b6c1e77c3f6dc361a665f313598b64264025a9a83a24ad
Deleted: sha256:2539dd2e095acb0d260fea2ea205fb6dfc359c447a3b2b9ef459cd792d1c0ad9
Deleted: sha256:b386a0838a9b8f52a75b8ba940ac3c0fc345d34134efb03a63b4962f5464a5cb
Deleted: sha256:b80e659daac6f9154ee75278c89c826c41ab6411d3fe1a662bf92976f6b4b321
Deleted: sha256:78115a64116694aa3b63a46504ee75211b5e8c43726a265313f7944435f026d1
Deleted: sha256:0852fc78fb9f763a3d931b7012f79d21a6cb177c4dfe2c064b5dbe78db83d0d4
Deleted: sha256:5b987d2e32ca6942e22dd223102ebd97bdfea4ce357957cc1827c2e0e2b875e5
Deleted: sha256:8d2bb3de7793fced902c349e53d40e9b762f1feea4dfeee83b39fff95983db88
Deleted: sha256:a891ff6a9c1928bfc728eb1171f17b171d96e93bb71be35b1621672ba728774a
Deleted: sha256:76c56e7345923b97a91d080b73933d4095195efbd97288febbbc8d17b3fb6de3
Deleted: sha256:62b03c511097a28b96939ac2c63920e6804a3807abc118bd54f0533e546301d3
Deleted: sha256:21cd42db9955585baf2fb9b3c22fae4920f0ce7fba82c02a8f17e0688070d1a2
Deleted: sha256:b02c7d3a75e088eff22db34e95f48024be3e5fff90de2ac0e898e4310d1d78f6
Deleted: sha256:e4887e937555ef45ffd31f372bc5a9a13030d71e317e31f95a43d8b2f3162bd1
Deleted: sha256:685e08dff6358314b68ef7178c64a3912d6cdb3d9216fb3a45460b65dcb7a88e
Deleted: sha256:ab5b2e706e58c01621baf615a27536c9d17cd19f7e9976a46391d8d2cd729b51
Deleted: sha256:521e14e3ac57be483e9c6208bdebd746e5de674ad8a96443f94140672e1da5dd
Deleted: sha256:a76599c805d5168beac4e0458aa4deac4f71713083563d57e085a64348205aee
Deleted: sha256:b00beecfbd47249bfd9119125286f89ab5a7478232a6ac1a7c09c0d6cd43fb77
Build step 'Execute shell' marked build as failure

Mime
View raw message