mesos-builds mailing list archives

Site index · List index
Message view « Date » · « Thread »
Top « Date » · « Thread »
From Apache Jenkins Server <jenk...@builds.apache.org>
Subject Build failed in Jenkins: Mesos-Buildbot » cmake,gcc,--verbose,GLOG_v=1 MESOS_VERBOSE=1,centos:7,(docker||Hadoop)&&(!ubuntu-us1)&&(!ubuntu-eu2) #3631
Date Tue, 09 May 2017 08:30:31 GMT
See <https://builds.apache.org/job/Mesos-Buildbot/BUILDTOOL=cmake,COMPILER=gcc,CONFIGURATION=--verbose,ENVIRONMENT=GLOG_v=1%20MESOS_VERBOSE=1,OS=centos%3A7,label_exp=(docker%7C%7CHadoop)&&(!ubuntu-us1)&&(!ubuntu-eu2)/3631/display/redirect?page=changes>

Changes:

[yujie.jay] Changed `#elif ...` to `#elif defined(...)` in Mesos.

------------------------------------------
[...truncated 24.92 MB...]
I0509 08:30:23.089376 24449 slave.cpp:790] Agent terminating
[       OK ] Endpoint/SlaveEndpointTest.AuthorizedRequest/1 (11 ms)
[ RUN      ] Endpoint/SlaveEndpointTest.AuthorizedRequest/2
I0509 08:30:23.093926 24436 containerizer.cpp:221] Using isolation: posix/cpu,posix/mem,filesystem/posix,network/cni
W0509 08:30:23.094276 24436 backend.cpp:76] Failed to create 'aufs' backend: AufsBackend requires
root privileges
W0509 08:30:23.094312 24436 backend.cpp:76] Failed to create 'bind' backend: BindBackend requires
root privileges
I0509 08:30:23.094328 24436 provisioner.cpp:249] Using default backend 'copy'
I0509 08:30:23.095402 24451 slave.cpp:225] Mesos agent started on (741)@172.17.0.3:33173
I0509 08:30:23.095422 24451 slave.cpp:226] Flags at startup: --acls="" --appc_simple_discovery_uri_prefix="http://"
--appc_store_dir="/tmp/mesos/store/appc" --authenticate_http_readonly="true" --authenticate_http_readwrite="true"
--authenticatee="crammd5" --authentication_backoff_factor="1secs" --authorizer="local" --cgroups_cpu_enable_pids_and_tids_count="false"
--cgroups_enable_cfs="false" --cgroups_hierarchy="/sys/fs/cgroup" --cgroups_limit_swap="false"
--cgroups_root="mesos" --container_disk_watch_interval="15secs" --containerizers="mesos" --credential="/tmp/Endpoint_SlaveEndpointTest_AuthorizedRequest_2_jor5sC/credential"
--default_role="*" --disk_watch_interval="1mins" --docker="docker" --docker_kill_orphans="true"
--docker_registry="https://registry-1.docker.io" --docker_remove_delay="6hrs" --docker_socket="/var/run/docker.sock"
--docker_stop_timeout="0ns" --docker_store_dir="/tmp/mesos/store/docker" --docker_volume_checkpoint_dir="/var/run/mesos/isolators/docker/volume"
--enforce_container_disk_quota="false" --executor_registration_timeout="1mins" --executor_shutdown_grace_period="5secs"
--fetcher_cache_dir="/tmp/Endpoint_SlaveEndpointTest_AuthorizedRequest_2_jor5sC/fetch" --fetcher_cache_size="2GB"
--frameworks_home="" --gc_delay="1weeks" --gc_disk_headroom="0.1" --hadoop_home="" --help="false"
--hostname_lookup="true" --http_command_executor="false" --http_credentials="/tmp/Endpoint_SlaveEndpointTest_AuthorizedRequest_2_jor5sC/http_credentials"
--http_heartbeat_interval="30secs" --initialize_driver_logging="true" --isolation="posix/cpu,posix/mem"
--launcher="posix" --launcher_dir="/mesos/build/src" --logbufsecs="0" --logging_level="INFO"
--max_completed_executors_per_framework="150" --oversubscribed_resources_interval="15secs"
--perf_duration="10secs" --perf_interval="1mins" --port="5051" --qos_correction_interval_min="0ns"
--quiet="false" --recover="reconnect" --recovery_timeout="15mins" --registration_backoff_factor="10ms"
--resources="cpus:2;gpus:0;mem:1024;disk:1024;ports:[31000-32000]" --revocable_cpu_low_priority="true"
--runtime_dir="/tmp/Endpoint_SlaveEndpointTest_AuthorizedRequest_2_jor5sC" --sandbox_directory="/mnt/mesos/sandbox"
--strict="true" --switch_user="true" --systemd_enable_support="true" --systemd_runtime_directory="/run/systemd/system"
--version="false" --work_dir="/tmp/Endpoint_SlaveEndpointTest_AuthorizedRequest_2_sa2Orb"
I0509 08:30:23.095660 24451 credentials.hpp:86] Loading credential for authentication from
'/tmp/Endpoint_SlaveEndpointTest_AuthorizedRequest_2_jor5sC/credential'
I0509 08:30:23.095763 24451 slave.cpp:258] Agent using credential for: test-principal
I0509 08:30:23.095784 24451 credentials.hpp:37] Loading credentials for authentication from
'/tmp/Endpoint_SlaveEndpointTest_AuthorizedRequest_2_jor5sC/http_credentials'
I0509 08:30:23.095909 24451 http.cpp:975] Creating default 'basic' HTTP authenticator for
realm 'mesos-agent-readonly'
I0509 08:30:23.095964 24451 http.cpp:975] Creating default 'basic' HTTP authenticator for
realm 'mesos-agent-readwrite'
I0509 08:30:23.096410 24451 slave.cpp:525] Agent resources: cpus(*):2; mem(*):1024; disk(*):1024;
ports(*):[31000-32000]
I0509 08:30:23.096449 24451 slave.cpp:533] Agent attributes: [  ]
I0509 08:30:23.096458 24451 slave.cpp:538] Agent hostname: 3e54dce96958
I0509 08:30:23.096570 24441 status_update_manager.cpp:177] Pausing sending status updates
I0509 08:30:23.096806 24443 state.cpp:62] Recovering state from '/tmp/Endpoint_SlaveEndpointTest_AuthorizedRequest_2_sa2Orb/meta'
I0509 08:30:23.097019 24452 status_update_manager.cpp:203] Recovering status update manager
I0509 08:30:23.097190 24441 containerizer.cpp:608] Recovering containerizer
I0509 08:30:23.097760 24449 provisioner.cpp:410] Provisioner recovery complete
I0509 08:30:23.097966 24439 slave.cpp:5963] Finished recovery
I0509 08:30:23.098330 24439 slave.cpp:6145] Querying resource estimator for oversubscribable
resources
I0509 08:30:23.098574 24448 slave.cpp:6159] Received oversubscribable resources {} from the
resource estimator
I0509 08:30:23.099158 24452 process.cpp:3730] Handling HTTP event for process 'slave(741)'
with path: '/slave(741)/containers'
I0509 08:30:23.099597 24444 http.cpp:1115] HTTP GET for /slave(741)/containers from 172.17.0.3:41808
I0509 08:30:23.099632 24444 http.cpp:936] Authorizing principal 'test-principal' to GET the
'/containers' endpoint
I0509 08:30:23.101030 24439 slave.cpp:790] Agent terminating
[       OK ] Endpoint/SlaveEndpointTest.AuthorizedRequest/2 (12 ms)
[ RUN      ] Endpoint/SlaveEndpointTest.UnauthorizedRequest/0
I0509 08:30:23.105859 24436 containerizer.cpp:221] Using isolation: posix/cpu,posix/mem,filesystem/posix,network/cni
W0509 08:30:23.106227 24436 backend.cpp:76] Failed to create 'aufs' backend: AufsBackend requires
root privileges
W0509 08:30:23.106268 24436 backend.cpp:76] Failed to create 'bind' backend: BindBackend requires
root privileges
I0509 08:30:23.106283 24436 provisioner.cpp:249] Using default backend 'copy'
I0509 08:30:23.107339 24440 slave.cpp:225] Mesos agent started on (742)@172.17.0.3:33173
I0509 08:30:23.107357 24440 slave.cpp:226] Flags at startup: --acls="" --appc_simple_discovery_uri_prefix="http://"
--appc_store_dir="/tmp/mesos/store/appc" --authenticate_http_readonly="true" --authenticate_http_readwrite="true"
--authenticatee="crammd5" --authentication_backoff_factor="1secs" --authorizer="local" --cgroups_cpu_enable_pids_and_tids_count="false"
--cgroups_enable_cfs="false" --cgroups_hierarchy="/sys/fs/cgroup" --cgroups_limit_swap="false"
--cgroups_root="mesos" --container_disk_watch_interval="15secs" --containerizers="mesos" --credential="/tmp/Endpoint_SlaveEndpointTest_UnauthorizedRequest_0_8b1CEm/credential"
--default_role="*" --disk_watch_interval="1mins" --docker="docker" --docker_kill_orphans="true"
--docker_registry="https://registry-1.docker.io" --docker_remove_delay="6hrs" --docker_socket="/var/run/docker.sock"
--docker_stop_timeout="0ns" --docker_store_dir="/tmp/mesos/store/docker" --docker_volume_checkpoint_dir="/var/run/mesos/isolators/docker/volume"
--enforce_container_disk_quota="false" --executor_registration_timeout="1mins" --executor_shutdown_grace_period="5secs"
--fetcher_cache_dir="/tmp/Endpoint_SlaveEndpointTest_UnauthorizedRequest_0_8b1CEm/fetch" --fetcher_cache_size="2GB"
--frameworks_home="" --gc_delay="1weeks" --gc_disk_headroom="0.1" --hadoop_home="" --help="false"
--hostname_lookup="true" --http_command_executor="false" --http_credentials="/tmp/Endpoint_SlaveEndpointTest_UnauthorizedRequest_0_8b1CEm/http_credentials"
--http_heartbeat_interval="30secs" --initialize_driver_logging="true" --isolation="posix/cpu,posix/mem"
--launcher="posix" --launcher_dir="/mesos/build/src" --logbufsecs="0" --logging_level="INFO"
--max_completed_executors_per_framework="150" --oversubscribed_resources_interval="15secs"
--perf_duration="10secs" --perf_interval="1mins" --port="5051" --qos_correction_interval_min="0ns"
--quiet="false" --recover="reconnect" --recovery_timeout="15mins" --registration_backoff_factor="10ms"
--resources="cpus:2;gpus:0;mem:1024;disk:1024;ports:[31000-32000]" --revocable_cpu_low_priority="true"
--runtime_dir="/tmp/Endpoint_SlaveEndpointTest_UnauthorizedRequest_0_8b1CEm" --sandbox_directory="/mnt/mesos/sandbox"
--strict="true" --switch_user="true" --systemd_enable_support="true" --systemd_runtime_directory="/run/systemd/system"
--version="false" --work_dir="/tmp/Endpoint_SlaveEndpointTest_UnauthorizedRequest_0_ntjrBV"
I0509 08:30:23.107661 24440 credentials.hpp:86] Loading credential for authentication from
'/tmp/Endpoint_SlaveEndpointTest_UnauthorizedRequest_0_8b1CEm/credential'
I0509 08:30:23.107769 24440 slave.cpp:258] Agent using credential for: test-principal
I0509 08:30:23.107811 24440 credentials.hpp:37] Loading credentials for authentication from
'/tmp/Endpoint_SlaveEndpointTest_UnauthorizedRequest_0_8b1CEm/http_credentials'
I0509 08:30:23.107949 24440 http.cpp:975] Creating default 'basic' HTTP authenticator for
realm 'mesos-agent-readonly'
I0509 08:30:23.108007 24440 http.cpp:975] Creating default 'basic' HTTP authenticator for
realm 'mesos-agent-readwrite'
I0509 08:30:23.108536 24440 slave.cpp:525] Agent resources: cpus(*):2; mem(*):1024; disk(*):1024;
ports(*):[31000-32000]
I0509 08:30:23.108588 24440 slave.cpp:533] Agent attributes: [  ]
I0509 08:30:23.108602 24440 slave.cpp:538] Agent hostname: 3e54dce96958
I0509 08:30:23.108743 24448 status_update_manager.cpp:177] Pausing sending status updates
I0509 08:30:23.109163 24445 state.cpp:62] Recovering state from '/tmp/Endpoint_SlaveEndpointTest_UnauthorizedRequest_0_ntjrBV/meta'
I0509 08:30:23.109297 24445 status_update_manager.cpp:203] Recovering status update manager
I0509 08:30:23.109412 24447 containerizer.cpp:608] Recovering containerizer
I0509 08:30:23.110010 24444 provisioner.cpp:410] Provisioner recovery complete
I0509 08:30:23.110182 24452 slave.cpp:5963] Finished recovery
I0509 08:30:23.110565 24452 slave.cpp:6145] Querying resource estimator for oversubscribable
resources
I0509 08:30:23.110683 24437 slave.cpp:6159] Received oversubscribable resources {} from the
resource estimator
I0509 08:30:23.111294 24452 process.cpp:3730] Handling HTTP event for process 'slave(742)'
with path: '/slave(742)/monitor/statistics'
I0509 08:30:23.111780 24446 http.cpp:1115] HTTP GET for /slave(742)/monitor/statistics from
172.17.0.3:41809
I0509 08:30:23.111840 24446 http.cpp:936] Authorizing principal 'test-principal' to GET the
'/monitor/statistics' endpoint
I0509 08:30:23.112937 24441 slave.cpp:790] Agent terminating
[       OK ] Endpoint/SlaveEndpointTest.UnauthorizedRequest/0 (12 ms)
[ RUN      ] Endpoint/SlaveEndpointTest.UnauthorizedRequest/1
I0509 08:30:23.118396 24436 containerizer.cpp:221] Using isolation: posix/cpu,posix/mem,filesystem/posix,network/cni
W0509 08:30:23.118728 24436 backend.cpp:76] Failed to create 'aufs' backend: AufsBackend requires
root privileges
W0509 08:30:23.118765 24436 backend.cpp:76] Failed to create 'bind' backend: BindBackend requires
root privileges
I0509 08:30:23.118779 24436 provisioner.cpp:249] Using default backend 'copy'
I0509 08:30:23.119650 24440 slave.cpp:225] Mesos agent started on (743)@172.17.0.3:33173
I0509 08:30:23.119666 24440 slave.cpp:226] Flags at startup: --acls="" --appc_simple_discovery_uri_prefix="http://"
--appc_store_dir="/tmp/mesos/store/appc" --authenticate_http_readonly="true" --authenticate_http_readwrite="true"
--authenticatee="crammd5" --authentication_backoff_factor="1secs" --authorizer="local" --cgroups_cpu_enable_pids_and_tids_count="false"
--cgroups_enable_cfs="false" --cgroups_hierarchy="/sys/fs/cgroup" --cgroups_limit_swap="false"
--cgroups_root="mesos" --container_disk_watch_interval="15secs" --containerizers="mesos" --credential="/tmp/Endpoint_SlaveEndpointTest_UnauthorizedRequest_1_BHncY6/credential"
--default_role="*" --disk_watch_interval="1mins" --docker="docker" --docker_kill_orphans="true"
--docker_registry="https://registry-1.docker.io" --docker_remove_delay="6hrs" --docker_socket="/var/run/docker.sock"
--docker_stop_timeout="0ns" --docker_store_dir="/tmp/mesos/store/docker" --docker_volume_checkpoint_dir="/var/run/mesos/isolators/docker/volume"
--enforce_container_disk_quota="false" --executor_registration_timeout="1mins" --executor_shutdown_grace_period="5secs"
--fetcher_cache_dir="/tmp/Endpoint_SlaveEndpointTest_UnauthorizedRequest_1_BHncY6/fetch" --fetcher_cache_size="2GB"
--frameworks_home="" --gc_delay="1weeks" --gc_disk_headroom="0.1" --hadoop_home="" --help="false"
--hostname_lookup="true" --http_command_executor="false" --http_credentials="/tmp/Endpoint_SlaveEndpointTest_UnauthorizedRequest_1_BHncY6/http_credentials"
--http_heartbeat_interval="30secs" --initialize_driver_logging="true" --isolation="posix/cpu,posix/mem"
--launcher="posix" --launcher_dir="/mesos/build/src" --logbufsecs="0" --logging_level="INFO"
--max_completed_executors_per_framework="150" --oversubscribed_resources_interval="15secs"
--perf_duration="10secs" --perf_interval="1mins" --port="5051" --qos_correction_interval_min="0ns"
--quiet="false" --recover="reconnect" --recovery_timeout="15mins" --registration_backoff_factor="10ms"
--resources="cpus:2;gpus:0;mem:1024;disk:1024;ports:[31000-32000]" --revocable_cpu_low_priority="true"
--runtime_dir="/tmp/Endpoint_SlaveEndpointTest_UnauthorizedRequest_1_BHncY6" --sandbox_directory="/mnt/mesos/sandbox"
--strict="true" --switch_user="true" --systemd_enable_support="true" --systemd_runtime_directory="/run/systemd/system"
--version="false" --work_dir="/tmp/Endpoint_SlaveEndpointTest_UnauthorizedRequest_1_NVIZSF"
I0509 08:30:23.119951 24440 credentials.hpp:86] Loading credential for authentication from
'/tmp/Endpoint_SlaveEndpointTest_UnauthorizedRequest_1_BHncY6/credential'
I0509 08:30:23.120054 24440 slave.cpp:258] Agent using credential for: test-principal
I0509 08:30:23.120074 24440 credentials.hpp:37] Loading credentials for authentication from
'/tmp/Endpoint_SlaveEndpointTest_UnauthorizedRequest_1_BHncY6/http_credentials'
I0509 08:30:23.120213 24440 http.cpp:975] Creating default 'basic' HTTP authenticator for
realm 'mesos-agent-readonly'
I0509 08:30:23.120280 24440 http.cpp:975] Creating default 'basic' HTTP authenticator for
realm 'mesos-agent-readwrite'
I0509 08:30:23.120756 24440 slave.cpp:525] Agent resources: cpus(*):2; mem(*):1024; disk(*):1024;
ports(*):[31000-32000]
I0509 08:30:23.120793 24440 slave.cpp:533] Agent attributes: [  ]
I0509 08:30:23.120806 24440 slave.cpp:538] Agent hostname: 3e54dce96958
I0509 08:30:23.120877 24449 status_update_manager.cpp:177] Pausing sending status updates
I0509 08:30:23.121215 24446 state.cpp:62] Recovering state from '/tmp/Endpoint_SlaveEndpointTest_UnauthorizedRequest_1_NVIZSF/meta'
I0509 08:30:23.121348 24442 status_update_manager.cpp:203] Recovering status update manager
I0509 08:30:23.121475 24451 containerizer.cpp:608] Recovering containerizer
I0509 08:30:23.122229 24445 provisioner.cpp:410] Provisioner recovery complete
I0509 08:30:23.122395 24438 slave.cpp:5963] Finished recovery
I0509 08:30:23.122956 24438 slave.cpp:6145] Querying resource estimator for oversubscribable
resources
I0509 08:30:23.123045 24438 slave.cpp:6159] Received oversubscribable resources {} from the
resource estimator
I0509 08:30:23.123731 24450 process.cpp:3730] Handling HTTP event for process 'slave(743)'
with path: '/slave(743)/monitor/statistics.json'
I0509 08:30:23.124186 24440 http.cpp:1115] HTTP GET for /slave(743)/monitor/statistics.json
from 172.17.0.3:41810
I0509 08:30:23.124228 24440 http.cpp:936] Authorizing principal 'test-principal' to GET the
'/monitor/statistics.json' endpoint
I0509 08:30:23.125597 24444 slave.cpp:790] Agent terminating
[       OK ] Endpoint/SlaveEndpointTest.UnauthorizedRequest/1 (12 ms)
[ RUN      ] Endpoint/SlaveEndpointTest.UnauthorizedRequest/2
I0509 08:30:23.130928 24436 containerizer.cpp:221] Using isolation: posix/cpu,posix/mem,filesystem/posix,network/cni
W0509 08:30:23.131283 24436 backend.cpp:76] Failed to create 'aufs' backend: AufsBackend requires
root privileges
W0509 08:30:23.131322 24436 backend.cpp:76] Failed to create 'bind' backend: BindBackend requires
root privileges
I0509 08:30:23.131335 24436 provisioner.cpp:249] Using default backend 'copy'
I0509 08:30:23.132436 24446 slave.cpp:225] Mesos agent started on (744)@172.17.0.3:33173
I0509 08:30:23.132458 24446 slave.cpp:226] Flags at startup: --acls="" --appc_simple_discovery_uri_prefix="http://"
--appc_store_dir="/tmp/mesos/store/appc" --authenticate_http_readonly="true" --authenticate_http_readwrite="true"
--authenticatee="crammd5" --authentication_backoff_factor="1secs" --authorizer="local" --cgroups_cpu_enable_pids_and_tids_count="false"
--cgroups_enable_cfs="false" --cgroups_hierarchy="/sys/fs/cgroup" --cgroups_limit_swap="false"
--cgroups_root="mesos" --container_disk_watch_interval="15secs" --containerizers="mesos" --credential="/tmp/Endpoint_SlaveEndpointTest_UnauthorizedRequest_2_My5TpR/credential"
--default_role="*" --disk_watch_interval="1mins" --docker="docker" --docker_kill_orphans="true"
--docker_registry="https://registry-1.docker.io" --docker_remove_delay="6hrs" --docker_socket="/var/run/docker.sock"
--docker_stop_timeout="0ns" --docker_store_dir="/tmp/mesos/store/docker" --docker_volume_checkpoint_dir="/var/run/mesos/isolators/docker/volume"
--enforce_container_disk_quota="false" --executor_registration_timeout="1mins" --executor_shutdown_grace_period="5secs"
--fetcher_cache_dir="/tmp/Endpoint_SlaveEndpointTest_UnauthorizedRequest_2_My5TpR/fetch" --fetcher_cache_size="2GB"
--frameworks_home="" --gc_delay="1weeks" --gc_disk_headroom="0.1" --hadoop_home="" --help="false"
--hostname_lookup="true" --http_command_executor="false" --http_credentials="/tmp/Endpoint_SlaveEndpointTest_UnauthorizedRequest_2_My5TpR/http_credentials"
--http_heartbeat_interval="30secs" --initialize_driver_logging="true" --isolation="posix/cpu,posix/mem"
--launcher="posix" --launcher_dir="/mesos/build/src" --logbufsecs="0" --logging_level="INFO"
--max_completed_executors_per_framework="150" --oversubscribed_resources_interval="15secs"
--perf_duration="10secs" --perf_interval="1mins" --port="5051" --qos_correction_interval_min="0ns"
--quiet="false" --recover="reconnect" --recovery_timeout="15mins" --registration_backoff_factor="10ms"
--resources="cpus:2;gpus:0;mem:1024;disk:1024;ports:[31000-32000]" --revocable_cpu_low_priority="true"
--runtime_dir="/tmp/Endpoint_SlaveEndpointTest_UnauthorizedRequest_2_My5TpR" --sandbox_directory="/mnt/mesos/sandbox"
--strict="true" --switch_user="true" --systemd_enable_support="true" --systemd_runtime_directory="/run/systemd/system"
--version="false" --work_dir="/tmp/Endpoint_SlaveEndpointTest_UnauthorizedRequest_2_52YEiq"
I0509 08:30:23.132711 24446 credentials.hpp:86] Loading credential for authentication from
'/tmp/Endpoint_SlaveEndpointTest_UnauthorizedRequest_2_My5TpR/credential'
I0509 08:30:23.132802 24446 slave.cpp:258] Agent using credential for: test-principal
I0509 08:30:23.132818 24446 credentials.hpp:37] Loading credentials for authentication from
'/tmp/Endpoint_SlaveEndpointTest_UnauthorizedRequest_2_My5TpR/http_credentials'
I0509 08:30:23.132935 24446 http.cpp:975] Creating default 'basic' HTTP authenticator for
realm 'mesos-agent-readonly'
I0509 08:30:23.133016 24446 http.cpp:975] Creating default 'basic' HTTP authenticator for
realm 'mesos-agent-readwrite'
I0509 08:30:23.133584 24446 slave.cpp:525] Agent resources: cpus(*):2; mem(*):1024; disk(*):1024;
ports(*):[31000-32000]
I0509 08:30:23.133627 24446 slave.cpp:533] Agent attributes: [  ]
I0509 08:30:23.133643 24446 slave.cpp:538] Agent hostname: 3e54dce96958
I0509 08:30:23.133769 24440 status_update_manager.cpp:177] Pausing sending status updates
I0509 08:30:23.134204 24445 state.cpp:62] Recovering state from '/tmp/Endpoint_SlaveEndpointTest_UnauthorizedRequest_2_52YEiq/meta'
I0509 08:30:23.134352 24450 status_update_manager.cpp:203] Recovering status update manager
I0509 08:30:23.134593 24440 containerizer.cpp:608] Recovering containerizer
I0509 08:30:23.135182 24443 provisioner.cpp:410] Provisioner recovery complete
I0509 08:30:23.135433 24449 slave.cpp:5963] Finished recovery
I0509 08:30:23.135855 24449 slave.cpp:6145] Querying resource estimator for oversubscribable
resources
I0509 08:30:23.136113 24452 slave.cpp:6159] Received oversubscribable resources {} from the
resource estimator
I0509 08:30:23.137001 24440 process.cpp:3730] Handling HTTP event for process 'slave(744)'
with path: '/slave(744)/containers'
I0509 08:30:23.137547 24446 http.cpp:1115] HTTP GET for /slave(744)/containers from 172.17.0.3:41811
I0509 08:30:23.137593 24446 http.cpp:936] Authorizing principal 'test-principal' to GET the
'/containers' endpoint
I0509 08:30:23.138789 24436 slave.cpp:790] Agent terminating
[       OK ] Endpoint/SlaveEndpointTest.UnauthorizedRequest/2 (13 ms)
[ RUN      ] Endpoint/SlaveEndpointTest.NoAuthorizer/0
I0509 08:30:23.143965 24436 containerizer.cpp:221] Using isolation: posix/cpu,posix/mem,filesystem/posix,network/cni
W0509 08:30:23.144239 24436 backend.cpp:76] Failed to create 'aufs' backend: AufsBackend requires
root privileges
W0509 08:30:23.144278 24436 backend.cpp:76] Failed to create 'bind' backend: BindBackend requires
root privileges
I0509 08:30:23.144299 24436 provisioner.cpp:249] Using default backend 'copy'
I0509 08:30:23.144809 24436 cluster.cpp:448] Creating default 'local' authorizer
I0509 08:30:23.145361 24451 slave.cpp:225] Mesos agent started on (745)@172.17.0.3:33173
I0509 08:30:23.145406 24451 slave.cpp:226] Flags at startup: --acls="" --appc_simple_discovery_uri_prefix="http://"
--appc_store_dir="/tmp/mesos/store/appc" --authenticate_http_readonly="true" --authenticate_http_readwrite="true"
--authenticatee="crammd5" --authentication_backoff_factor="1secs" --authorizer="local" --cgroups_cpu_enable_pids_and_tids_count="false"
--cgroups_enable_cfs="false" --cgroups_hierarchy="/sys/fs/cgroup" --cgroups_limit_swap="false"
--cgroups_root="mesos" --container_disk_watch_interval="15secs" --containerizers="mesos" --credential="/tmp/Endpoint_SlaveEndpointTest_NoAuthorizer_0_yFv3ZB/credential"
--default_role="*" --disk_watch_interval="1mins" --docker="docker" --docker_kill_orphans="true"
--docker_registry="https://registry-1.docker.io" --docker_remove_delay="6hrs" --docker_socket="/var/run/docker.sock"
--docker_stop_timeout="0ns" --docker_store_dir="/tmp/mesos/store/docker" --docker_volume_checkpoint_dir="/var/run/mesos/isolators/docker/volume"
--enforce_container_disk_quota="false" --executor_registration_timeout="1mins" --executor_shutdown_grace_period="5secs"
--fetcher_cache_dir="/tmp/Endpoint_SlaveEndpointTest_NoAuthorizer_0_yFv3ZB/fetch" --fetcher_cache_size="2GB"
--frameworks_home="" --gc_delay="1weeks" --gc_disk_headroom="0.1" --hadoop_home="" --help="false"
--hostname_lookup="true" --http_command_executor="false" --http_credentials="/tmp/Endpoint_SlaveEndpointTest_NoAuthorizer_0_yFv3ZB/http_credentials"
--http_heartbeat_interval="30secs" --initialize_driver_logging="true" --isolation="posix/cpu,posix/mem"
--launcher="posix" --launcher_dir="/mesos/build/src" --logbufsecs="0" --logging_level="INFO"
--max_completed_executors_per_framework="150" --oversubscribed_resources_interval="15secs"
--perf_duration="10secs" --perf_interval="1mins" --port="5051" --qos_correction_interval_min="0ns"
--quiet="false" --recover="reconnect" --recovery_timeout="15mins" --registration_backoff_factor="10ms"
--resources="cpus:2;gpus:0;mem:1024;disk:1024;ports:[31000-32000]" --revocable_cpu_low_priority="true"
--runtime_dir="/tmp/Endpoint_SlaveEndpointTest_NoAuthorizer_0_yFv3ZB" --sandbox_directory="/mnt/mesos/sandbox"
--strict="true" --switch_user="true" --systemd_enable_support="true" --systemd_runtime_directory="/run/systemd/system"
--version="false" --work_dir="/tmp/Endpoint_SlaveEndpointTest_NoAuthorizer_0_80uHQa"
I0509 08:30:23.145642 24451 credentials.hpp:86] Loading credential for authentication from
'/tmp/Endpoint_SlaveEndpointTest_NoAuthorizer_0_yFv3ZB/credential'
I0509 08:30:23.145741 24451 slave.cpp:258] Agent using credential for: test-principal
I0509 08:30:23.145758 24451 credentials.hpp:37] Loading credentials for authentication from
'/tmp/Endpoint_SlaveEndpointTest_NoAuthorizer_0_yFv3ZB/http_credentials'
I0509 08:30:23.145910 24451 http.cpp:975] Creating default 'basic' HTTP authenticator for
realm 'mesos-agent-readonly'
I0509 08:30:23.145964 24451 http.cpp:975] Creating default 'basic' HTTP authenticator for
realm 'mesos-agent-readwrite'
I0509 08:30:23.146381 24451 slave.cpp:525] Agent resources: cpus(*):2; mem(*):1024; disk(*):1024;
ports(*):[31000-32000]
I0509 08:30:23.146420 24451 slave.cpp:533] Agent attributes: [  ]
I0509 08:30:23.146435 24451 slave.cpp:538] Agent hostname: 3e54dce96958
I0509 08:30:23.146514 24444 status_update_manager.cpp:177] Pausing sending status updates
I0509 08:30:23.146893 24441 state.cpp:62] Recovering state from '/tmp/Endpoint_SlaveEndpointTest_NoAuthorizer_0_80uHQa/meta'
I0509 08:30:23.147037 24443 status_update_manager.cpp:203] Recovering status update manager
I0509 08:30:23.147218 24445 containerizer.cpp:608] Recovering containerizer
I0509 08:30:23.147773 24444 provisioner.cpp:410] Provisioner recovery complete
I0509 08:30:23.147931 24450 slave.cpp:5963] Finished recovery
I0509 08:30:23.148288 24450 slave.cpp:6145] Querying resource estimator for oversubscribable
resources
I0509 08:30:23.148499 24444 slave.cpp:6159] Received oversubscribable resources {} from the
resource estimator
I0509 08:30:23.149065 24438 process.cpp:3730] Handling HTTP event for process 'slave(745)'
with path: '/slave(745)/monitor/statistics'
I0509 08:30:23.149456 24452 http.cpp:1115] HTTP GET for /slave(745)/monitor/statistics from
172.17.0.3:41812
I0509 08:30:23.149497 24452 http.cpp:936] Authorizing principal 'test-principal' to GET the
'/monitor/statistics' endpoint
I0509 08:30:23.151268 24443 slave.cpp:790] Agent terminating
[       OK ] Endpoint/SlaveEndpointTest.NoAuthorizer/0 (12 ms)
[ RUN      ] Endpoint/SlaveEndpointTest.NoAuthorizer/1
I0509 08:30:23.156458 24436 containerizer.cpp:221] Using isolation: posix/cpu,posix/mem,filesystem/posix,network/cni
W0509 08:30:23.156806 24436 backend.cpp:76] Failed to create 'aufs' backend: AufsBackend requires
root privileges
W0509 08:30:23.156848 24436 backend.cpp:76] Failed to create 'bind' backend: BindBackend requires
root privileges
I0509 08:30:23.156864 24436 provisioner.cpp:249] Using default backend 'copy'
I0509 08:30:23.157549 24436 cluster.cpp:448] Creating default 'local' authorizer
I0509 08:30:23.158138 24441 slave.cpp:225] Mesos agent started on (746)@172.17.0.3:33173
I0509 08:30:23.158191 24441 slave.cpp:226] Flags at startup: --acls="" --appc_simple_discovery_uri_prefix="http://"
--appc_store_dir="/tmp/mesos/store/appc" --authenticate_http_readonly="true" --authenticate_http_readwrite="true"
--authenticatee="crammd5" --authentication_backoff_factor="1secs" --authorizer="local" --cgroups_cpu_enable_pids_and_tids_count="false"
--cgroups_enable_cfs="false" --cgroups_hierarchy="/sys/fs/cgroup" --cgroups_limit_swap="false"
--cgroups_root="mesos" --container_disk_watch_interval="15secs" --containerizers="mesos" --credential="/tmp/Endpoint_SlaveEndpointTest_NoAuthorizer_1_Kp7gIm/credential"
--default_role="*" --disk_watch_interval="1mins" --docker="docker" --docker_kill_orphans="true"
--docker_registry="https://registry-1.docker.io" --docker_remove_delay="6hrs" --docker_socket="/var/run/docker.sock"
--docker_stop_timeout="0ns" --docker_store_dir="/tmp/mesos/store/docker" --docker_volume_checkpoint_dir="/var/run/mesos/isolators/docker/volume"
--enforce_container_disk_quota="false" --executor_registration_timeout="1mins" --executor_shutdown_grace_period="5secs"
--fetcher_cache_dir="/tmp/Endpoint_SlaveEndpointTest_NoAuthorizer_1_Kp7gIm/fetch" --fetcher_cache_size="2GB"
--frameworks_home="" --gc_delay="1weeks" --gc_disk_headroom="0.1" --hadoop_home="" --help="false"
--hostname_lookup="true" --http_command_executor="false" --http_credentials="/tmp/Endpoint_SlaveEndpointTest_NoAuthorizer_1_Kp7gIm/http_credentials"
--http_heartbeat_interval="30secs" --initialize_driver_logging="true" --isolation="posix/cpu,posix/mem"
--launcher="posix" --launcher_dir="/mesos/build/src" --logbufsecs="0" --logging_level="INFO"
--max_completed_executors_per_framework="150" --oversubscribed_resources_interval="15secs"
--perf_duration="10secs" --perf_interval="1mins" --port="5051" --qos_correction_interval_min="0ns"
--quiet="false" --recover="reconnect" --recovery_timeout="15mins" --registration_backoff_factor="10ms"
--resources="cpus:2;gpus:0;mem:1024;disk:1024;ports:[31000-32000]" --revocable_cpu_low_priority="true"
--runtime_dir="/tmp/Endpoint_SlaveEndpointTest_NoAuthorizer_1_Kp7gIm" --sandbox_directory="/mnt/mesos/sandbox"
--strict="true" --switch_user="true" --systemd_enable_support="true" --systemd_runtime_directory="/run/systemd/system"
--version="false" --work_dir="/tmp/Endpoint_SlaveEndpointTest_NoAuthorizer_1_2MRTwV"
I0509 08:30:23.158455 24441 credentials.hpp:86] Loading credential for authentication from
'/tmp/Endpoint_SlaveEndpointTest_NoAuthorizer_1_Kp7gIm/credential'
I0509 08:30:23.158576 24441 slave.cpp:258] Agent using credential for: test-principal
I0509 08:30:23.158601 24441 credentials.hpp:37] Loading credentials for authentication from
'/tmp/Endpoint_SlaveEndpointTest_NoAuthorizer_1_Kp7gIm/http_credentials'
I0509 08:30:23.158761 24441 http.cpp:975] Creating default 'basic' HTTP authenticator for
realm 'mesos-agent-readonly'
I0509 08:30:23.158820 24441 http.cpp:975] Creating default 'basic' HTTP authenticator for
realm 'mesos-agent-readwrite'
I0509 08:30:23.159353 24441 slave.cpp:525] Agent resources: cpus(*):2; mem(*):1024; disk(*):1024;
ports(*):[31000-32000]
I0509 08:30:23.159394 24441 slave.cpp:533] Agent attributes: [  ]
I0509 08:30:23.159401 24441 slave.cpp:538] Agent hostname: 3e54dce96958
I0509 08:30:23.159492 24447 status_update_manager.cpp:177] Pausing sending status updates
I0509 08:30:23.159865 24447 state.cpp:62] Recovering state from '/tmp/Endpoint_SlaveEndpointTest_NoAuthorizer_1_2MRTwV/meta'
I0509 08:30:23.160017 24447 status_update_manager.cpp:203] Recovering status update manager
I0509 08:30:23.160166 24447 containerizer.cpp:608] Recovering containerizer
I0509 08:30:23.160887 24448 provisioner.cpp:410] Provisioner recovery complete
I0509 08:30:23.161123 24448 slave.cpp:5963] Finished recovery
I0509 08:30:23.161535 24448 slave.cpp:6145] Querying resource estimator for oversubscribable
resources
I0509 08:30:23.161721 24438 slave.cpp:6159] Received oversubscribable resources {} from the
resource estimator
I0509 08:30:23.162362 24439 process.cpp:3730] Handling HTTP event for process 'slave(746)'
with path: '/slave(746)/monitor/statistics.json'
I0509 08:30:23.162888 24445 http.cpp:1115] HTTP GET for /slave(746)/monitor/statistics.json
from 172.17.0.3:41813
I0509 08:30:23.162937 24445 http.cpp:936] Authorizing principal 'test-principal' to GET the
'/monitor/statistics.json' endpoint
I0509 08:30:23.164340 24439 slave.cpp:790] Agent terminating
[       OK ] Endpoint/SlaveEndpointTest.NoAuthorizer/1 (12 ms)
[ RUN      ] Endpoint/SlaveEndpointTest.NoAuthorizer/2
I0509 08:30:23.170255 24436 containerizer.cpp:221] Using isolation: posix/cpu,posix/mem,filesystem/posix,network/cni
W0509 08:30:23.170598 24436 backend.cpp:76] Failed to create 'aufs' backend: AufsBackend requires
root privileges
W0509 08:30:23.170648 24436 backend.cpp:76] Failed to create 'bind' backend: BindBackend requires
root privileges
I0509 08:30:23.170673 24436 provisioner.cpp:249] Using default backend 'copy'
I0509 08:30:23.171418 24436 cluster.cpp:448] Creating default 'local' authorizer
I0509 08:30:23.171958 24441 slave.cpp:225] Mesos agent started on (747)@172.17.0.3:33173
I0509 08:30:23.172086 24441 slave.cpp:226] Flags at startup: --acls="" --appc_simple_discovery_uri_prefix="http://"
--appc_store_dir="/tmp/mesos/store/appc" --authenticate_http_readonly="true" --authenticate_http_readwrite="true"
--authenticatee="crammd5" --authentication_backoff_factor="1secs" --authorizer="local" --cgroups_cpu_enable_pids_and_tids_count="false"
--cgroups_enable_cfs="false" --cgroups_hierarchy="/sys/fs/cgroup" --cgroups_limit_swap="false"
--cgroups_root="mesos" --container_disk_watch_interval="15secs" --containerizers="mesos" --credential="/tmp/Endpoint_SlaveEndpointTest_NoAuthorizer_2_QsBez7/credential"
--default_role="*" --disk_watch_interval="1mins" --docker="docker" --docker_kill_orphans="true"
--docker_registry="https://registry-1.docker.io" --docker_remove_delay="6hrs" --docker_socket="/var/run/docker.sock"
--docker_stop_timeout="0ns" --docker_store_dir="/tmp/mesos/store/docker" --docker_volume_checkpoint_dir="/var/run/mesos/isolators/docker/volume"
--enforce_container_disk_quota="false" --executor_registration_timeout="1mins" --executor_shutdown_grace_period="5secs"
--fetcher_cache_dir="/tmp/Endpoint_SlaveEndpointTest_NoAuthorizer_2_QsBez7/fetch" --fetcher_cache_size="2GB"
--frameworks_home="" --gc_delay="1weeks" --gc_disk_headroom="0.1" --hadoop_home="" --help="false"
--hostname_lookup="true" --http_command_executor="false" --http_credentials="/tmp/Endpoint_SlaveEndpointTest_NoAuthorizer_2_QsBez7/http_credentials"
--http_heartbeat_interval="30secs" --initialize_driver_logging="true" --isolation="posix/cpu,posix/mem"
--launcher="posix" --launcher_dir="/mesos/build/src" --logbufsecs="0" --logging_level="INFO"
--max_completed_executors_per_framework="150" --oversubscribed_resources_interval="15secs"
--perf_duration="10secs" --perf_interval="1mins" --port="5051" --qos_correction_interval_min="0ns"
--quiet="false" --recover="reconnect" --recovery_timeout="15mins" --registration_backoff_factor="10ms"
--resources="cpus:2;gpus:0;mem:1024;disk:1024;ports:[31000-32000]" --revocable_cpu_low_priority="true"
--runtime_dir="/tmp/Endpoint_SlaveEndpointTest_NoAuthorizer_2_QsBez7" --sandbox_directory="/mnt/mesos/sandbox"
--strict="true" --switch_user="true" --systemd_enable_support="true" --systemd_runtime_directory="/run/systemd/system"
--version="false" --work_dir="/tmp/Endpoint_SlaveEndpointTest_NoAuthorizer_2_eVjElG"
I0509 08:30:23.172374 24441 credentials.hpp:86] Loading credential for authentication from
'/tmp/Endpoint_SlaveEndpointTest_NoAuthorizer_2_QsBez7/credential'
I0509 08:30:23.172477 24441 slave.cpp:258] Agent using credential for: test-principal
I0509 08:30:23.172497 24441 credentials.hpp:37] Loading credentials for authentication from
'/tmp/Endpoint_SlaveEndpointTest_NoAuthorizer_2_QsBez7/http_credentials'
I0509 08:30:23.172618 24441 http.cpp:975] Creating default 'basic' HTTP authenticator for
realm 'mesos-agent-readonly'
I0509 08:30:23.172667 24441 http.cpp:975] Creating default 'basic' HTTP authenticator for
realm 'mesos-agent-readwrite'
I0509 08:30:23.173188 24441 slave.cpp:525] Agent resources: cpus(*):2; mem(*):1024; disk(*):1024;
ports(*):[31000-32000]
I0509 08:30:23.173229 24441 slave.cpp:533] Agent attributes: [  ]
I0509 08:30:23.173238 24441 slave.cpp:538] Agent hostname: 3e54dce96958
I0509 08:30:23.173311 24448 status_update_manager.cpp:177] Pausing sending status updates
I0509 08:30:23.173709 24443 state.cpp:62] Recovering state from '/tmp/Endpoint_SlaveEndpointTest_NoAuthorizer_2_eVjElG/meta'
I0509 08:30:23.173916 24448 status_update_manager.cpp:203] Recovering status update manager
I0509 08:30:23.174031 24441 containerizer.cpp:608] Recovering containerizer
I0509 08:30:23.174621 24441 provisioner.cpp:410] Provisioner recovery complete
I0509 08:30:23.174932 24444 slave.cpp:5963] Finished recovery
I0509 08:30:23.175464 24444 slave.cpp:6145] Querying resource estimator for oversubscribable
resources
I0509 08:30:23.175696 24438 slave.cpp:6159] Received oversubscribable resources {} from the
resource estimator
I0509 08:30:23.176345 24444 process.cpp:3730] Handling HTTP event for process 'slave(747)'
with path: '/slave(747)/containers'
I0509 08:30:23.176784 24437 http.cpp:1115] HTTP GET for /slave(747)/containers from 172.17.0.3:41814
I0509 08:30:23.176831 24437 http.cpp:936] Authorizing principal 'test-principal' to GET the
'/containers' endpoint
I0509 08:30:23.178161 24438 slave.cpp:790] Agent terminating
[       OK ] Endpoint/SlaveEndpointTest.NoAuthorizer/2 (13 ms)
[----------] 9 tests from Endpoint/SlaveEndpointTest (110 ms total)

[----------] Global test environment tear-down
[==========] 1516 tests from 166 test cases ran. (209415 ms total)
[  PASSED  ] 1515 tests.
[  FAILED  ] 1 test, listed below:
[  FAILED  ] SlaveTest.ExecutorShutdownGracePeriod

 1 FAILED TEST
  YOU HAVE 19 DISABLED TESTS

E0509 08:30:23.231815 24453 process.cpp:950] Failed to accept socket: future discarded
make[3]: Leaving directory `/mesos/build'
make[3]: *** [CMakeFiles/check] Error 1
make[2]: *** [CMakeFiles/check.dir/all] Error 2
make[2]: Leaving directory `/mesos/build'
make[1]: *** [CMakeFiles/check.dir/rule] Error 2
make[1]: Leaving directory `/mesos/build'
make: *** [check] Error 2
+ docker rmi mesos-1494315844-14530
Untagged: mesos-1494315844-14530:latest
Deleted: sha256:ed291e703b8af6f0c4b9c81f3d7f37a578f07d26b55da9df9d04e55bb8f48078
Deleted: sha256:4fe51e6e1999540e759b1644f22f52f3a0d1a5850b4e811baae6f4af95e99e69
Deleted: sha256:ca582dd79b3d24574d550589a1f062bc1cc8ac203bbb566daa2fb884e26b7286
Deleted: sha256:7ff0710aab0c2bc12ac4a4ce521fbed1d7f17942e5a1ed552ce3bec306af6a79
Deleted: sha256:cc07219e4babf11a55150a20a02ee2d543136941f8fe7b7695945eff288f085c
Deleted: sha256:6251a1aecfdda86eee83e133d7cbf78a9d92ad4397f691a959b2fc49a2312866
Deleted: sha256:80b90dc07142f9c1d0581724ba1ecb5d7c50dcfe36111effd16c86039e65c77d
Deleted: sha256:49e0a6db8a9c566ebb325284d5fc501876f01edaafb2d9f7cbda5a8cf6176bb9
Deleted: sha256:4815898be3b4f5ebc65c948eaa1f87da463c9b07e8e838f1353adfd307c81ee0
Deleted: sha256:dfb05c4df706f5bfcd90289d1e0428ac5fb646c8acfcf1d9a69f1dc604c753bb
Deleted: sha256:9f66ca8960285b3a62b0299373a8baa999a44757dc7442645cc6930a0add5a8f
Deleted: sha256:b40d622ffca714165c6bd751a860efaa338e6e5b9d28ca8979ff3798ae59559d
Deleted: sha256:be7b380c0288612ffef8781dc248c6ca4f2862fb25ed1f4744ea0cf9592d7242
Deleted: sha256:b064b8d7168d27f9af88b3a265b4b464d41b52db219bd39fd2ff95c8a8857d7b
Deleted: sha256:280939c00df663598bbec06354e531a4ee302efd441870f57dd047c546c8a503
Deleted: sha256:255ab1d95d06a23d44b35098b7697877269efab1668f595e00a8aedf940f16e9
Deleted: sha256:af2676e285e5bade21f1e9cd07e23519fc880621c5779f35a9ebe1c1f4ddc371
Deleted: sha256:8fb53cf87a6238ccde6ed86f98d68a92f7bdc7a5f3dcc479b95c9492b2798c24
Deleted: sha256:fa631cd84dc07cdcddef57bf03222938a6a3457a73c8048a544b57049a4e6cc0
Deleted: sha256:0d560c6b9c0c3b9f25e4ea07dc11d3a57e8e9743348b8adca3e9174226b5146b
Deleted: sha256:31843db38350c40df75fc86bf9e8473454acd85764a8cf23fb88bac6d97b51ec
Deleted: sha256:aad61adb937de6ab8c579112506f9ce737b6c752d6c40a78d92b1d81cabee248
Deleted: sha256:d814f593d4dc3a730f9abacab63ed50bf4e38d5f3fa385a8e8db53c8948dc701
Deleted: sha256:8d138625f38507408c736c7bb7514def4f7a38b526d98cc1c2d1ae85d5542680
Deleted: sha256:b8a762f1d5b285cd36fc644ccc05a20aa959c54bb25cccc073c6786a9c10ff4b
Build step 'Execute shell' marked build as failure
Not sending mail to unregistered user yujie.jay@gmail.com

Mime
View raw message