mesos-builds mailing list archives

Site index · List index
Message view « Date » · « Thread »
Top « Date » · « Thread »
From Apache Jenkins Server <jenk...@builds.apache.org>
Subject Build failed in Jenkins: Mesos-Buildbot » cmake,gcc,--verbose,GLOG_v=1 MESOS_VERBOSE=1,ubuntu:14.04,(docker||Hadoop)&&(!ubuntu-us1)&&(!ubuntu-eu2) #3600
Date Wed, 03 May 2017 10:04:02 GMT
See <https://builds.apache.org/job/Mesos-Buildbot/BUILDTOOL=cmake,COMPILER=gcc,CONFIGURATION=--verbose,ENVIRONMENT=GLOG_v=1%20MESOS_VERBOSE=1,OS=ubuntu%3A14.04,label_exp=(docker%7C%7CHadoop)&&(!ubuntu-us1)&&(!ubuntu-eu2)/3600/display/redirect?page=changes>

Changes:

[xujyan] Metrics for used resources should incorporate shared resources.

[xujyan] Added a test to verify metrics when shared resources are present.

------------------------------------------
[...truncated 1.41 MB...]
/usr/bin/cmake -E cmake_progress_report /mesos/build/CMakeFiles 
[ 83%] Building CXX object src/tests/CMakeFiles/mesos-tests.dir/credentials_tests.cpp.o
cd /mesos/build/src/tests && /usr/bin/g++   -DBUILD_DIR=\"/mesos/build\" -DBUILD_FLAGS=\"\" -DBUILD_JAVA_JVM_LIBRARY=\"\" -DHAS_AUTHENTICATION=1 -DLIBDIR=\"/usr/local/libmesos\" -DPICOJSON_USE_INT64 -DPKGDATADIR=\"/usr/local/share/mesos\" -DPKGLIBEXECDIR=\"/usr/local/libexec/mesos\" -DPKGMODULEDIR=\"\" -DSBINDIR=\"\" -DSOURCE_DIR=\"/mesos\" -DTESTLIBEXECDIR=\"\" -DUSE_CMAKE_BUILD_CONFIG -DUSE_STATIC_LIB -DVERSION=\"1.4.0\" -D__STDC_FORMAT_MACROS -O2 -std=c++11 -g -fPIE -I/mesos/build/include -I/mesos/build/include/mesos -I/mesos/build/src -I/mesos/src -isystem /mesos/build/3rdparty/protobuf-2.6.1/src/protobuf-2.6.1-lib/lib/include -isystem /mesos/3rdparty/libprocess/include -isystem /usr/include/apr-1.0 -isystem /mesos/build/3rdparty/boost-1.53.0/src/boost-1.53.0 -isystem /mesos/build/3rdparty/elfio-3.2/src/elfio-3.2 -isystem /mesos/build/3rdparty/glog-0.3.3/src/glog-0.3.3-lib/lib/include -isystem /mesos/build/3rdparty/nvml-352.79/src/nvml-352.79 -isystem /mesos/build/3rdparty/picojson-1.3.0/src/picojson-1.3.0 -isystem /usr/include/subversion-1 -isystem /mesos/3rdparty/stout/include -isystem /mesos/build/3rdparty/http_parser-2.6.2/src/http_parser-2.6.2 -isystem /mesos/build/3rdparty/libev-4.22/src/libev-4.22 -isystem /mesos/build/3rdparty/zookeeper-3.4.8/src/zookeeper-3.4.8/src/c/include -isystem /mesos/build/3rdparty/zookeeper-3.4.8/src/zookeeper-3.4.8/src/c/generated -isystem /mesos/build/3rdparty/leveldb-1.19/src/leveldb-1.19/include -I/mesos/include -isystem /mesos/build/3rdparty/gmock-1.7.0/src/gmock-1.7.0/include -isystem /mesos/build/3rdparty/gmock-1.7.0/src/gmock-1.7.0/gtest/include    -o CMakeFiles/mesos-tests.dir/credentials_tests.cpp.o -c /mesos/src/tests/credentials_tests.cpp
/usr/bin/cmake -E cmake_progress_report /mesos/build/CMakeFiles 63
[ 84%] Building CXX object src/tests/CMakeFiles/mesos-tests.dir/default_executor_tests.cpp.o
cd /mesos/build/src/tests && /usr/bin/g++   -DBUILD_DIR=\"/mesos/build\" -DBUILD_FLAGS=\"\" -DBUILD_JAVA_JVM_LIBRARY=\"\" -DHAS_AUTHENTICATION=1 -DLIBDIR=\"/usr/local/libmesos\" -DPICOJSON_USE_INT64 -DPKGDATADIR=\"/usr/local/share/mesos\" -DPKGLIBEXECDIR=\"/usr/local/libexec/mesos\" -DPKGMODULEDIR=\"\" -DSBINDIR=\"\" -DSOURCE_DIR=\"/mesos\" -DTESTLIBEXECDIR=\"\" -DUSE_CMAKE_BUILD_CONFIG -DUSE_STATIC_LIB -DVERSION=\"1.4.0\" -D__STDC_FORMAT_MACROS -O2 -std=c++11 -g -fPIE -I/mesos/build/include -I/mesos/build/include/mesos -I/mesos/build/src -I/mesos/src -isystem /mesos/build/3rdparty/protobuf-2.6.1/src/protobuf-2.6.1-lib/lib/include -isystem /mesos/3rdparty/libprocess/include -isystem /usr/include/apr-1.0 -isystem /mesos/build/3rdparty/boost-1.53.0/src/boost-1.53.0 -isystem /mesos/build/3rdparty/elfio-3.2/src/elfio-3.2 -isystem /mesos/build/3rdparty/glog-0.3.3/src/glog-0.3.3-lib/lib/include -isystem /mesos/build/3rdparty/nvml-352.79/src/nvml-352.79 -isystem /mesos/build/3rdparty/picojson-1.3.0/src/picojson-1.3.0 -isystem /usr/include/subversion-1 -isystem /mesos/3rdparty/stout/include -isystem /mesos/build/3rdparty/http_parser-2.6.2/src/http_parser-2.6.2 -isystem /mesos/build/3rdparty/libev-4.22/src/libev-4.22 -isystem /mesos/build/3rdparty/zookeeper-3.4.8/src/zookeeper-3.4.8/src/c/include -isystem /mesos/build/3rdparty/zookeeper-3.4.8/src/zookeeper-3.4.8/src/c/generated -isystem /mesos/build/3rdparty/leveldb-1.19/src/leveldb-1.19/include -I/mesos/include -isystem /mesos/build/3rdparty/gmock-1.7.0/src/gmock-1.7.0/include -isystem /mesos/build/3rdparty/gmock-1.7.0/src/gmock-1.7.0/gtest/include    -o CMakeFiles/mesos-tests.dir/default_executor_tests.cpp.o -c /mesos/src/tests/default_executor_tests.cpp
/usr/bin/cmake -E cmake_progress_report /mesos/build/CMakeFiles 
[ 84%] Building CXX object src/tests/CMakeFiles/mesos-tests.dir/exception_tests.cpp.o
cd /mesos/build/src/tests && /usr/bin/g++   -DBUILD_DIR=\"/mesos/build\" -DBUILD_FLAGS=\"\" -DBUILD_JAVA_JVM_LIBRARY=\"\" -DHAS_AUTHENTICATION=1 -DLIBDIR=\"/usr/local/libmesos\" -DPICOJSON_USE_INT64 -DPKGDATADIR=\"/usr/local/share/mesos\" -DPKGLIBEXECDIR=\"/usr/local/libexec/mesos\" -DPKGMODULEDIR=\"\" -DSBINDIR=\"\" -DSOURCE_DIR=\"/mesos\" -DTESTLIBEXECDIR=\"\" -DUSE_CMAKE_BUILD_CONFIG -DUSE_STATIC_LIB -DVERSION=\"1.4.0\" -D__STDC_FORMAT_MACROS -O2 -std=c++11 -g -fPIE -I/mesos/build/include -I/mesos/build/include/mesos -I/mesos/build/src -I/mesos/src -isystem /mesos/build/3rdparty/protobuf-2.6.1/src/protobuf-2.6.1-lib/lib/include -isystem /mesos/3rdparty/libprocess/include -isystem /usr/include/apr-1.0 -isystem /mesos/build/3rdparty/boost-1.53.0/src/boost-1.53.0 -isystem /mesos/build/3rdparty/elfio-3.2/src/elfio-3.2 -isystem /mesos/build/3rdparty/glog-0.3.3/src/glog-0.3.3-lib/lib/include -isystem /mesos/build/3rdparty/nvml-352.79/src/nvml-352.79 -isystem /mesos/build/3rdparty/picojson-1.3.0/src/picojson-1.3.0 -isystem /usr/include/subversion-1 -isystem /mesos/3rdparty/stout/include -isystem /mesos/build/3rdparty/http_parser-2.6.2/src/http_parser-2.6.2 -isystem /mesos/build/3rdparty/libev-4.22/src/libev-4.22 -isystem /mesos/build/3rdparty/zookeeper-3.4.8/src/zookeeper-3.4.8/src/c/include -isystem /mesos/build/3rdparty/zookeeper-3.4.8/src/zookeeper-3.4.8/src/c/generated -isystem /mesos/build/3rdparty/leveldb-1.19/src/leveldb-1.19/include -I/mesos/include -isystem /mesos/build/3rdparty/gmock-1.7.0/src/gmock-1.7.0/include -isystem /mesos/build/3rdparty/gmock-1.7.0/src/gmock-1.7.0/gtest/include    -o CMakeFiles/mesos-tests.dir/exception_tests.cpp.o -c /mesos/src/tests/exception_tests.cpp
/usr/bin/cmake -E cmake_progress_report /mesos/build/CMakeFiles 
[ 84%] Building CXX object src/tests/CMakeFiles/mesos-tests.dir/executor_http_api_tests.cpp.o
cd /mesos/build/src/tests && /usr/bin/g++   -DBUILD_DIR=\"/mesos/build\" -DBUILD_FLAGS=\"\" -DBUILD_JAVA_JVM_LIBRARY=\"\" -DHAS_AUTHENTICATION=1 -DLIBDIR=\"/usr/local/libmesos\" -DPICOJSON_USE_INT64 -DPKGDATADIR=\"/usr/local/share/mesos\" -DPKGLIBEXECDIR=\"/usr/local/libexec/mesos\" -DPKGMODULEDIR=\"\" -DSBINDIR=\"\" -DSOURCE_DIR=\"/mesos\" -DTESTLIBEXECDIR=\"\" -DUSE_CMAKE_BUILD_CONFIG -DUSE_STATIC_LIB -DVERSION=\"1.4.0\" -D__STDC_FORMAT_MACROS -O2 -std=c++11 -g -fPIE -I/mesos/build/include -I/mesos/build/include/mesos -I/mesos/build/src -I/mesos/src -isystem /mesos/build/3rdparty/protobuf-2.6.1/src/protobuf-2.6.1-lib/lib/include -isystem /mesos/3rdparty/libprocess/include -isystem /usr/include/apr-1.0 -isystem /mesos/build/3rdparty/boost-1.53.0/src/boost-1.53.0 -isystem /mesos/build/3rdparty/elfio-3.2/src/elfio-3.2 -isystem /mesos/build/3rdparty/glog-0.3.3/src/glog-0.3.3-lib/lib/include -isystem /mesos/build/3rdparty/nvml-352.79/src/nvml-352.79 -isystem /mesos/build/3rdparty/picojson-1.3.0/src/picojson-1.3.0 -isystem /usr/include/subversion-1 -isystem /mesos/3rdparty/stout/include -isystem /mesos/build/3rdparty/http_parser-2.6.2/src/http_parser-2.6.2 -isystem /mesos/build/3rdparty/libev-4.22/src/libev-4.22 -isystem /mesos/build/3rdparty/zookeeper-3.4.8/src/zookeeper-3.4.8/src/c/include -isystem /mesos/build/3rdparty/zookeeper-3.4.8/src/zookeeper-3.4.8/src/c/generated -isystem /mesos/build/3rdparty/leveldb-1.19/src/leveldb-1.19/include -I/mesos/include -isystem /mesos/build/3rdparty/gmock-1.7.0/src/gmock-1.7.0/include -isystem /mesos/build/3rdparty/gmock-1.7.0/src/gmock-1.7.0/gtest/include    -o CMakeFiles/mesos-tests.dir/executor_http_api_tests.cpp.o -c /mesos/src/tests/executor_http_api_tests.cpp
/usr/bin/cmake -E cmake_progress_report /mesos/build/CMakeFiles 
[ 84%] Building CXX object src/tests/CMakeFiles/mesos-tests.dir/fault_tolerance_tests.cpp.o
cd /mesos/build/src/tests && /usr/bin/g++   -DBUILD_DIR=\"/mesos/build\" -DBUILD_FLAGS=\"\" -DBUILD_JAVA_JVM_LIBRARY=\"\" -DHAS_AUTHENTICATION=1 -DLIBDIR=\"/usr/local/libmesos\" -DPICOJSON_USE_INT64 -DPKGDATADIR=\"/usr/local/share/mesos\" -DPKGLIBEXECDIR=\"/usr/local/libexec/mesos\" -DPKGMODULEDIR=\"\" -DSBINDIR=\"\" -DSOURCE_DIR=\"/mesos\" -DTESTLIBEXECDIR=\"\" -DUSE_CMAKE_BUILD_CONFIG -DUSE_STATIC_LIB -DVERSION=\"1.4.0\" -D__STDC_FORMAT_MACROS -O2 -std=c++11 -g -fPIE -I/mesos/build/include -I/mesos/build/include/mesos -I/mesos/build/src -I/mesos/src -isystem /mesos/build/3rdparty/protobuf-2.6.1/src/protobuf-2.6.1-lib/lib/include -isystem /mesos/3rdparty/libprocess/include -isystem /usr/include/apr-1.0 -isystem /mesos/build/3rdparty/boost-1.53.0/src/boost-1.53.0 -isystem /mesos/build/3rdparty/elfio-3.2/src/elfio-3.2 -isystem /mesos/build/3rdparty/glog-0.3.3/src/glog-0.3.3-lib/lib/include -isystem /mesos/build/3rdparty/nvml-352.79/src/nvml-352.79 -isystem /mesos/build/3rdparty/picojson-1.3.0/src/picojson-1.3.0 -isystem /usr/include/subversion-1 -isystem /mesos/3rdparty/stout/include -isystem /mesos/build/3rdparty/http_parser-2.6.2/src/http_parser-2.6.2 -isystem /mesos/build/3rdparty/libev-4.22/src/libev-4.22 -isystem /mesos/build/3rdparty/zookeeper-3.4.8/src/zookeeper-3.4.8/src/c/include -isystem /mesos/build/3rdparty/zookeeper-3.4.8/src/zookeeper-3.4.8/src/c/generated -isystem /mesos/build/3rdparty/leveldb-1.19/src/leveldb-1.19/include -I/mesos/include -isystem /mesos/build/3rdparty/gmock-1.7.0/src/gmock-1.7.0/include -isystem /mesos/build/3rdparty/gmock-1.7.0/src/gmock-1.7.0/gtest/include    -o CMakeFiles/mesos-tests.dir/fault_tolerance_tests.cpp.o -c /mesos/src/tests/fault_tolerance_tests.cpp
/usr/bin/cmake -E cmake_progress_report /mesos/build/CMakeFiles 
[ 84%] Building CXX object src/tests/CMakeFiles/mesos-tests.dir/fetcher_tests.cpp.o
cd /mesos/build/src/tests && /usr/bin/g++   -DBUILD_DIR=\"/mesos/build\" -DBUILD_FLAGS=\"\" -DBUILD_JAVA_JVM_LIBRARY=\"\" -DHAS_AUTHENTICATION=1 -DLIBDIR=\"/usr/local/libmesos\" -DPICOJSON_USE_INT64 -DPKGDATADIR=\"/usr/local/share/mesos\" -DPKGLIBEXECDIR=\"/usr/local/libexec/mesos\" -DPKGMODULEDIR=\"\" -DSBINDIR=\"\" -DSOURCE_DIR=\"/mesos\" -DTESTLIBEXECDIR=\"\" -DUSE_CMAKE_BUILD_CONFIG -DUSE_STATIC_LIB -DVERSION=\"1.4.0\" -D__STDC_FORMAT_MACROS -O2 -std=c++11 -g -fPIE -I/mesos/build/include -I/mesos/build/include/mesos -I/mesos/build/src -I/mesos/src -isystem /mesos/build/3rdparty/protobuf-2.6.1/src/protobuf-2.6.1-lib/lib/include -isystem /mesos/3rdparty/libprocess/include -isystem /usr/include/apr-1.0 -isystem /mesos/build/3rdparty/boost-1.53.0/src/boost-1.53.0 -isystem /mesos/build/3rdparty/elfio-3.2/src/elfio-3.2 -isystem /mesos/build/3rdparty/glog-0.3.3/src/glog-0.3.3-lib/lib/include -isystem /mesos/build/3rdparty/nvml-352.79/src/nvml-352.79 -isystem /mesos/build/3rdparty/picojson-1.3.0/src/picojson-1.3.0 -isystem /usr/include/subversion-1 -isystem /mesos/3rdparty/stout/include -isystem /mesos/build/3rdparty/http_parser-2.6.2/src/http_parser-2.6.2 -isystem /mesos/build/3rdparty/libev-4.22/src/libev-4.22 -isystem /mesos/build/3rdparty/zookeeper-3.4.8/src/zookeeper-3.4.8/src/c/include -isystem /mesos/build/3rdparty/zookeeper-3.4.8/src/zookeeper-3.4.8/src/c/generated -isystem /mesos/build/3rdparty/leveldb-1.19/src/leveldb-1.19/include -I/mesos/include -isystem /mesos/build/3rdparty/gmock-1.7.0/src/gmock-1.7.0/include -isystem /mesos/build/3rdparty/gmock-1.7.0/src/gmock-1.7.0/gtest/include    -o CMakeFiles/mesos-tests.dir/fetcher_tests.cpp.o -c /mesos/src/tests/fetcher_tests.cpp
/usr/bin/cmake -E cmake_progress_report /mesos/build/CMakeFiles 
[ 84%] Building CXX object src/tests/CMakeFiles/mesos-tests.dir/files_tests.cpp.o
cd /mesos/build/src/tests && /usr/bin/g++   -DBUILD_DIR=\"/mesos/build\" -DBUILD_FLAGS=\"\" -DBUILD_JAVA_JVM_LIBRARY=\"\" -DHAS_AUTHENTICATION=1 -DLIBDIR=\"/usr/local/libmesos\" -DPICOJSON_USE_INT64 -DPKGDATADIR=\"/usr/local/share/mesos\" -DPKGLIBEXECDIR=\"/usr/local/libexec/mesos\" -DPKGMODULEDIR=\"\" -DSBINDIR=\"\" -DSOURCE_DIR=\"/mesos\" -DTESTLIBEXECDIR=\"\" -DUSE_CMAKE_BUILD_CONFIG -DUSE_STATIC_LIB -DVERSION=\"1.4.0\" -D__STDC_FORMAT_MACROS -O2 -std=c++11 -g -fPIE -I/mesos/build/include -I/mesos/build/include/mesos -I/mesos/build/src -I/mesos/src -isystem /mesos/build/3rdparty/protobuf-2.6.1/src/protobuf-2.6.1-lib/lib/include -isystem /mesos/3rdparty/libprocess/include -isystem /usr/include/apr-1.0 -isystem /mesos/build/3rdparty/boost-1.53.0/src/boost-1.53.0 -isystem /mesos/build/3rdparty/elfio-3.2/src/elfio-3.2 -isystem /mesos/build/3rdparty/glog-0.3.3/src/glog-0.3.3-lib/lib/include -isystem /mesos/build/3rdparty/nvml-352.79/src/nvml-352.79 -isystem /mesos/build/3rdparty/picojson-1.3.0/src/picojson-1.3.0 -isystem /usr/include/subversion-1 -isystem /mesos/3rdparty/stout/include -isystem /mesos/build/3rdparty/http_parser-2.6.2/src/http_parser-2.6.2 -isystem /mesos/build/3rdparty/libev-4.22/src/libev-4.22 -isystem /mesos/build/3rdparty/zookeeper-3.4.8/src/zookeeper-3.4.8/src/c/include -isystem /mesos/build/3rdparty/zookeeper-3.4.8/src/zookeeper-3.4.8/src/c/generated -isystem /mesos/build/3rdparty/leveldb-1.19/src/leveldb-1.19/include -I/mesos/include -isystem /mesos/build/3rdparty/gmock-1.7.0/src/gmock-1.7.0/include -isystem /mesos/build/3rdparty/gmock-1.7.0/src/gmock-1.7.0/gtest/include    -o CMakeFiles/mesos-tests.dir/files_tests.cpp.o -c /mesos/src/tests/files_tests.cpp
/usr/bin/cmake -E cmake_progress_report /mesos/build/CMakeFiles 
[ 84%] Building CXX object src/tests/CMakeFiles/mesos-tests.dir/gc_tests.cpp.o
cd /mesos/build/src/tests && /usr/bin/g++   -DBUILD_DIR=\"/mesos/build\" -DBUILD_FLAGS=\"\" -DBUILD_JAVA_JVM_LIBRARY=\"\" -DHAS_AUTHENTICATION=1 -DLIBDIR=\"/usr/local/libmesos\" -DPICOJSON_USE_INT64 -DPKGDATADIR=\"/usr/local/share/mesos\" -DPKGLIBEXECDIR=\"/usr/local/libexec/mesos\" -DPKGMODULEDIR=\"\" -DSBINDIR=\"\" -DSOURCE_DIR=\"/mesos\" -DTESTLIBEXECDIR=\"\" -DUSE_CMAKE_BUILD_CONFIG -DUSE_STATIC_LIB -DVERSION=\"1.4.0\" -D__STDC_FORMAT_MACROS -O2 -std=c++11 -g -fPIE -I/mesos/build/include -I/mesos/build/include/mesos -I/mesos/build/src -I/mesos/src -isystem /mesos/build/3rdparty/protobuf-2.6.1/src/protobuf-2.6.1-lib/lib/include -isystem /mesos/3rdparty/libprocess/include -isystem /usr/include/apr-1.0 -isystem /mesos/build/3rdparty/boost-1.53.0/src/boost-1.53.0 -isystem /mesos/build/3rdparty/elfio-3.2/src/elfio-3.2 -isystem /mesos/build/3rdparty/glog-0.3.3/src/glog-0.3.3-lib/lib/include -isystem /mesos/build/3rdparty/nvml-352.79/src/nvml-352.79 -isystem /mesos/build/3rdparty/picojson-1.3.0/src/picojson-1.3.0 -isystem /usr/include/subversion-1 -isystem /mesos/3rdparty/stout/include -isystem /mesos/build/3rdparty/http_parser-2.6.2/src/http_parser-2.6.2 -isystem /mesos/build/3rdparty/libev-4.22/src/libev-4.22 -isystem /mesos/build/3rdparty/zookeeper-3.4.8/src/zookeeper-3.4.8/src/c/include -isystem /mesos/build/3rdparty/zookeeper-3.4.8/src/zookeeper-3.4.8/src/c/generated -isystem /mesos/build/3rdparty/leveldb-1.19/src/leveldb-1.19/include -I/mesos/include -isystem /mesos/build/3rdparty/gmock-1.7.0/src/gmock-1.7.0/include -isystem /mesos/build/3rdparty/gmock-1.7.0/src/gmock-1.7.0/gtest/include    -o CMakeFiles/mesos-tests.dir/gc_tests.cpp.o -c /mesos/src/tests/gc_tests.cpp
/usr/bin/cmake -E cmake_progress_report /mesos/build/CMakeFiles 64
[ 85%] Building CXX object src/tests/CMakeFiles/mesos-tests.dir/health_check_tests.cpp.o
cd /mesos/build/src/tests && /usr/bin/g++   -DBUILD_DIR=\"/mesos/build\" -DBUILD_FLAGS=\"\" -DBUILD_JAVA_JVM_LIBRARY=\"\" -DHAS_AUTHENTICATION=1 -DLIBDIR=\"/usr/local/libmesos\" -DPICOJSON_USE_INT64 -DPKGDATADIR=\"/usr/local/share/mesos\" -DPKGLIBEXECDIR=\"/usr/local/libexec/mesos\" -DPKGMODULEDIR=\"\" -DSBINDIR=\"\" -DSOURCE_DIR=\"/mesos\" -DTESTLIBEXECDIR=\"\" -DUSE_CMAKE_BUILD_CONFIG -DUSE_STATIC_LIB -DVERSION=\"1.4.0\" -D__STDC_FORMAT_MACROS -O2 -std=c++11 -g -fPIE -I/mesos/build/include -I/mesos/build/include/mesos -I/mesos/build/src -I/mesos/src -isystem /mesos/build/3rdparty/protobuf-2.6.1/src/protobuf-2.6.1-lib/lib/include -isystem /mesos/3rdparty/libprocess/include -isystem /usr/include/apr-1.0 -isystem /mesos/build/3rdparty/boost-1.53.0/src/boost-1.53.0 -isystem /mesos/build/3rdparty/elfio-3.2/src/elfio-3.2 -isystem /mesos/build/3rdparty/glog-0.3.3/src/glog-0.3.3-lib/lib/include -isystem /mesos/build/3rdparty/nvml-352.79/src/nvml-352.79 -isystem /mesos/build/3rdparty/picojson-1.3.0/src/picojson-1.3.0 -isystem /usr/include/subversion-1 -isystem /mesos/3rdparty/stout/include -isystem /mesos/build/3rdparty/http_parser-2.6.2/src/http_parser-2.6.2 -isystem /mesos/build/3rdparty/libev-4.22/src/libev-4.22 -isystem /mesos/build/3rdparty/zookeeper-3.4.8/src/zookeeper-3.4.8/src/c/include -isystem /mesos/build/3rdparty/zookeeper-3.4.8/src/zookeeper-3.4.8/src/c/generated -isystem /mesos/build/3rdparty/leveldb-1.19/src/leveldb-1.19/include -I/mesos/include -isystem /mesos/build/3rdparty/gmock-1.7.0/src/gmock-1.7.0/include -isystem /mesos/build/3rdparty/gmock-1.7.0/src/gmock-1.7.0/gtest/include    -o CMakeFiles/mesos-tests.dir/health_check_tests.cpp.o -c /mesos/src/tests/health_check_tests.cpp
/usr/bin/cmake -E cmake_progress_report /mesos/build/CMakeFiles 
[ 85%] Building CXX object src/tests/CMakeFiles/mesos-tests.dir/hierarchical_allocator_tests.cpp.o
cd /mesos/build/src/tests && /usr/bin/g++   -DBUILD_DIR=\"/mesos/build\" -DBUILD_FLAGS=\"\" -DBUILD_JAVA_JVM_LIBRARY=\"\" -DHAS_AUTHENTICATION=1 -DLIBDIR=\"/usr/local/libmesos\" -DPICOJSON_USE_INT64 -DPKGDATADIR=\"/usr/local/share/mesos\" -DPKGLIBEXECDIR=\"/usr/local/libexec/mesos\" -DPKGMODULEDIR=\"\" -DSBINDIR=\"\" -DSOURCE_DIR=\"/mesos\" -DTESTLIBEXECDIR=\"\" -DUSE_CMAKE_BUILD_CONFIG -DUSE_STATIC_LIB -DVERSION=\"1.4.0\" -D__STDC_FORMAT_MACROS -O2 -std=c++11 -g -fPIE -I/mesos/build/include -I/mesos/build/include/mesos -I/mesos/build/src -I/mesos/src -isystem /mesos/build/3rdparty/protobuf-2.6.1/src/protobuf-2.6.1-lib/lib/include -isystem /mesos/3rdparty/libprocess/include -isystem /usr/include/apr-1.0 -isystem /mesos/build/3rdparty/boost-1.53.0/src/boost-1.53.0 -isystem /mesos/build/3rdparty/elfio-3.2/src/elfio-3.2 -isystem /mesos/build/3rdparty/glog-0.3.3/src/glog-0.3.3-lib/lib/include -isystem /mesos/build/3rdparty/nvml-352.79/src/nvml-352.79 -isystem /mesos/build/3rdparty/picojson-1.3.0/src/picojson-1.3.0 -isystem /usr/include/subversion-1 -isystem /mesos/3rdparty/stout/include -isystem /mesos/build/3rdparty/http_parser-2.6.2/src/http_parser-2.6.2 -isystem /mesos/build/3rdparty/libev-4.22/src/libev-4.22 -isystem /mesos/build/3rdparty/zookeeper-3.4.8/src/zookeeper-3.4.8/src/c/include -isystem /mesos/build/3rdparty/zookeeper-3.4.8/src/zookeeper-3.4.8/src/c/generated -isystem /mesos/build/3rdparty/leveldb-1.19/src/leveldb-1.19/include -I/mesos/include -isystem /mesos/build/3rdparty/gmock-1.7.0/src/gmock-1.7.0/include -isystem /mesos/build/3rdparty/gmock-1.7.0/src/gmock-1.7.0/gtest/include    -o CMakeFiles/mesos-tests.dir/hierarchical_allocator_tests.cpp.o -c /mesos/src/tests/hierarchical_allocator_tests.cpp
/usr/bin/cmake -E cmake_progress_report /mesos/build/CMakeFiles 
[ 85%] Building CXX object src/tests/CMakeFiles/mesos-tests.dir/hook_tests.cpp.o
cd /mesos/build/src/tests && /usr/bin/g++   -DBUILD_DIR=\"/mesos/build\" -DBUILD_FLAGS=\"\" -DBUILD_JAVA_JVM_LIBRARY=\"\" -DHAS_AUTHENTICATION=1 -DLIBDIR=\"/usr/local/libmesos\" -DPICOJSON_USE_INT64 -DPKGDATADIR=\"/usr/local/share/mesos\" -DPKGLIBEXECDIR=\"/usr/local/libexec/mesos\" -DPKGMODULEDIR=\"\" -DSBINDIR=\"\" -DSOURCE_DIR=\"/mesos\" -DTESTLIBEXECDIR=\"\" -DUSE_CMAKE_BUILD_CONFIG -DUSE_STATIC_LIB -DVERSION=\"1.4.0\" -D__STDC_FORMAT_MACROS -O2 -std=c++11 -g -fPIE -I/mesos/build/include -I/mesos/build/include/mesos -I/mesos/build/src -I/mesos/src -isystem /mesos/build/3rdparty/protobuf-2.6.1/src/protobuf-2.6.1-lib/lib/include -isystem /mesos/3rdparty/libprocess/include -isystem /usr/include/apr-1.0 -isystem /mesos/build/3rdparty/boost-1.53.0/src/boost-1.53.0 -isystem /mesos/build/3rdparty/elfio-3.2/src/elfio-3.2 -isystem /mesos/build/3rdparty/glog-0.3.3/src/glog-0.3.3-lib/lib/include -isystem /mesos/build/3rdparty/nvml-352.79/src/nvml-352.79 -isystem /mesos/build/3rdparty/picojson-1.3.0/src/picojson-1.3.0 -isystem /usr/include/subversion-1 -isystem /mesos/3rdparty/stout/include -isystem /mesos/build/3rdparty/http_parser-2.6.2/src/http_parser-2.6.2 -isystem /mesos/build/3rdparty/libev-4.22/src/libev-4.22 -isystem /mesos/build/3rdparty/zookeeper-3.4.8/src/zookeeper-3.4.8/src/c/include -isystem /mesos/build/3rdparty/zookeeper-3.4.8/src/zookeeper-3.4.8/src/c/generated -isystem /mesos/build/3rdparty/leveldb-1.19/src/leveldb-1.19/include -I/mesos/include -isystem /mesos/build/3rdparty/gmock-1.7.0/src/gmock-1.7.0/include -isystem /mesos/build/3rdparty/gmock-1.7.0/src/gmock-1.7.0/gtest/include    -o CMakeFiles/mesos-tests.dir/hook_tests.cpp.o -c /mesos/src/tests/hook_tests.cpp
/usr/bin/cmake -E cmake_progress_report /mesos/build/CMakeFiles 
[ 85%] Building CXX object src/tests/CMakeFiles/mesos-tests.dir/http_authentication_tests.cpp.o
cd /mesos/build/src/tests && /usr/bin/g++   -DBUILD_DIR=\"/mesos/build\" -DBUILD_FLAGS=\"\" -DBUILD_JAVA_JVM_LIBRARY=\"\" -DHAS_AUTHENTICATION=1 -DLIBDIR=\"/usr/local/libmesos\" -DPICOJSON_USE_INT64 -DPKGDATADIR=\"/usr/local/share/mesos\" -DPKGLIBEXECDIR=\"/usr/local/libexec/mesos\" -DPKGMODULEDIR=\"\" -DSBINDIR=\"\" -DSOURCE_DIR=\"/mesos\" -DTESTLIBEXECDIR=\"\" -DUSE_CMAKE_BUILD_CONFIG -DUSE_STATIC_LIB -DVERSION=\"1.4.0\" -D__STDC_FORMAT_MACROS -O2 -std=c++11 -g -fPIE -I/mesos/build/include -I/mesos/build/include/mesos -I/mesos/build/src -I/mesos/src -isystem /mesos/build/3rdparty/protobuf-2.6.1/src/protobuf-2.6.1-lib/lib/include -isystem /mesos/3rdparty/libprocess/include -isystem /usr/include/apr-1.0 -isystem /mesos/build/3rdparty/boost-1.53.0/src/boost-1.53.0 -isystem /mesos/build/3rdparty/elfio-3.2/src/elfio-3.2 -isystem /mesos/build/3rdparty/glog-0.3.3/src/glog-0.3.3-lib/lib/include -isystem /mesos/build/3rdparty/nvml-352.79/src/nvml-352.79 -isystem /mesos/build/3rdparty/picojson-1.3.0/src/picojson-1.3.0 -isystem /usr/include/subversion-1 -isystem /mesos/3rdparty/stout/include -isystem /mesos/build/3rdparty/http_parser-2.6.2/src/http_parser-2.6.2 -isystem /mesos/build/3rdparty/libev-4.22/src/libev-4.22 -isystem /mesos/build/3rdparty/zookeeper-3.4.8/src/zookeeper-3.4.8/src/c/include -isystem /mesos/build/3rdparty/zookeeper-3.4.8/src/zookeeper-3.4.8/src/c/generated -isystem /mesos/build/3rdparty/leveldb-1.19/src/leveldb-1.19/include -I/mesos/include -isystem /mesos/build/3rdparty/gmock-1.7.0/src/gmock-1.7.0/include -isystem /mesos/build/3rdparty/gmock-1.7.0/src/gmock-1.7.0/gtest/include    -o CMakeFiles/mesos-tests.dir/http_authentication_tests.cpp.o -c /mesos/src/tests/http_authentication_tests.cpp
/usr/bin/cmake -E cmake_progress_report /mesos/build/CMakeFiles 
[ 85%] Building CXX object src/tests/CMakeFiles/mesos-tests.dir/http_fault_tolerance_tests.cpp.o
cd /mesos/build/src/tests && /usr/bin/g++   -DBUILD_DIR=\"/mesos/build\" -DBUILD_FLAGS=\"\" -DBUILD_JAVA_JVM_LIBRARY=\"\" -DHAS_AUTHENTICATION=1 -DLIBDIR=\"/usr/local/libmesos\" -DPICOJSON_USE_INT64 -DPKGDATADIR=\"/usr/local/share/mesos\" -DPKGLIBEXECDIR=\"/usr/local/libexec/mesos\" -DPKGMODULEDIR=\"\" -DSBINDIR=\"\" -DSOURCE_DIR=\"/mesos\" -DTESTLIBEXECDIR=\"\" -DUSE_CMAKE_BUILD_CONFIG -DUSE_STATIC_LIB -DVERSION=\"1.4.0\" -D__STDC_FORMAT_MACROS -O2 -std=c++11 -g -fPIE -I/mesos/build/include -I/mesos/build/include/mesos -I/mesos/build/src -I/mesos/src -isystem /mesos/build/3rdparty/protobuf-2.6.1/src/protobuf-2.6.1-lib/lib/include -isystem /mesos/3rdparty/libprocess/include -isystem /usr/include/apr-1.0 -isystem /mesos/build/3rdparty/boost-1.53.0/src/boost-1.53.0 -isystem /mesos/build/3rdparty/elfio-3.2/src/elfio-3.2 -isystem /mesos/build/3rdparty/glog-0.3.3/src/glog-0.3.3-lib/lib/include -isystem /mesos/build/3rdparty/nvml-352.79/src/nvml-352.79 -isystem /mesos/build/3rdparty/picojson-1.3.0/src/picojson-1.3.0 -isystem /usr/include/subversion-1 -isystem /mesos/3rdparty/stout/include -isystem /mesos/build/3rdparty/http_parser-2.6.2/src/http_parser-2.6.2 -isystem /mesos/build/3rdparty/libev-4.22/src/libev-4.22 -isystem /mesos/build/3rdparty/zookeeper-3.4.8/src/zookeeper-3.4.8/src/c/include -isystem /mesos/build/3rdparty/zookeeper-3.4.8/src/zookeeper-3.4.8/src/c/generated -isystem /mesos/build/3rdparty/leveldb-1.19/src/leveldb-1.19/include -I/mesos/include -isystem /mesos/build/3rdparty/gmock-1.7.0/src/gmock-1.7.0/include -isystem /mesos/build/3rdparty/gmock-1.7.0/src/gmock-1.7.0/gtest/include    -o CMakeFiles/mesos-tests.dir/http_fault_tolerance_tests.cpp.o -c /mesos/src/tests/http_fault_tolerance_tests.cpp
/usr/bin/cmake -E cmake_progress_report /mesos/build/CMakeFiles 
[ 85%] Building CXX object src/tests/CMakeFiles/mesos-tests.dir/master_maintenance_tests.cpp.o
cd /mesos/build/src/tests && /usr/bin/g++   -DBUILD_DIR=\"/mesos/build\" -DBUILD_FLAGS=\"\" -DBUILD_JAVA_JVM_LIBRARY=\"\" -DHAS_AUTHENTICATION=1 -DLIBDIR=\"/usr/local/libmesos\" -DPICOJSON_USE_INT64 -DPKGDATADIR=\"/usr/local/share/mesos\" -DPKGLIBEXECDIR=\"/usr/local/libexec/mesos\" -DPKGMODULEDIR=\"\" -DSBINDIR=\"\" -DSOURCE_DIR=\"/mesos\" -DTESTLIBEXECDIR=\"\" -DUSE_CMAKE_BUILD_CONFIG -DUSE_STATIC_LIB -DVERSION=\"1.4.0\" -D__STDC_FORMAT_MACROS -O2 -std=c++11 -g -fPIE -I/mesos/build/include -I/mesos/build/include/mesos -I/mesos/build/src -I/mesos/src -isystem /mesos/build/3rdparty/protobuf-2.6.1/src/protobuf-2.6.1-lib/lib/include -isystem /mesos/3rdparty/libprocess/include -isystem /usr/include/apr-1.0 -isystem /mesos/build/3rdparty/boost-1.53.0/src/boost-1.53.0 -isystem /mesos/build/3rdparty/elfio-3.2/src/elfio-3.2 -isystem /mesos/build/3rdparty/glog-0.3.3/src/glog-0.3.3-lib/lib/include -isystem /mesos/build/3rdparty/nvml-352.79/src/nvml-352.79 -isystem /mesos/build/3rdparty/picojson-1.3.0/src/picojson-1.3.0 -isystem /usr/include/subversion-1 -isystem /mesos/3rdparty/stout/include -isystem /mesos/build/3rdparty/http_parser-2.6.2/src/http_parser-2.6.2 -isystem /mesos/build/3rdparty/libev-4.22/src/libev-4.22 -isystem /mesos/build/3rdparty/zookeeper-3.4.8/src/zookeeper-3.4.8/src/c/include -isystem /mesos/build/3rdparty/zookeeper-3.4.8/src/zookeeper-3.4.8/src/c/generated -isystem /mesos/build/3rdparty/leveldb-1.19/src/leveldb-1.19/include -I/mesos/include -isystem /mesos/build/3rdparty/gmock-1.7.0/src/gmock-1.7.0/include -isystem /mesos/build/3rdparty/gmock-1.7.0/src/gmock-1.7.0/gtest/include    -o CMakeFiles/mesos-tests.dir/master_maintenance_tests.cpp.o -c /mesos/src/tests/master_maintenance_tests.cpp
/usr/bin/cmake -E cmake_progress_report /mesos/build/CMakeFiles 65
[ 86%] Building CXX object src/tests/CMakeFiles/mesos-tests.dir/master_slave_reconciliation_tests.cpp.o
cd /mesos/build/src/tests && /usr/bin/g++   -DBUILD_DIR=\"/mesos/build\" -DBUILD_FLAGS=\"\" -DBUILD_JAVA_JVM_LIBRARY=\"\" -DHAS_AUTHENTICATION=1 -DLIBDIR=\"/usr/local/libmesos\" -DPICOJSON_USE_INT64 -DPKGDATADIR=\"/usr/local/share/mesos\" -DPKGLIBEXECDIR=\"/usr/local/libexec/mesos\" -DPKGMODULEDIR=\"\" -DSBINDIR=\"\" -DSOURCE_DIR=\"/mesos\" -DTESTLIBEXECDIR=\"\" -DUSE_CMAKE_BUILD_CONFIG -DUSE_STATIC_LIB -DVERSION=\"1.4.0\" -D__STDC_FORMAT_MACROS -O2 -std=c++11 -g -fPIE -I/mesos/build/include -I/mesos/build/include/mesos -I/mesos/build/src -I/mesos/src -isystem /mesos/build/3rdparty/protobuf-2.6.1/src/protobuf-2.6.1-lib/lib/include -isystem /mesos/3rdparty/libprocess/include -isystem /usr/include/apr-1.0 -isystem /mesos/build/3rdparty/boost-1.53.0/src/boost-1.53.0 -isystem /mesos/build/3rdparty/elfio-3.2/src/elfio-3.2 -isystem /mesos/build/3rdparty/glog-0.3.3/src/glog-0.3.3-lib/lib/include -isystem /mesos/build/3rdparty/nvml-352.79/src/nvml-352.79 -isystem /mesos/build/3rdparty/picojson-1.3.0/src/picojson-1.3.0 -isystem /usr/include/subversion-1 -isystem /mesos/3rdparty/stout/include -isystem /mesos/build/3rdparty/http_parser-2.6.2/src/http_parser-2.6.2 -isystem /mesos/build/3rdparty/libev-4.22/src/libev-4.22 -isystem /mesos/build/3rdparty/zookeeper-3.4.8/src/zookeeper-3.4.8/src/c/include -isystem /mesos/build/3rdparty/zookeeper-3.4.8/src/zookeeper-3.4.8/src/c/generated -isystem /mesos/build/3rdparty/leveldb-1.19/src/leveldb-1.19/include -I/mesos/include -isystem /mesos/build/3rdparty/gmock-1.7.0/src/gmock-1.7.0/include -isystem /mesos/build/3rdparty/gmock-1.7.0/src/gmock-1.7.0/gtest/include    -o CMakeFiles/mesos-tests.dir/master_slave_reconciliation_tests.cpp.o -c /mesos/src/tests/master_slave_reconciliation_tests.cpp
/usr/bin/cmake -E cmake_progress_report /mesos/build/CMakeFiles 
[ 86%] Building CXX object src/tests/CMakeFiles/mesos-tests.dir/partition_tests.cpp.o
cd /mesos/build/src/tests && /usr/bin/g++   -DBUILD_DIR=\"/mesos/build\" -DBUILD_FLAGS=\"\" -DBUILD_JAVA_JVM_LIBRARY=\"\" -DHAS_AUTHENTICATION=1 -DLIBDIR=\"/usr/local/libmesos\" -DPICOJSON_USE_INT64 -DPKGDATADIR=\"/usr/local/share/mesos\" -DPKGLIBEXECDIR=\"/usr/local/libexec/mesos\" -DPKGMODULEDIR=\"\" -DSBINDIR=\"\" -DSOURCE_DIR=\"/mesos\" -DTESTLIBEXECDIR=\"\" -DUSE_CMAKE_BUILD_CONFIG -DUSE_STATIC_LIB -DVERSION=\"1.4.0\" -D__STDC_FORMAT_MACROS -O2 -std=c++11 -g -fPIE -I/mesos/build/include -I/mesos/build/include/mesos -I/mesos/build/src -I/mesos/src -isystem /mesos/build/3rdparty/protobuf-2.6.1/src/protobuf-2.6.1-lib/lib/include -isystem /mesos/3rdparty/libprocess/include -isystem /usr/include/apr-1.0 -isystem /mesos/build/3rdparty/boost-1.53.0/src/boost-1.53.0 -isystem /mesos/build/3rdparty/elfio-3.2/src/elfio-3.2 -isystem /mesos/build/3rdparty/glog-0.3.3/src/glog-0.3.3-lib/lib/include -isystem /mesos/build/3rdparty/nvml-352.79/src/nvml-352.79 -isystem /mesos/build/3rdparty/picojson-1.3.0/src/picojson-1.3.0 -isystem /usr/include/subversion-1 -isystem /mesos/3rdparty/stout/include -isystem /mesos/build/3rdparty/http_parser-2.6.2/src/http_parser-2.6.2 -isystem /mesos/build/3rdparty/libev-4.22/src/libev-4.22 -isystem /mesos/build/3rdparty/zookeeper-3.4.8/src/zookeeper-3.4.8/src/c/include -isystem /mesos/build/3rdparty/zookeeper-3.4.8/src/zookeeper-3.4.8/src/c/generated -isystem /mesos/build/3rdparty/leveldb-1.19/src/leveldb-1.19/include -I/mesos/include -isystem /mesos/build/3rdparty/gmock-1.7.0/src/gmock-1.7.0/include -isystem /mesos/build/3rdparty/gmock-1.7.0/src/gmock-1.7.0/gtest/include    -o CMakeFiles/mesos-tests.dir/partition_tests.cpp.o -c /mesos/src/tests/partition_tests.cpp
/usr/bin/cmake -E cmake_progress_report /mesos/build/CMakeFiles 
[ 86%] Building CXX object src/tests/CMakeFiles/mesos-tests.dir/paths_tests.cpp.o
cd /mesos/build/src/tests && /usr/bin/g++   -DBUILD_DIR=\"/mesos/build\" -DBUILD_FLAGS=\"\" -DBUILD_JAVA_JVM_LIBRARY=\"\" -DHAS_AUTHENTICATION=1 -DLIBDIR=\"/usr/local/libmesos\" -DPICOJSON_USE_INT64 -DPKGDATADIR=\"/usr/local/share/mesos\" -DPKGLIBEXECDIR=\"/usr/local/libexec/mesos\" -DPKGMODULEDIR=\"\" -DSBINDIR=\"\" -DSOURCE_DIR=\"/mesos\" -DTESTLIBEXECDIR=\"\" -DUSE_CMAKE_BUILD_CONFIG -DUSE_STATIC_LIB -DVERSION=\"1.4.0\" -D__STDC_FORMAT_MACROS -O2 -std=c++11 -g -fPIE -I/mesos/build/include -I/mesos/build/include/mesos -I/mesos/build/src -I/mesos/src -isystem /mesos/build/3rdparty/protobuf-2.6.1/src/protobuf-2.6.1-lib/lib/include -isystem /mesos/3rdparty/libprocess/include -isystem /usr/include/apr-1.0 -isystem /mesos/build/3rdparty/boost-1.53.0/src/boost-1.53.0 -isystem /mesos/build/3rdparty/elfio-3.2/src/elfio-3.2 -isystem /mesos/build/3rdparty/glog-0.3.3/src/glog-0.3.3-lib/lib/include -isystem /mesos/build/3rdparty/nvml-352.79/src/nvml-352.79 -isystem /mesos/build/3rdparty/picojson-1.3.0/src/picojson-1.3.0 -isystem /usr/include/subversion-1 -isystem /mesos/3rdparty/stout/include -isystem /mesos/build/3rdparty/http_parser-2.6.2/src/http_parser-2.6.2 -isystem /mesos/build/3rdparty/libev-4.22/src/libev-4.22 -isystem /mesos/build/3rdparty/zookeeper-3.4.8/src/zookeeper-3.4.8/src/c/include -isystem /mesos/build/3rdparty/zookeeper-3.4.8/src/zookeeper-3.4.8/src/c/generated -isystem /mesos/build/3rdparty/leveldb-1.19/src/leveldb-1.19/include -I/mesos/include -isystem /mesos/build/3rdparty/gmock-1.7.0/src/gmock-1.7.0/include -isystem /mesos/build/3rdparty/gmock-1.7.0/src/gmock-1.7.0/gtest/include    -o CMakeFiles/mesos-tests.dir/paths_tests.cpp.o -c /mesos/src/tests/paths_tests.cpp
/usr/bin/cmake -E cmake_progress_report /mesos/build/CMakeFiles 
[ 86%] Building CXX object src/tests/CMakeFiles/mesos-tests.dir/protobuf_io_tests.cpp.o
cd /mesos/build/src/tests && /usr/bin/g++   -DBUILD_DIR=\"/mesos/build\" -DBUILD_FLAGS=\"\" -DBUILD_JAVA_JVM_LIBRARY=\"\" -DHAS_AUTHENTICATION=1 -DLIBDIR=\"/usr/local/libmesos\" -DPICOJSON_USE_INT64 -DPKGDATADIR=\"/usr/local/share/mesos\" -DPKGLIBEXECDIR=\"/usr/local/libexec/mesos\" -DPKGMODULEDIR=\"\" -DSBINDIR=\"\" -DSOURCE_DIR=\"/mesos\" -DTESTLIBEXECDIR=\"\" -DUSE_CMAKE_BUILD_CONFIG -DUSE_STATIC_LIB -DVERSION=\"1.4.0\" -D__STDC_FORMAT_MACROS -O2 -std=c++11 -g -fPIE -I/mesos/build/include -I/mesos/build/include/mesos -I/mesos/build/src -I/mesos/src -isystem /mesos/build/3rdparty/protobuf-2.6.1/src/protobuf-2.6.1-lib/lib/include -isystem /mesos/3rdparty/libprocess/include -isystem /usr/include/apr-1.0 -isystem /mesos/build/3rdparty/boost-1.53.0/src/boost-1.53.0 -isystem /mesos/build/3rdparty/elfio-3.2/src/elfio-3.2 -isystem /mesos/build/3rdparty/glog-0.3.3/src/glog-0.3.3-lib/lib/include -isystem /mesos/build/3rdparty/nvml-352.79/src/nvml-352.79 -isystem /mesos/build/3rdparty/picojson-1.3.0/src/picojson-1.3.0 -isystem /usr/include/subversion-1 -isystem /mesos/3rdparty/stout/include -isystem /mesos/build/3rdparty/http_parser-2.6.2/src/http_parser-2.6.2 -isystem /mesos/build/3rdparty/libev-4.22/src/libev-4.22 -isystem /mesos/build/3rdparty/zookeeper-3.4.8/src/zookeeper-3.4.8/src/c/include -isystem /mesos/build/3rdparty/zookeeper-3.4.8/src/zookeeper-3.4.8/src/c/generated -isystem /mesos/build/3rdparty/leveldb-1.19/src/leveldb-1.19/include -I/mesos/include -isystem /mesos/build/3rdparty/gmock-1.7.0/src/gmock-1.7.0/include -isystem /mesos/build/3rdparty/gmock-1.7.0/src/gmock-1.7.0/gtest/include    -o CMakeFiles/mesos-tests.dir/protobuf_io_tests.cpp.o -c /mesos/src/tests/protobuf_io_tests.cpp
/usr/bin/cmake -E cmake_progress_report /mesos/build/CMakeFiles 
[ 86%] Building CXX object src/tests/CMakeFiles/mesos-tests.dir/rate_limiting_tests.cpp.o
cd /mesos/build/src/tests && /usr/bin/g++   -DBUILD_DIR=\"/mesos/build\" -DBUILD_FLAGS=\"\" -DBUILD_JAVA_JVM_LIBRARY=\"\" -DHAS_AUTHENTICATION=1 -DLIBDIR=\"/usr/local/libmesos\" -DPICOJSON_USE_INT64 -DPKGDATADIR=\"/usr/local/share/mesos\" -DPKGLIBEXECDIR=\"/usr/local/libexec/mesos\" -DPKGMODULEDIR=\"\" -DSBINDIR=\"\" -DSOURCE_DIR=\"/mesos\" -DTESTLIBEXECDIR=\"\" -DUSE_CMAKE_BUILD_CONFIG -DUSE_STATIC_LIB -DVERSION=\"1.4.0\" -D__STDC_FORMAT_MACROS -O2 -std=c++11 -g -fPIE -I/mesos/build/include -I/mesos/build/include/mesos -I/mesos/build/src -I/mesos/src -isystem /mesos/build/3rdparty/protobuf-2.6.1/src/protobuf-2.6.1-lib/lib/include -isystem /mesos/3rdparty/libprocess/include -isystem /usr/include/apr-1.0 -isystem /mesos/build/3rdparty/boost-1.53.0/src/boost-1.53.0 -isystem /mesos/build/3rdparty/elfio-3.2/src/elfio-3.2 -isystem /mesos/build/3rdparty/glog-0.3.3/src/glog-0.3.3-lib/lib/include -isystem /mesos/build/3rdparty/nvml-352.79/src/nvml-352.79 -isystem /mesos/build/3rdparty/picojson-1.3.0/src/picojson-1.3.0 -isystem /usr/include/subversion-1 -isystem /mesos/3rdparty/stout/include -isystem /mesos/build/3rdparty/http_parser-2.6.2/src/http_parser-2.6.2 -isystem /mesos/build/3rdparty/libev-4.22/src/libev-4.22 -isystem /mesos/build/3rdparty/zookeeper-3.4.8/src/zookeeper-3.4.8/src/c/include -isystem /mesos/build/3rdparty/zookeeper-3.4.8/src/zookeeper-3.4.8/src/c/generated -isystem /mesos/build/3rdparty/leveldb-1.19/src/leveldb-1.19/include -I/mesos/include -isystem /mesos/build/3rdparty/gmock-1.7.0/src/gmock-1.7.0/include -isystem /mesos/build/3rdparty/gmock-1.7.0/src/gmock-1.7.0/gtest/include    -o CMakeFiles/mesos-tests.dir/rate_limiting_tests.cpp.o -c /mesos/src/tests/rate_limiting_tests.cpp
/usr/bin/cmake -E cmake_progress_report /mesos/build/CMakeFiles 
[ 86%] Building CXX object src/tests/CMakeFiles/mesos-tests.dir/resource_offers_tests.cpp.o
cd /mesos/build/src/tests && /usr/bin/g++   -DBUILD_DIR=\"/mesos/build\" -DBUILD_FLAGS=\"\" -DBUILD_JAVA_JVM_LIBRARY=\"\" -DHAS_AUTHENTICATION=1 -DLIBDIR=\"/usr/local/libmesos\" -DPICOJSON_USE_INT64 -DPKGDATADIR=\"/usr/local/share/mesos\" -DPKGLIBEXECDIR=\"/usr/local/libexec/mesos\" -DPKGMODULEDIR=\"\" -DSBINDIR=\"\" -DSOURCE_DIR=\"/mesos\" -DTESTLIBEXECDIR=\"\" -DUSE_CMAKE_BUILD_CONFIG -DUSE_STATIC_LIB -DVERSION=\"1.4.0\" -D__STDC_FORMAT_MACROS -O2 -std=c++11 -g -fPIE -I/mesos/build/include -I/mesos/build/include/mesos -I/mesos/build/src -I/mesos/src -isystem /mesos/build/3rdparty/protobuf-2.6.1/src/protobuf-2.6.1-lib/lib/include -isystem /mesos/3rdparty/libprocess/include -isystem /usr/include/apr-1.0 -isystem /mesos/build/3rdparty/boost-1.53.0/src/boost-1.53.0 -isystem /mesos/build/3rdparty/elfio-3.2/src/elfio-3.2 -isystem /mesos/build/3rdparty/glog-0.3.3/src/glog-0.3.3-lib/lib/include -isystem /mesos/build/3rdparty/nvml-352.79/src/nvml-352.79 -isystem /mesos/build/3rdparty/picojson-1.3.0/src/picojson-1.3.0 -isystem /usr/include/subversion-1 -isystem /mesos/3rdparty/stout/include -isystem /mesos/build/3rdparty/http_parser-2.6.2/src/http_parser-2.6.2 -isystem /mesos/build/3rdparty/libev-4.22/src/libev-4.22 -isystem /mesos/build/3rdparty/zookeeper-3.4.8/src/zookeeper-3.4.8/src/c/include -isystem /mesos/build/3rdparty/zookeeper-3.4.8/src/zookeeper-3.4.8/src/c/generated -isystem /mesos/build/3rdparty/leveldb-1.19/src/leveldb-1.19/include -I/mesos/include -isystem /mesos/build/3rdparty/gmock-1.7.0/src/gmock-1.7.0/include -isystem /mesos/build/3rdparty/gmock-1.7.0/src/gmock-1.7.0/gtest/include    -o CMakeFiles/mesos-tests.dir/resource_offers_tests.cpp.o -c /mesos/src/tests/resource_offers_tests.cpp
/usr/bin/cmake -E cmake_progress_report /mesos/build/CMakeFiles 66
[ 87%] Building CXX object src/tests/CMakeFiles/mesos-tests.dir/resources_tests.cpp.o
cd /mesos/build/src/tests && /usr/bin/g++   -DBUILD_DIR=\"/mesos/build\" -DBUILD_FLAGS=\"\" -DBUILD_JAVA_JVM_LIBRARY=\"\" -DHAS_AUTHENTICATION=1 -DLIBDIR=\"/usr/local/libmesos\" -DPICOJSON_USE_INT64 -DPKGDATADIR=\"/usr/local/share/mesos\" -DPKGLIBEXECDIR=\"/usr/local/libexec/mesos\" -DPKGMODULEDIR=\"\" -DSBINDIR=\"\" -DSOURCE_DIR=\"/mesos\" -DTESTLIBEXECDIR=\"\" -DUSE_CMAKE_BUILD_CONFIG -DUSE_STATIC_LIB -DVERSION=\"1.4.0\" -D__STDC_FORMAT_MACROS -O2 -std=c++11 -g -fPIE -I/mesos/build/include -I/mesos/build/include/mesos -I/mesos/build/src -I/mesos/src -isystem /mesos/build/3rdparty/protobuf-2.6.1/src/protobuf-2.6.1-lib/lib/include -isystem /mesos/3rdparty/libprocess/include -isystem /usr/include/apr-1.0 -isystem /mesos/build/3rdparty/boost-1.53.0/src/boost-1.53.0 -isystem /mesos/build/3rdparty/elfio-3.2/src/elfio-3.2 -isystem /mesos/build/3rdparty/glog-0.3.3/src/glog-0.3.3-lib/lib/include -isystem /mesos/build/3rdparty/nvml-352.79/src/nvml-352.79 -isystem /mesos/build/3rdparty/picojson-1.3.0/src/picojson-1.3.0 -isystem /usr/include/subversion-1 -isystem /mesos/3rdparty/stout/include -isystem /mesos/build/3rdparty/http_parser-2.6.2/src/http_parser-2.6.2 -isystem /mesos/build/3rdparty/libev-4.22/src/libev-4.22 -isystem /mesos/build/3rdparty/zookeeper-3.4.8/src/zookeeper-3.4.8/src/c/include -isystem /mesos/build/3rdparty/zookeeper-3.4.8/src/zookeeper-3.4.8/src/c/generated -isystem /mesos/build/3rdparty/leveldb-1.19/src/leveldb-1.19/include -I/mesos/include -isystem /mesos/build/3rdparty/gmock-1.7.0/src/gmock-1.7.0/include -isystem /mesos/build/3rdparty/gmock-1.7.0/src/gmock-1.7.0/gtest/include    -o CMakeFiles/mesos-tests.dir/resources_tests.cpp.o -c /mesos/src/tests/resources_tests.cpp
/usr/bin/cmake -E cmake_progress_report /mesos/build/CMakeFiles 
[ 87%] Building CXX object src/tests/CMakeFiles/mesos-tests.dir/role_tests.cpp.o
cd /mesos/build/src/tests && /usr/bin/g++   -DBUILD_DIR=\"/mesos/build\" -DBUILD_FLAGS=\"\" -DBUILD_JAVA_JVM_LIBRARY=\"\" -DHAS_AUTHENTICATION=1 -DLIBDIR=\"/usr/local/libmesos\" -DPICOJSON_USE_INT64 -DPKGDATADIR=\"/usr/local/share/mesos\" -DPKGLIBEXECDIR=\"/usr/local/libexec/mesos\" -DPKGMODULEDIR=\"\" -DSBINDIR=\"\" -DSOURCE_DIR=\"/mesos\" -DTESTLIBEXECDIR=\"\" -DUSE_CMAKE_BUILD_CONFIG -DUSE_STATIC_LIB -DVERSION=\"1.4.0\" -D__STDC_FORMAT_MACROS -O2 -std=c++11 -g -fPIE -I/mesos/build/include -I/mesos/build/include/mesos -I/mesos/build/src -I/mesos/src -isystem /mesos/build/3rdparty/protobuf-2.6.1/src/protobuf-2.6.1-lib/lib/include -isystem /mesos/3rdparty/libprocess/include -isystem /usr/include/apr-1.0 -isystem /mesos/build/3rdparty/boost-1.53.0/src/boost-1.53.0 -isystem /mesos/build/3rdparty/elfio-3.2/src/elfio-3.2 -isystem /mesos/build/3rdparty/glog-0.3.3/src/glog-0.3.3-lib/lib/include -isystem /mesos/build/3rdparty/nvml-352.79/src/nvml-352.79 -isystem /mesos/build/3rdparty/picojson-1.3.0/src/picojson-1.3.0 -isystem /usr/include/subversion-1 -isystem /mesos/3rdparty/stout/include -isystem /mesos/build/3rdparty/http_parser-2.6.2/src/http_parser-2.6.2 -isystem /mesos/build/3rdparty/libev-4.22/src/libev-4.22 -isystem /mesos/build/3rdparty/zookeeper-3.4.8/src/zookeeper-3.4.8/src/c/include -isystem /mesos/build/3rdparty/zookeeper-3.4.8/src/zookeeper-3.4.8/src/c/generated -isystem /mesos/build/3rdparty/leveldb-1.19/src/leveldb-1.19/include -I/mesos/include -isystem /mesos/build/3rdparty/gmock-1.7.0/src/gmock-1.7.0/include -isystem /mesos/build/3rdparty/gmock-1.7.0/src/gmock-1.7.0/gtest/include    -o CMakeFiles/mesos-tests.dir/role_tests.cpp.o -c /mesos/src/tests/role_tests.cpp
/usr/bin/cmake -E cmake_progress_report /mesos/build/CMakeFiles 
[ 87%] Building CXX object src/tests/CMakeFiles/mesos-tests.dir/scheduler_driver_tests.cpp.o
cd /mesos/build/src/tests && /usr/bin/g++   -DBUILD_DIR=\"/mesos/build\" -DBUILD_FLAGS=\"\" -DBUILD_JAVA_JVM_LIBRARY=\"\" -DHAS_AUTHENTICATION=1 -DLIBDIR=\"/usr/local/libmesos\" -DPICOJSON_USE_INT64 -DPKGDATADIR=\"/usr/local/share/mesos\" -DPKGLIBEXECDIR=\"/usr/local/libexec/mesos\" -DPKGMODULEDIR=\"\" -DSBINDIR=\"\" -DSOURCE_DIR=\"/mesos\" -DTESTLIBEXECDIR=\"\" -DUSE_CMAKE_BUILD_CONFIG -DUSE_STATIC_LIB -DVERSION=\"1.4.0\" -D__STDC_FORMAT_MACROS -O2 -std=c++11 -g -fPIE -I/mesos/build/include -I/mesos/build/include/mesos -I/mesos/build/src -I/mesos/src -isystem /mesos/build/3rdparty/protobuf-2.6.1/src/protobuf-2.6.1-lib/lib/include -isystem /mesos/3rdparty/libprocess/include -isystem /usr/include/apr-1.0 -isystem /mesos/build/3rdparty/boost-1.53.0/src/boost-1.53.0 -isystem /mesos/build/3rdparty/elfio-3.2/src/elfio-3.2 -isystem /mesos/build/3rdparty/glog-0.3.3/src/glog-0.3.3-lib/lib/include -isystem /mesos/build/3rdparty/nvml-352.79/src/nvml-352.79 -isystem /mesos/build/3rdparty/picojson-1.3.0/src/picojson-1.3.0 -isystem /usr/include/subversion-1 -isystem /mesos/3rdparty/stout/include -isystem /mesos/build/3rdparty/http_parser-2.6.2/src/http_parser-2.6.2 -isystem /mesos/build/3rdparty/libev-4.22/src/libev-4.22 -isystem /mesos/build/3rdparty/zookeeper-3.4.8/src/zookeeper-3.4.8/src/c/include -isystem /mesos/build/3rdparty/zookeeper-3.4.8/src/zookeeper-3.4.8/src/c/generated -isystem /mesos/build/3rdparty/leveldb-1.19/src/leveldb-1.19/include -I/mesos/include -isystem /mesos/build/3rdparty/gmock-1.7.0/src/gmock-1.7.0/include -isystem /mesos/build/3rdparty/gmock-1.7.0/src/gmock-1.7.0/gtest/include    -o CMakeFiles/mesos-tests.dir/scheduler_driver_tests.cpp.o -c /mesos/src/tests/scheduler_driver_tests.cpp
/usr/bin/cmake -E cmake_progress_report /mesos/build/CMakeFiles 
[ 87%] Building CXX object src/tests/CMakeFiles/mesos-tests.dir/scheduler_event_call_tests.cpp.o
cd /mesos/build/src/tests && /usr/bin/g++   -DBUILD_DIR=\"/mesos/build\" -DBUILD_FLAGS=\"\" -DBUILD_JAVA_JVM_LIBRARY=\"\" -DHAS_AUTHENTICATION=1 -DLIBDIR=\"/usr/local/libmesos\" -DPICOJSON_USE_INT64 -DPKGDATADIR=\"/usr/local/share/mesos\" -DPKGLIBEXECDIR=\"/usr/local/libexec/mesos\" -DPKGMODULEDIR=\"\" -DSBINDIR=\"\" -DSOURCE_DIR=\"/mesos\" -DTESTLIBEXECDIR=\"\" -DUSE_CMAKE_BUILD_CONFIG -DUSE_STATIC_LIB -DVERSION=\"1.4.0\" -D__STDC_FORMAT_MACROS -O2 -std=c++11 -g -fPIE -I/mesos/build/include -I/mesos/build/include/mesos -I/mesos/build/src -I/mesos/src -isystem /mesos/build/3rdparty/protobuf-2.6.1/src/protobuf-2.6.1-lib/lib/include -isystem /mesos/3rdparty/libprocess/include -isystem /usr/include/apr-1.0 -isystem /mesos/build/3rdparty/boost-1.53.0/src/boost-1.53.0 -isystem /mesos/build/3rdparty/elfio-3.2/src/elfio-3.2 -isystem /mesos/build/3rdparty/glog-0.3.3/src/glog-0.3.3-lib/lib/include -isystem /mesos/build/3rdparty/nvml-352.79/src/nvml-352.79 -isystem /mesos/build/3rdparty/picojson-1.3.0/src/picojson-1.3.0 -isystem /usr/include/subversion-1 -isystem /mesos/3rdparty/stout/include -isystem /mesos/build/3rdparty/http_parser-2.6.2/src/http_parser-2.6.2 -isystem /mesos/build/3rdparty/libev-4.22/src/libev-4.22 -isystem /mesos/build/3rdparty/zookeeper-3.4.8/src/zookeeper-3.4.8/src/c/include -isystem /mesos/build/3rdparty/zookeeper-3.4.8/src/zookeeper-3.4.8/src/c/generated -isystem /mesos/build/3rdparty/leveldb-1.19/src/leveldb-1.19/include -I/mesos/include -isystem /mesos/build/3rdparty/gmock-1.7.0/src/gmock-1.7.0/include -isystem /mesos/build/3rdparty/gmock-1.7.0/src/gmock-1.7.0/gtest/include    -o CMakeFiles/mesos-tests.dir/scheduler_event_call_tests.cpp.o -c /mesos/src/tests/scheduler_event_call_tests.cpp
/usr/bin/cmake -E cmake_progress_report /mesos/build/CMakeFiles 
[ 87%] Building CXX object src/tests/CMakeFiles/mesos-tests.dir/scheduler_http_api_tests.cpp.o
cd /mesos/build/src/tests && /usr/bin/g++   -DBUILD_DIR=\"/mesos/build\" -DBUILD_FLAGS=\"\" -DBUILD_JAVA_JVM_LIBRARY=\"\" -DHAS_AUTHENTICATION=1 -DLIBDIR=\"/usr/local/libmesos\" -DPICOJSON_USE_INT64 -DPKGDATADIR=\"/usr/local/share/mesos\" -DPKGLIBEXECDIR=\"/usr/local/libexec/mesos\" -DPKGMODULEDIR=\"\" -DSBINDIR=\"\" -DSOURCE_DIR=\"/mesos\" -DTESTLIBEXECDIR=\"\" -DUSE_CMAKE_BUILD_CONFIG -DUSE_STATIC_LIB -DVERSION=\"1.4.0\" -D__STDC_FORMAT_MACROS -O2 -std=c++11 -g -fPIE -I/mesos/build/include -I/mesos/build/include/mesos -I/mesos/build/src -I/mesos/src -isystem /mesos/build/3rdparty/protobuf-2.6.1/src/protobuf-2.6.1-lib/lib/include -isystem /mesos/3rdparty/libprocess/include -isystem /usr/include/apr-1.0 -isystem /mesos/build/3rdparty/boost-1.53.0/src/boost-1.53.0 -isystem /mesos/build/3rdparty/elfio-3.2/src/elfio-3.2 -isystem /mesos/build/3rdparty/glog-0.3.3/src/glog-0.3.3-lib/lib/include -isystem /mesos/build/3rdparty/nvml-352.79/src/nvml-352.79 -isystem /mesos/build/3rdparty/picojson-1.3.0/src/picojson-1.3.0 -isystem /usr/include/subversion-1 -isystem /mesos/3rdparty/stout/include -isystem /mesos/build/3rdparty/http_parser-2.6.2/src/http_parser-2.6.2 -isystem /mesos/build/3rdparty/libev-4.22/src/libev-4.22 -isystem /mesos/build/3rdparty/zookeeper-3.4.8/src/zookeeper-3.4.8/src/c/include -isystem /mesos/build/3rdparty/zookeeper-3.4.8/src/zookeeper-3.4.8/src/c/generated -isystem /mesos/build/3rdparty/leveldb-1.19/src/leveldb-1.19/include -I/mesos/include -isystem /mesos/build/3rdparty/gmock-1.7.0/src/gmock-1.7.0/include -isystem /mesos/build/3rdparty/gmock-1.7.0/src/gmock-1.7.0/gtest/include    -o CMakeFiles/mesos-tests.dir/scheduler_http_api_tests.cpp.o -c /mesos/src/tests/scheduler_http_api_tests.cpp
/usr/bin/cmake -E cmake_progress_report /mesos/build/CMakeFiles 
[ 87%] Building CXX object src/tests/CMakeFiles/mesos-tests.dir/scheduler_tests.cpp.o
cd /mesos/build/src/tests && /usr/bin/g++   -DBUILD_DIR=\"/mesos/build\" -DBUILD_FLAGS=\"\" -DBUILD_JAVA_JVM_LIBRARY=\"\" -DHAS_AUTHENTICATION=1 -DLIBDIR=\"/usr/local/libmesos\" -DPICOJSON_USE_INT64 -DPKGDATADIR=\"/usr/local/share/mesos\" -DPKGLIBEXECDIR=\"/usr/local/libexec/mesos\" -DPKGMODULEDIR=\"\" -DSBINDIR=\"\" -DSOURCE_DIR=\"/mesos\" -DTESTLIBEXECDIR=\"\" -DUSE_CMAKE_BUILD_CONFIG -DUSE_STATIC_LIB -DVERSION=\"1.4.0\" -D__STDC_FORMAT_MACROS -O2 -std=c++11 -g -fPIE -I/mesos/build/include -I/mesos/build/include/mesos -I/mesos/build/src -I/mesos/src -isystem /mesos/build/3rdparty/protobuf-2.6.1/src/protobuf-2.6.1-lib/lib/include -isystem /mesos/3rdparty/libprocess/include -isystem /usr/include/apr-1.0 -isystem /mesos/build/3rdparty/boost-1.53.0/src/boost-1.53.0 -isystem /mesos/build/3rdparty/elfio-3.2/src/elfio-3.2 -isystem /mesos/build/3rdparty/glog-0.3.3/src/glog-0.3.3-lib/lib/include -isystem /mesos/build/3rdparty/nvml-352.79/src/nvml-352.79 -isystem /mesos/build/3rdparty/picojson-1.3.0/src/picojson-1.3.0 -isystem /usr/include/subversion-1 -isystem /mesos/3rdparty/stout/include -isystem /mesos/build/3rdparty/http_parser-2.6.2/src/http_parser-2.6.2 -isystem /mesos/build/3rdparty/libev-4.22/src/libev-4.22 -isystem /mesos/build/3rdparty/zookeeper-3.4.8/src/zookeeper-3.4.8/src/c/include -isystem /mesos/build/3rdparty/zookeeper-3.4.8/src/zookeeper-3.4.8/src/c/generated -isystem /mesos/build/3rdparty/leveldb-1.19/src/leveldb-1.19/include -I/mesos/include -isystem /mesos/build/3rdparty/gmock-1.7.0/src/gmock-1.7.0/include -isystem /mesos/build/3rdparty/gmock-1.7.0/src/gmock-1.7.0/gtest/include    -o CMakeFiles/mesos-tests.dir/scheduler_tests.cpp.o -c /mesos/src/tests/scheduler_tests.cpp
/usr/bin/cmake -E cmake_progress_report /mesos/build/CMakeFiles 
[ 87%] Building CXX object src/tests/CMakeFiles/mesos-tests.dir/slave_tests.cpp.o
cd /mesos/build/src/tests && /usr/bin/g++   -DBUILD_DIR=\"/mesos/build\" -DBUILD_FLAGS=\"\" -DBUILD_JAVA_JVM_LIBRARY=\"\" -DHAS_AUTHENTICATION=1 -DLIBDIR=\"/usr/local/libmesos\" -DPICOJSON_USE_INT64 -DPKGDATADIR=\"/usr/local/share/mesos\" -DPKGLIBEXECDIR=\"/usr/local/libexec/mesos\" -DPKGMODULEDIR=\"\" -DSBINDIR=\"\" -DSOURCE_DIR=\"/mesos\" -DTESTLIBEXECDIR=\"\" -DUSE_CMAKE_BUILD_CONFIG -DUSE_STATIC_LIB -DVERSION=\"1.4.0\" -D__STDC_FORMAT_MACROS -O2 -std=c++11 -g -fPIE -I/mesos/build/include -I/mesos/build/include/mesos -I/mesos/build/src -I/mesos/src -isystem /mesos/build/3rdparty/protobuf-2.6.1/src/protobuf-2.6.1-lib/lib/include -isystem /mesos/3rdparty/libprocess/include -isystem /usr/include/apr-1.0 -isystem /mesos/build/3rdparty/boost-1.53.0/src/boost-1.53.0 -isystem /mesos/build/3rdparty/elfio-3.2/src/elfio-3.2 -isystem /mesos/build/3rdparty/glog-0.3.3/src/glog-0.3.3-lib/lib/include -isystem /mesos/build/3rdparty/nvml-352.79/src/nvml-352.79 -isystem /mesos/build/3rdparty/picojson-1.3.0/src/picojson-1.3.0 -isystem /usr/include/subversion-1 -isystem /mesos/3rdparty/stout/include -isystem /mesos/build/3rdparty/http_parser-2.6.2/src/http_parser-2.6.2 -isystem /mesos/build/3rdparty/libev-4.22/src/libev-4.22 -isystem /mesos/build/3rdparty/zookeeper-3.4.8/src/zookeeper-3.4.8/src/c/include -isystem /mesos/build/3rdparty/zookeeper-3.4.8/src/zookeeper-3.4.8/src/c/generated -isystem /mesos/build/3rdparty/leveldb-1.19/src/leveldb-1.19/include -I/mesos/include -isystem /mesos/build/3rdparty/gmock-1.7.0/src/gmock-1.7.0/include -isystem /mesos/build/3rdparty/gmock-1.7.0/src/gmock-1.7.0/gtest/include    -o CMakeFiles/mesos-tests.dir/slave_tests.cpp.o -c /mesos/src/tests/slave_tests.cpp
/usr/bin/cmake -E cmake_progress_report /mesos/build/CMakeFiles 67
[ 88%] Building CXX object src/tests/CMakeFiles/mesos-tests.dir/slave_validation_tests.cpp.o
cd /mesos/build/src/tests && /usr/bin/g++   -DBUILD_DIR=\"/mesos/build\" -DBUILD_FLAGS=\"\" -DBUILD_JAVA_JVM_LIBRARY=\"\" -DHAS_AUTHENTICATION=1 -DLIBDIR=\"/usr/local/libmesos\" -DPICOJSON_USE_INT64 -DPKGDATADIR=\"/usr/local/share/mesos\" -DPKGLIBEXECDIR=\"/usr/local/libexec/mesos\" -DPKGMODULEDIR=\"\" -DSBINDIR=\"\" -DSOURCE_DIR=\"/mesos\" -DTESTLIBEXECDIR=\"\" -DUSE_CMAKE_BUILD_CONFIG -DUSE_STATIC_LIB -DVERSION=\"1.4.0\" -D__STDC_FORMAT_MACROS -O2 -std=c++11 -g -fPIE -I/mesos/build/include -I/mesos/build/include/mesos -I/mesos/build/src -I/mesos/src -isystem /mesos/build/3rdparty/protobuf-2.6.1/src/protobuf-2.6.1-lib/lib/include -isystem /mesos/3rdparty/libprocess/include -isystem /usr/include/apr-1.0 -isystem /mesos/build/3rdparty/boost-1.53.0/src/boost-1.53.0 -isystem /mesos/build/3rdparty/elfio-3.2/src/elfio-3.2 -isystem /mesos/build/3rdparty/glog-0.3.3/src/glog-0.3.3-lib/lib/include -isystem /mesos/build/3rdparty/nvml-352.79/src/nvml-352.79 -isystem /mesos/build/3rdparty/picojson-1.3.0/src/picojson-1.3.0 -isystem /usr/include/subversion-1 -isystem /mesos/3rdparty/stout/include -isystem /mesos/build/3rdparty/http_parser-2.6.2/src/http_parser-2.6.2 -isystem /mesos/build/3rdparty/libev-4.22/src/libev-4.22 -isystem /mesos/build/3rdparty/zookeeper-3.4.8/src/zookeeper-3.4.8/src/c/include -isystem /mesos/build/3rdparty/zookeeper-3.4.8/src/zookeeper-3.4.8/src/c/generated -isystem /mesos/build/3rdparty/leveldb-1.19/src/leveldb-1.19/include -I/mesos/include -isystem /mesos/build/3rdparty/gmock-1.7.0/src/gmock-1.7.0/include -isystem /mesos/build/3rdparty/gmock-1.7.0/src/gmock-1.7.0/gtest/include    -o CMakeFiles/mesos-tests.dir/slave_validation_tests.cpp.o -c /mesos/src/tests/slave_validation_tests.cpp
/usr/bin/cmake -E cmake_progress_report /mesos/build/CMakeFiles 
[ 88%] Building CXX object src/tests/CMakeFiles/mesos-tests.dir/sorter_tests.cpp.o
cd /mesos/build/src/tests && /usr/bin/g++   -DBUILD_DIR=\"/mesos/build\" -DBUILD_FLAGS=\"\" -DBUILD_JAVA_JVM_LIBRARY=\"\" -DHAS_AUTHENTICATION=1 -DLIBDIR=\"/usr/local/libmesos\" -DPICOJSON_USE_INT64 -DPKGDATADIR=\"/usr/local/share/mesos\" -DPKGLIBEXECDIR=\"/usr/local/libexec/mesos\" -DPKGMODULEDIR=\"\" -DSBINDIR=\"\" -DSOURCE_DIR=\"/mesos\" -DTESTLIBEXECDIR=\"\" -DUSE_CMAKE_BUILD_CONFIG -DUSE_STATIC_LIB -DVERSION=\"1.4.0\" -D__STDC_FORMAT_MACROS -O2 -std=c++11 -g -fPIE -I/mesos/build/include -I/mesos/build/include/mesos -I/mesos/build/src -I/mesos/src -isystem /mesos/build/3rdparty/protobuf-2.6.1/src/protobuf-2.6.1-lib/lib/include -isystem /mesos/3rdparty/libprocess/include -isystem /usr/include/apr-1.0 -isystem /mesos/build/3rdparty/boost-1.53.0/src/boost-1.53.0 -isystem /mesos/build/3rdparty/elfio-3.2/src/elfio-3.2 -isystem /mesos/build/3rdparty/glog-0.3.3/src/glog-0.3.3-lib/lib/include -isystem /mesos/build/3rdparty/nvml-352.79/src/nvml-352.79 -isystem /mesos/build/3rdparty/picojson-1.3.0/src/picojson-1.3.0 -isystem /usr/include/subversion-1 -isystem /mesos/3rdparty/stout/include -isystem /mesos/build/3rdparty/http_parser-2.6.2/src/http_parser-2.6.2 -isystem /mesos/build/3rdparty/libev-4.22/src/libev-4.22 -isystem /mesos/build/3rdparty/zookeeper-3.4.8/src/zookeeper-3.4.8/src/c/include -isystem /mesos/build/3rdparty/zookeeper-3.4.8/src/zookeeper-3.4.8/src/c/generated -isystem /mesos/build/3rdparty/leveldb-1.19/src/leveldb-1.19/include -I/mesos/include -isystem /mesos/build/3rdparty/gmock-1.7.0/src/gmock-1.7.0/include -isystem /mesos/build/3rdparty/gmock-1.7.0/src/gmock-1.7.0/gtest/include    -o CMakeFiles/mesos-tests.dir/sorter_tests.cpp.o -c /mesos/src/tests/sorter_tests.cpp
/usr/bin/cmake -E cmake_progress_report /mesos/build/CMakeFiles 
[ 88%] Building CXX object src/tests/CMakeFiles/mesos-tests.dir/status_update_manager_tests.cpp.o
cd /mesos/build/src/tests && /usr/bin/g++   -DBUILD_DIR=\"/mesos/build\" -DBUILD_FLAGS=\"\" -DBUILD_JAVA_JVM_LIBRARY=\"\" -DHAS_AUTHENTICATION=1 -DLIBDIR=\"/usr/local/libmesos\" -DPICOJSON_USE_INT64 -DPKGDATADIR=\"/usr/local/share/mesos\" -DPKGLIBEXECDIR=\"/usr/local/libexec/mesos\" -DPKGMODULEDIR=\"\" -DSBINDIR=\"\" -DSOURCE_DIR=\"/mesos\" -DTESTLIBEXECDIR=\"\" -DUSE_CMAKE_BUILD_CONFIG -DUSE_STATIC_LIB -DVERSION=\"1.4.0\" -D__STDC_FORMAT_MACROS -O2 -std=c++11 -g -fPIE -I/mesos/build/include -I/mesos/build/include/mesos -I/mesos/build/src -I/mesos/src -isystem /mesos/build/3rdparty/protobuf-2.6.1/src/protobuf-2.6.1-lib/lib/include -isystem /mesos/3rdparty/libprocess/include -isystem /usr/include/apr-1.0 -isystem /mesos/build/3rdparty/boost-1.53.0/src/boost-1.53.0 -isystem /mesos/build/3rdparty/elfio-3.2/src/elfio-3.2 -isystem /mesos/build/3rdparty/glog-0.3.3/src/glog-0.3.3-lib/lib/include -isystem /mesos/build/3rdparty/nvml-352.79/src/nvml-352.79 -isystem /mesos/build/3rdparty/picojson-1.3.0/src/picojson-1.3.0 -isystem /usr/include/subversion-1 -isystem /mesos/3rdparty/stout/include -isystem /mesos/build/3rdparty/http_parser-2.6.2/src/http_parser-2.6.2 -isystem /mesos/build/3rdparty/libev-4.22/src/libev-4.22 -isystem /mesos/build/3rdparty/zookeeper-3.4.8/src/zookeeper-3.4.8/src/c/include -isystem /mesos/build/3rdparty/zookeeper-3.4.8/src/zookeeper-3.4.8/src/c/generated -isystem /mesos/build/3rdparty/leveldb-1.19/src/leveldb-1.19/include -I/mesos/include -isystem /mesos/build/3rdparty/gmock-1.7.0/src/gmock-1.7.0/include -isystem /mesos/build/3rdparty/gmock-1.7.0/src/gmock-1.7.0/gtest/include    -o CMakeFiles/mesos-tests.dir/status_update_manager_tests.cpp.o -c /mesos/src/tests/status_update_manager_tests.cpp
/usr/bin/cmake -E cmake_progress_report /mesos/build/CMakeFiles 
[ 88%] Building CXX object src/tests/CMakeFiles/mesos-tests.dir/uri_tests.cpp.o
cd /mesos/build/src/tests && /usr/bin/g++   -DBUILD_DIR=\"/mesos/build\" -DBUILD_FLAGS=\"\" -DBUILD_JAVA_JVM_LIBRARY=\"\" -DHAS_AUTHENTICATION=1 -DLIBDIR=\"/usr/local/libmesos\" -DPICOJSON_USE_INT64 -DPKGDATADIR=\"/usr/local/share/mesos\" -DPKGLIBEXECDIR=\"/usr/local/libexec/mesos\" -DPKGMODULEDIR=\"\" -DSBINDIR=\"\" -DSOURCE_DIR=\"/mesos\" -DTESTLIBEXECDIR=\"\" -DUSE_CMAKE_BUILD_CONFIG -DUSE_STATIC_LIB -DVERSION=\"1.4.0\" -D__STDC_FORMAT_MACROS -O2 -std=c++11 -g -fPIE -I/mesos/build/include -I/mesos/build/include/mesos -I/mesos/build/src -I/mesos/src -isystem /mesos/build/3rdparty/protobuf-2.6.1/src/protobuf-2.6.1-lib/lib/include -isystem /mesos/3rdparty/libprocess/include -isystem /usr/include/apr-1.0 -isystem /mesos/build/3rdparty/boost-1.53.0/src/boost-1.53.0 -isystem /mesos/build/3rdparty/elfio-3.2/src/elfio-3.2 -isystem /mesos/build/3rdparty/glog-0.3.3/src/glog-0.3.3-lib/lib/include -isystem /mesos/build/3rdparty/nvml-352.79/src/nvml-352.79 -isystem /mesos/build/3rdparty/picojson-1.3.0/src/picojson-1.3.0 -isystem /usr/include/subversion-1 -isystem /mesos/3rdparty/stout/include -isystem /mesos/build/3rdparty/http_parser-2.6.2/src/http_parser-2.6.2 -isystem /mesos/build/3rdparty/libev-4.22/src/libev-4.22 -isystem /mesos/build/3rdparty/zookeeper-3.4.8/src/zookeeper-3.4.8/src/c/include -isystem /mesos/build/3rdparty/zookeeper-3.4.8/src/zookeeper-3.4.8/src/c/generated -isystem /mesos/build/3rdparty/leveldb-1.19/src/leveldb-1.19/include -I/mesos/include -isystem /mesos/build/3rdparty/gmock-1.7.0/src/gmock-1.7.0/include -isystem /mesos/build/3rdparty/gmock-1.7.0/src/gmock-1.7.0/gtest/include    -o CMakeFiles/mesos-tests.dir/uri_tests.cpp.o -c /mesos/src/tests/uri_tests.cpp
/usr/bin/cmake -E cmake_progress_report /mesos/build/CMakeFiles 
[ 88%] Building CXX object src/tests/CMakeFiles/mesos-tests.dir/uri_fetcher_tests.cpp.o
cd /mesos/build/src/tests && /usr/bin/g++   -DBUILD_DIR=\"/mesos/build\" -DBUILD_FLAGS=\"\" -DBUILD_JAVA_JVM_LIBRARY=\"\" -DHAS_AUTHENTICATION=1 -DLIBDIR=\"/usr/local/libmesos\" -DPICOJSON_USE_INT64 -DPKGDATADIR=\"/usr/local/share/mesos\" -DPKGLIBEXECDIR=\"/usr/local/libexec/mesos\" -DPKGMODULEDIR=\"\" -DSBINDIR=\"\" -DSOURCE_DIR=\"/mesos\" -DTESTLIBEXECDIR=\"\" -DUSE_CMAKE_BUILD_CONFIG -DUSE_STATIC_LIB -DVERSION=\"1.4.0\" -D__STDC_FORMAT_MACROS -O2 -std=c++11 -g -fPIE -I/mesos/build/include -I/mesos/build/include/mesos -I/mesos/build/src -I/mesos/src -isystem /mesos/build/3rdparty/protobuf-2.6.1/src/protobuf-2.6.1-lib/lib/include -isystem /mesos/3rdparty/libprocess/include -isystem /usr/include/apr-1.0 -isystem /mesos/build/3rdparty/boost-1.53.0/src/boost-1.53.0 -isystem /mesos/build/3rdparty/elfio-3.2/src/elfio-3.2 -isystem /mesos/build/3rdparty/glog-0.3.3/src/glog-0.3.3-lib/lib/include -isystem /mesos/build/3rdparty/nvml-352.79/src/nvml-352.79 -isystem /mesos/build/3rdparty/picojson-1.3.0/src/picojson-1.3.0 -isystem /usr/include/subversion-1 -isystem /mesos/3rdparty/stout/include -isystem /mesos/build/3rdparty/http_parser-2.6.2/src/http_parser-2.6.2 -isystem /mesos/build/3rdparty/libev-4.22/src/libev-4.22 -isystem /mesos/build/3rdparty/zookeeper-3.4.8/src/zookeeper-3.4.8/src/c/include -isystem /mesos/build/3rdparty/zookeeper-3.4.8/src/zookeeper-3.4.8/src/c/generated -isystem /mesos/build/3rdparty/leveldb-1.19/src/leveldb-1.19/include -I/mesos/include -isystem /mesos/build/3rdparty/gmock-1.7.0/src/gmock-1.7.0/include -isystem /mesos/build/3rdparty/gmock-1.7.0/src/gmock-1.7.0/gtest/include    -o CMakeFiles/mesos-tests.dir/uri_fetcher_tests.cpp.o -c /mesos/src/tests/uri_fetcher_tests.cpp
/usr/bin/cmake -E cmake_progress_report /mesos/build/CMakeFiles 
[ 88%] Building CXX object src/tests/CMakeFiles/mesos-tests.dir/values_tests.cpp.o
cd /mesos/build/src/tests && /usr/bin/g++   -DBUILD_DIR=\"/mesos/build\" -DBUILD_FLAGS=\"\" -DBUILD_JAVA_JVM_LIBRARY=\"\" -DHAS_AUTHENTICATION=1 -DLIBDIR=\"/usr/local/libmesos\" -DPICOJSON_USE_INT64 -DPKGDATADIR=\"/usr/local/share/mesos\" -DPKGLIBEXECDIR=\"/usr/local/libexec/mesos\" -DPKGMODULEDIR=\"\" -DSBINDIR=\"\" -DSOURCE_DIR=\"/mesos\" -DTESTLIBEXECDIR=\"\" -DUSE_CMAKE_BUILD_CONFIG -DUSE_STATIC_LIB -DVERSION=\"1.4.0\" -D__STDC_FORMAT_MACROS -O2 -std=c++11 -g -fPIE -I/mesos/build/include -I/mesos/build/include/mesos -I/mesos/build/src -I/mesos/src -isystem /mesos/build/3rdparty/protobuf-2.6.1/src/protobuf-2.6.1-lib/lib/include -isystem /mesos/3rdparty/libprocess/include -isystem /usr/include/apr-1.0 -isystem /mesos/build/3rdparty/boost-1.53.0/src/boost-1.53.0 -isystem /mesos/build/3rdparty/elfio-3.2/src/elfio-3.2 -isystem /mesos/build/3rdparty/glog-0.3.3/src/glog-0.3.3-lib/lib/include -isystem /mesos/build/3rdparty/nvml-352.79/src/nvml-352.79 -isystem /mesos/build/3rdparty/picojson-1.3.0/src/picojson-1.3.0 -isystem /usr/include/subversion-1 -isystem /mesos/3rdparty/stout/include -isystem /mesos/build/3rdparty/http_parser-2.6.2/src/http_parser-2.6.2 -isystem /mesos/build/3rdparty/libev-4.22/src/libev-4.22 -isystem /mesos/build/3rdparty/zookeeper-3.4.8/src/zookeeper-3.4.8/src/c/include -isystem /mesos/build/3rdparty/zookeeper-3.4.8/src/zookeeper-3.4.8/src/c/generated -isystem /mesos/build/3rdparty/leveldb-1.19/src/leveldb-1.19/include -I/mesos/include -isystem /mesos/build/3rdparty/gmock-1.7.0/src/gmock-1.7.0/include -isystem /mesos/build/3rdparty/gmock-1.7.0/src/gmock-1.7.0/gtest/include    -o CMakeFiles/mesos-tests.dir/values_tests.cpp.o -c /mesos/src/tests/values_tests.cpp
/usr/bin/cmake -E cmake_progress_report /mesos/build/CMakeFiles 68
[ 89%] Building CXX object src/tests/CMakeFiles/mesos-tests.dir/zookeeper_url_tests.cpp.o
cd /mesos/build/src/tests && /usr/bin/g++   -DBUILD_DIR=\"/mesos/build\" -DBUILD_FLAGS=\"\" -DBUILD_JAVA_JVM_LIBRARY=\"\" -DHAS_AUTHENTICATION=1 -DLIBDIR=\"/usr/local/libmesos\" -DPICOJSON_USE_INT64 -DPKGDATADIR=\"/usr/local/share/mesos\" -DPKGLIBEXECDIR=\"/usr/local/libexec/mesos\" -DPKGMODULEDIR=\"\" -DSBINDIR=\"\" -DSOURCE_DIR=\"/mesos\" -DTESTLIBEXECDIR=\"\" -DUSE_CMAKE_BUILD_CONFIG -DUSE_STATIC_LIB -DVERSION=\"1.4.0\" -D__STDC_FORMAT_MACROS -O2 -std=c++11 -g -fPIE -I/mesos/build/include -I/mesos/build/include/mesos -I/mesos/build/src -I/mesos/src -isystem /mesos/build/3rdparty/protobuf-2.6.1/src/protobuf-2.6.1-lib/lib/include -isystem /mesos/3rdparty/libprocess/include -isystem /usr/include/apr-1.0 -isystem /mesos/build/3rdparty/boost-1.53.0/src/boost-1.53.0 -isystem /mesos/build/3rdparty/elfio-3.2/src/elfio-3.2 -isystem /mesos/build/3rdparty/glog-0.3.3/src/glog-0.3.3-lib/lib/include -isystem /mesos/build/3rdparty/nvml-352.79/src/nvml-352.79 -isystem /mesos/build/3rdparty/picojson-1.3.0/src/picojson-1.3.0 -isystem /usr/include/subversion-1 -isystem /mesos/3rdparty/stout/include -isystem /mesos/build/3rdparty/http_parser-2.6.2/src/http_parser-2.6.2 -isystem /mesos/build/3rdparty/libev-4.22/src/libev-4.22 -isystem /mesos/build/3rdparty/zookeeper-3.4.8/src/zookeeper-3.4.8/src/c/include -isystem /mesos/build/3rdparty/zookeeper-3.4.8/src/zookeeper-3.4.8/src/c/generated -isystem /mesos/build/3rdparty/leveldb-1.19/src/leveldb-1.19/include -I/mesos/include -isystem /mesos/build/3rdparty/gmock-1.7.0/src/gmock-1.7.0/include -isystem /mesos/build/3rdparty/gmock-1.7.0/src/gmock-1.7.0/gtest/include    -o CMakeFiles/mesos-tests.dir/zookeeper_url_tests.cpp.o -c /mesos/src/tests/zookeeper_url_tests.cpp
/usr/bin/cmake -E cmake_progress_report /mesos/build/CMakeFiles 
[ 89%] Building CXX object src/tests/CMakeFiles/mesos-tests.dir/common/http_tests.cpp.o
cd /mesos/build/src/tests && /usr/bin/g++   -DBUILD_DIR=\"/mesos/build\" -DBUILD_FLAGS=\"\" -DBUILD_JAVA_JVM_LIBRARY=\"\" -DHAS_AUTHENTICATION=1 -DLIBDIR=\"/usr/local/libmesos\" -DPICOJSON_USE_INT64 -DPKGDATADIR=\"/usr/local/share/mesos\" -DPKGLIBEXECDIR=\"/usr/local/libexec/mesos\" -DPKGMODULEDIR=\"\" -DSBINDIR=\"\" -DSOURCE_DIR=\"/mesos\" -DTESTLIBEXECDIR=\"\" -DUSE_CMAKE_BUILD_CONFIG -DUSE_STATIC_LIB -DVERSION=\"1.4.0\" -D__STDC_FORMAT_MACROS -O2 -std=c++11 -g -fPIE -I/mesos/build/include -I/mesos/build/include/mesos -I/mesos/build/src -I/mesos/src -isystem /mesos/build/3rdparty/protobuf-2.6.1/src/protobuf-2.6.1-lib/lib/include -isystem /mesos/3rdparty/libprocess/include -isystem /usr/include/apr-1.0 -isystem /mesos/build/3rdparty/boost-1.53.0/src/boost-1.53.0 -isystem /mesos/build/3rdparty/elfio-3.2/src/elfio-3.2 -isystem /mesos/build/3rdparty/glog-0.3.3/src/glog-0.3.3-lib/lib/include -isystem /mesos/build/3rdparty/nvml-352.79/src/nvml-352.79 -isystem /mesos/build/3rdparty/picojson-1.3.0/src/picojson-1.3.0 -isystem /usr/include/subversion-1 -isystem /mesos/3rdparty/stout/include -isystem /mesos/build/3rdparty/http_parser-2.6.2/src/http_parser-2.6.2 -isystem /mesos/build/3rdparty/libev-4.22/src/libev-4.22 -isystem /mesos/build/3rdparty/zookeeper-3.4.8/src/zookeeper-3.4.8/src/c/include -isystem /mesos/build/3rdparty/zookeeper-3.4.8/src/zookeeper-3.4.8/src/c/generated -isystem /mesos/build/3rdparty/leveldb-1.19/src/leveldb-1.19/include -I/mesos/include -isystem /mesos/build/3rdparty/gmock-1.7.0/src/gmock-1.7.0/include -isystem /mesos/build/3rdparty/gmock-1.7.0/src/gmock-1.7.0/gtest/include    -o CMakeFiles/mesos-tests.dir/common/http_tests.cpp.o -c /mesos/src/tests/common/http_tests.cpp
/usr/bin/cmake -E cmake_progress_report /mesos/build/CMakeFiles 
[ 89%] Building CXX object src/tests/CMakeFiles/mesos-tests.dir/common/recordio_tests.cpp.o
cd /mesos/build/src/tests && /usr/bin/g++   -DBUILD_DIR=\"/mesos/build\" -DBUILD_FLAGS=\"\" -DBUILD_JAVA_JVM_LIBRARY=\"\" -DHAS_AUTHENTICATION=1 -DLIBDIR=\"/usr/local/libmesos\" -DPICOJSON_USE_INT64 -DPKGDATADIR=\"/usr/local/share/mesos\" -DPKGLIBEXECDIR=\"/usr/local/libexec/mesos\" -DPKGMODULEDIR=\"\" -DSBINDIR=\"\" -DSOURCE_DIR=\"/mesos\" -DTESTLIBEXECDIR=\"\" -DUSE_CMAKE_BUILD_CONFIG -DUSE_STATIC_LIB -DVERSION=\"1.4.0\" -D__STDC_FORMAT_MACROS -O2 -std=c++11 -g -fPIE -I/mesos/build/include -I/mesos/build/include/mesos -I/mesos/build/src -I/mesos/src -isystem /mesos/build/3rdparty/protobuf-2.6.1/src/protobuf-2.6.1-lib/lib/include -isystem /mesos/3rdparty/libprocess/include -isystem /usr/include/apr-1.0 -isystem /mesos/build/3rdparty/boost-1.53.0/src/boost-1.53.0 -isystem /mesos/build/3rdparty/elfio-3.2/src/elfio-3.2 -isystem /mesos/build/3rdparty/glog-0.3.3/src/glog-0.3.3-lib/lib/include -isystem /mesos/build/3rdparty/nvml-352.79/src/nvml-352.79 -isystem /mesos/build/3rdparty/picojson-1.3.0/src/picojson-1.3.0 -isystem /usr/include/subversion-1 -isystem /mesos/3rdparty/stout/include -isystem /mesos/build/3rdparty/http_parser-2.6.2/src/http_parser-2.6.2 -isystem /mesos/build/3rdparty/libev-4.22/src/libev-4.22 -isystem /mesos/build/3rdparty/zookeeper-3.4.8/src/zookeeper-3.4.8/src/c/include -isystem /mesos/build/3rdparty/zookeeper-3.4.8/src/zookeeper-3.4.8/src/c/generated -isystem /mesos/build/3rdparty/leveldb-1.19/src/leveldb-1.19/include -I/mesos/include -isystem /mesos/build/3rdparty/gmock-1.7.0/src/gmock-1.7.0/include -isystem /mesos/build/3rdparty/gmock-1.7.0/src/gmock-1.7.0/gtest/include    -o CMakeFiles/mesos-tests.dir/common/recordio_tests.cpp.o -c /mesos/src/tests/common/recordio_tests.cpp
/usr/bin/cmake -E cmake_progress_report /mesos/build/CMakeFiles 
[ 89%] Building CXX object src/tests/CMakeFiles/mesos-tests.dir/common/type_utils_tests.cpp.o
cd /mesos/build/src/tests && /usr/bin/g++   -DBUILD_DIR=\"/mesos/build\" -DBUILD_FLAGS=\"\" -DBUILD_JAVA_JVM_LIBRARY=\"\" -DHAS_AUTHENTICATION=1 -DLIBDIR=\"/usr/local/libmesos\" -DPICOJSON_USE_INT64 -DPKGDATADIR=\"/usr/local/share/mesos\" -DPKGLIBEXECDIR=\"/usr/local/libexec/mesos\" -DPKGMODULEDIR=\"\" -DSBINDIR=\"\" -DSOURCE_DIR=\"/mesos\" -DTESTLIBEXECDIR=\"\" -DUSE_CMAKE_BUILD_CONFIG -DUSE_STATIC_LIB -DVERSION=\"1.4.0\" -D__STDC_FORMAT_MACROS -O2 -std=c++11 -g -fPIE -I/mesos/build/include -I/mesos/build/include/mesos -I/mesos/build/src -I/mesos/src -isystem /mesos/build/3rdparty/protobuf-2.6.1/src/protobuf-2.6.1-lib/lib/include -isystem /mesos/3rdparty/libprocess/include -isystem /usr/include/apr-1.0 -isystem /mesos/build/3rdparty/boost-1.53.0/src/boost-1.53.0 -isystem /mesos/build/3rdparty/elfio-3.2/src/elfio-3.2 -isystem /mesos/build/3rdparty/glog-0.3.3/src/glog-0.3.3-lib/lib/include -isystem /mesos/build/3rdparty/nvml-352.79/src/nvml-352.79 -isystem /mesos/build/3rdparty/picojson-1.3.0/src/picojson-1.3.0 -isystem /usr/include/subversion-1 -isystem /mesos/3rdparty/stout/include -isystem /mesos/build/3rdparty/http_parser-2.6.2/src/http_parser-2.6.2 -isystem /mesos/build/3rdparty/libev-4.22/src/libev-4.22 -isystem /mesos/build/3rdparty/zookeeper-3.4.8/src/zookeeper-3.4.8/src/c/include -isystem /mesos/build/3rdparty/zookeeper-3.4.8/src/zookeeper-3.4.8/src/c/generated -isystem /mesos/build/3rdparty/leveldb-1.19/src/leveldb-1.19/include -I/mesos/include -isystem /mesos/build/3rdparty/gmock-1.7.0/src/gmock-1.7.0/include -isystem /mesos/build/3rdparty/gmock-1.7.0/src/gmock-1.7.0/gtest/include    -o CMakeFiles/mesos-tests.dir/common/type_utils_tests.cpp.o -c /mesos/src/tests/common/type_utils_tests.cpp
/usr/bin/cmake -E cmake_progress_report /mesos/build/CMakeFiles 
[ 89%] Building CXX object src/tests/CMakeFiles/mesos-tests.dir/authorization_tests.cpp.o
cd /mesos/build/src/tests && /usr/bin/g++   -DBUILD_DIR=\"/mesos/build\" -DBUILD_FLAGS=\"\" -DBUILD_JAVA_JVM_LIBRARY=\"\" -DHAS_AUTHENTICATION=1 -DLIBDIR=\"/usr/local/libmesos\" -DPICOJSON_USE_INT64 -DPKGDATADIR=\"/usr/local/share/mesos\" -DPKGLIBEXECDIR=\"/usr/local/libexec/mesos\" -DPKGMODULEDIR=\"\" -DSBINDIR=\"\" -DSOURCE_DIR=\"/mesos\" -DTESTLIBEXECDIR=\"\" -DUSE_CMAKE_BUILD_CONFIG -DUSE_STATIC_LIB -DVERSION=\"1.4.0\" -D__STDC_FORMAT_MACROS -O2 -std=c++11 -g -fPIE -I/mesos/build/include -I/mesos/build/include/mesos -I/mesos/build/src -I/mesos/src -isystem /mesos/build/3rdparty/protobuf-2.6.1/src/protobuf-2.6.1-lib/lib/include -isystem /mesos/3rdparty/libprocess/include -isystem /usr/include/apr-1.0 -isystem /mesos/build/3rdparty/boost-1.53.0/src/boost-1.53.0 -isystem /mesos/build/3rdparty/elfio-3.2/src/elfio-3.2 -isystem /mesos/build/3rdparty/glog-0.3.3/src/glog-0.3.3-lib/lib/include -isystem /mesos/build/3rdparty/nvml-352.79/src/nvml-352.79 -isystem /mesos/build/3rdparty/picojson-1.3.0/src/picojson-1.3.0 -isystem /usr/include/subversion-1 -isystem /mesos/3rdparty/stout/include -isystem /mesos/build/3rdparty/http_parser-2.6.2/src/http_parser-2.6.2 -isystem /mesos/build/3rdparty/libev-4.22/src/libev-4.22 -isystem /mesos/build/3rdparty/zookeeper-3.4.8/src/zookeeper-3.4.8/src/c/include -isystem /mesos/build/3rdparty/zookeeper-3.4.8/src/zookeeper-3.4.8/src/c/generated -isystem /mesos/build/3rdparty/leveldb-1.19/src/leveldb-1.19/include -I/mesos/include -isystem /mesos/build/3rdparty/gmock-1.7.0/src/gmock-1.7.0/include -isystem /mesos/build/3rdparty/gmock-1.7.0/src/gmock-1.7.0/gtest/include    -o CMakeFiles/mesos-tests.dir/authorization_tests.cpp.o -c /mesos/src/tests/authorization_tests.cpp
/usr/bin/cmake -E cmake_progress_report /mesos/build/CMakeFiles 
[ 89%] Building CXX object src/tests/CMakeFiles/mesos-tests.dir/container_logger_tests.cpp.o
cd /mesos/build/src/tests && /usr/bin/g++   -DBUILD_DIR=\"/mesos/build\" -DBUILD_FLAGS=\"\" -DBUILD_JAVA_JVM_LIBRARY=\"\" -DHAS_AUTHENTICATION=1 -DLIBDIR=\"/usr/local/libmesos\" -DPICOJSON_USE_INT64 -DPKGDATADIR=\"/usr/local/share/mesos\" -DPKGLIBEXECDIR=\"/usr/local/libexec/mesos\" -DPKGMODULEDIR=\"\" -DSBINDIR=\"\" -DSOURCE_DIR=\"/mesos\" -DTESTLIBEXECDIR=\"\" -DUSE_CMAKE_BUILD_CONFIG -DUSE_STATIC_LIB -DVERSION=\"1.4.0\" -D__STDC_FORMAT_MACROS -O2 -std=c++11 -g -fPIE -I/mesos/build/include -I/mesos/build/include/mesos -I/mesos/build/src -I/mesos/src -isystem /mesos/build/3rdparty/protobuf-2.6.1/src/protobuf-2.6.1-lib/lib/include -isystem /mesos/3rdparty/libprocess/include -isystem /usr/include/apr-1.0 -isystem /mesos/build/3rdparty/boost-1.53.0/src/boost-1.53.0 -isystem /mesos/build/3rdparty/elfio-3.2/src/elfio-3.2 -isystem /mesos/build/3rdparty/glog-0.3.3/src/glog-0.3.3-lib/lib/include -isystem /mesos/build/3rdparty/nvml-352.79/src/nvml-352.79 -isystem /mesos/build/3rdparty/picojson-1.3.0/src/picojson-1.3.0 -isystem /usr/include/subversion-1 -isystem /mesos/3rdparty/stout/include -isystem /mesos/build/3rdparty/http_parser-2.6.2/src/http_parser-2.6.2 -isystem /mesos/build/3rdparty/libev-4.22/src/libev-4.22 -isystem /mesos/build/3rdparty/zookeeper-3.4.8/src/zookeeper-3.4.8/src/c/include -isystem /mesos/build/3rdparty/zookeeper-3.4.8/src/zookeeper-3.4.8/src/c/generated -isystem /mesos/build/3rdparty/leveldb-1.19/src/leveldb-1.19/include -I/mesos/include -isystem /mesos/build/3rdparty/gmock-1.7.0/src/gmock-1.7.0/include -isystem /mesos/build/3rdparty/gmock-1.7.0/src/gmock-1.7.0/gtest/include    -o CMakeFiles/mesos-tests.dir/container_logger_tests.cpp.o -c /mesos/src/tests/container_logger_tests.cpp
/usr/bin/cmake -E cmake_progress_report /mesos/build/CMakeFiles 69
[ 90%] Building CXX object src/tests/CMakeFiles/mesos-tests.dir/cram_md5_authentication_tests.cpp.o
cd /mesos/build/src/tests && /usr/bin/g++   -DBUILD_DIR=\"/mesos/build\" -DBUILD_FLAGS=\"\" -DBUILD_JAVA_JVM_LIBRARY=\"\" -DHAS_AUTHENTICATION=1 -DLIBDIR=\"/usr/local/libmesos\" -DPICOJSON_USE_INT64 -DPKGDATADIR=\"/usr/local/share/mesos\" -DPKGLIBEXECDIR=\"/usr/local/libexec/mesos\" -DPKGMODULEDIR=\"\" -DSBINDIR=\"\" -DSOURCE_DIR=\"/mesos\" -DTESTLIBEXECDIR=\"\" -DUSE_CMAKE_BUILD_CONFIG -DUSE_STATIC_LIB -DVERSION=\"1.4.0\" -D__STDC_FORMAT_MACROS -O2 -std=c++11 -g -fPIE -I/mesos/build/include -I/mesos/build/include/mesos -I/mesos/build/src -I/mesos/src -isystem /mesos/build/3rdparty/protobuf-2.6.1/src/protobuf-2.6.1-lib/lib/include -isystem /mesos/3rdparty/libprocess/include -isystem /usr/include/apr-1.0 -isystem /mesos/build/3rdparty/boost-1.53.0/src/boost-1.53.0 -isystem /mesos/build/3rdparty/elfio-3.2/src/elfio-3.2 -isystem /mesos/build/3rdparty/glog-0.3.3/src/glog-0.3.3-lib/lib/include -isystem /mesos/build/3rdparty/nvml-352.79/src/nvml-352.79 -isystem /mesos/build/3rdparty/picojson-1.3.0/src/picojson-1.3.0 -isystem /usr/include/subversion-1 -isystem /mesos/3rdparty/stout/include -isystem /mesos/build/3rdparty/http_parser-2.6.2/src/http_parser-2.6.2 -isystem /mesos/build/3rdparty/libev-4.22/src/libev-4.22 -isystem /mesos/build/3rdparty/zookeeper-3.4.8/src/zookeeper-3.4.8/src/c/include -isystem /mesos/build/3rdparty/zookeeper-3.4.8/src/zookeeper-3.4.8/src/c/generated -isystem /mesos/build/3rdparty/leveldb-1.19/src/leveldb-1.19/include -I/mesos/include -isystem /mesos/build/3rdparty/gmock-1.7.0/src/gmock-1.7.0/include -isystem /mesos/build/3rdparty/gmock-1.7.0/src/gmock-1.7.0/gtest/include    -o CMakeFiles/mesos-tests.dir/cram_md5_authentication_tests.cpp.o -c /mesos/src/tests/cram_md5_authentication_tests.cpp
/usr/bin/cmake -E cmake_progress_report /mesos/build/CMakeFiles 
[ 90%] Building CXX object src/tests/CMakeFiles/mesos-tests.dir/disk_quota_tests.cpp.o
cd /mesos/build/src/tests && /usr/bin/g++   -DBUILD_DIR=\"/mesos/build\" -DBUILD_FLAGS=\"\" -DBUILD_JAVA_JVM_LIBRARY=\"\" -DHAS_AUTHENTICATION=1 -DLIBDIR=\"/usr/local/libmesos\" -DPICOJSON_USE_INT64 -DPKGDATADIR=\"/usr/local/share/mesos\" -DPKGLIBEXECDIR=\"/usr/local/libexec/mesos\" -DPKGMODULEDIR=\"\" -DSBINDIR=\"\" -DSOURCE_DIR=\"/mesos\" -DTESTLIBEXECDIR=\"\" -DUSE_CMAKE_BUILD_CONFIG -DUSE_STATIC_LIB -DVERSION=\"1.4.0\" -D__STDC_FORMAT_MACROS -O2 -std=c++11 -g -fPIE -I/mesos/build/include -I/mesos/build/include/mesos -I/mesos/build/src -I/mesos/src -isystem /mesos/build/3rdparty/protobuf-2.6.1/src/protobuf-2.6.1-lib/lib/include -isystem /mesos/3rdparty/libprocess/include -isystem /usr/include/apr-1.0 -isystem /mesos/build/3rdparty/boost-1.53.0/src/boost-1.53.0 -isystem /mesos/build/3rdparty/elfio-3.2/src/elfio-3.2 -isystem /mesos/build/3rdparty/glog-0.3.3/src/glog-0.3.3-lib/lib/include -isystem /mesos/build/3rdparty/nvml-352.79/src/nvml-352.79 -isystem /mesos/build/3rdparty/picojson-1.3.0/src/picojson-1.3.0 -isystem /usr/include/subversion-1 -isystem /mesos/3rdparty/stout/include -isystem /mesos/build/3rdparty/http_parser-2.6.2/src/http_parser-2.6.2 -isystem /mesos/build/3rdparty/libev-4.22/src/libev-4.22 -isystem /mesos/build/3rdparty/zookeeper-3.4.8/src/zookeeper-3.4.8/src/c/include -isystem /mesos/build/3rdparty/zookeeper-3.4.8/src/zookeeper-3.4.8/src/c/generated -isystem /mesos/build/3rdparty/leveldb-1.19/src/leveldb-1.19/include -I/mesos/include -isystem /mesos/build/3rdparty/gmock-1.7.0/src/gmock-1.7.0/include -isystem /mesos/build/3rdparty/gmock-1.7.0/src/gmock-1.7.0/gtest/include    -o CMakeFiles/mesos-tests.dir/disk_quota_tests.cpp.o -c /mesos/src/tests/disk_quota_tests.cpp
/usr/bin/cmake -E cmake_progress_report /mesos/build/CMakeFiles 
[ 90%] Building CXX object src/tests/CMakeFiles/mesos-tests.dir/dynamic_weights_tests.cpp.o
cd /mesos/build/src/tests && /usr/bin/g++   -DBUILD_DIR=\"/mesos/build\" -DBUILD_FLAGS=\"\" -DBUILD_JAVA_JVM_LIBRARY=\"\" -DHAS_AUTHENTICATION=1 -DLIBDIR=\"/usr/local/libmesos\" -DPICOJSON_USE_INT64 -DPKGDATADIR=\"/usr/local/share/mesos\" -DPKGLIBEXECDIR=\"/usr/local/libexec/mesos\" -DPKGMODULEDIR=\"\" -DSBINDIR=\"\" -DSOURCE_DIR=\"/mesos\" -DTESTLIBEXECDIR=\"\" -DUSE_CMAKE_BUILD_CONFIG -DUSE_STATIC_LIB -DVERSION=\"1.4.0\" -D__STDC_FORMAT_MACROS -O2 -std=c++11 -g -fPIE -I/mesos/build/include -I/mesos/build/include/mesos -I/mesos/build/src -I/mesos/src -isystem /mesos/build/3rdparty/protobuf-2.6.1/src/protobuf-2.6.1-lib/lib/include -isystem /mesos/3rdparty/libprocess/include -isystem /usr/include/apr-1.0 -isystem /mesos/build/3rdparty/boost-1.53.0/src/boost-1.53.0 -isystem /mesos/build/3rdparty/elfio-3.2/src/elfio-3.2 -isystem /mesos/build/3rdparty/glog-0.3.3/src/glog-0.3.3-lib/lib/include -isystem /mesos/build/3rdparty/nvml-352.79/src/nvml-352.79 -isystem /mesos/build/3rdparty/picojson-1.3.0/src/picojson-1.3.0 -isystem /usr/include/subversion-1 -isystem /mesos/3rdparty/stout/include -isystem /mesos/build/3rdparty/http_parser-2.6.2/src/http_parser-2.6.2 -isystem /mesos/build/3rdparty/libev-4.22/src/libev-4.22 -isystem /mesos/build/3rdparty/zookeeper-3.4.8/src/zookeeper-3.4.8/src/c/include -isystem /mesos/build/3rdparty/zookeeper-3.4.8/src/zookeeper-3.4.8/src/c/generated -isystem /mesos/build/3rdparty/leveldb-1.19/src/leveldb-1.19/include -I/mesos/include -isystem /mesos/build/3rdparty/gmock-1.7.0/src/gmock-1.7.0/include -isystem /mesos/build/3rdparty/gmock-1.7.0/src/gmock-1.7.0/gtest/include    -o CMakeFiles/mesos-tests.dir/dynamic_weights_tests.cpp.o -c /mesos/src/tests/dynamic_weights_tests.cpp
/usr/bin/cmake -E cmake_progress_report /mesos/build/CMakeFiles 
[ 90%] Building CXX object src/tests/CMakeFiles/mesos-tests.dir/examples_tests.cpp.o
cd /mesos/build/src/tests && /usr/bin/g++   -DBUILD_DIR=\"/mesos/build\" -DBUILD_FLAGS=\"\" -DBUILD_JAVA_JVM_LIBRARY=\"\" -DHAS_AUTHENTICATION=1 -DLIBDIR=\"/usr/local/libmesos\" -DPICOJSON_USE_INT64 -DPKGDATADIR=\"/usr/local/share/mesos\" -DPKGLIBEXECDIR=\"/usr/local/libexec/mesos\" -DPKGMODULEDIR=\"\" -DSBINDIR=\"\" -DSOURCE_DIR=\"/mesos\" -DTESTLIBEXECDIR=\"\" -DUSE_CMAKE_BUILD_CONFIG -DUSE_STATIC_LIB -DVERSION=\"1.4.0\" -D__STDC_FORMAT_MACROS -O2 -std=c++11 -g -fPIE -I/mesos/build/include -I/mesos/build/include/mesos -I/mesos/build/src -I/mesos/src -isystem /mesos/build/3rdparty/protobuf-2.6.1/src/protobuf-2.6.1-lib/lib/include -isystem /mesos/3rdparty/libprocess/include -isystem /usr/include/apr-1.0 -isystem /mesos/build/3rdparty/boost-1.53.0/src/boost-1.53.0 -isystem /mesos/build/3rdparty/elfio-3.2/src/elfio-3.2 -isystem /mesos/build/3rdparty/glog-0.3.3/src/glog-0.3.3-lib/lib/include -isystem /mesos/build/3rdparty/nvml-352.79/src/nvml-352.79 -isystem /mesos/build/3rdparty/picojson-1.3.0/src/picojson-1.3.0 -isystem /usr/include/subversion-1 -isystem /mesos/3rdparty/stout/include -isystem /mesos/build/3rdparty/http_parser-2.6.2/src/http_parser-2.6.2 -isystem /mesos/build/3rdparty/libev-4.22/src/libev-4.22 -isystem /mesos/build/3rdparty/zookeeper-3.4.8/src/zookeeper-3.4.8/src/c/include -isystem /mesos/build/3rdparty/zookeeper-3.4.8/src/zookeeper-3.4.8/src/c/generated -isystem /mesos/build/3rdparty/leveldb-1.19/src/leveldb-1.19/include -I/mesos/include -isystem /mesos/build/3rdparty/gmock-1.7.0/src/gmock-1.7.0/include -isystem /mesos/build/3rdparty/gmock-1.7.0/src/gmock-1.7.0/gtest/include    -o CMakeFiles/mesos-tests.dir/examples_tests.cpp.o -c /mesos/src/tests/examples_tests.cpp
/usr/bin/cmake -E cmake_progress_report /mesos/build/CMakeFiles 
[ 90%] Building CXX object src/tests/CMakeFiles/mesos-tests.dir/fetcher_cache_tests.cpp.o
cd /mesos/build/src/tests && /usr/bin/g++   -DBUILD_DIR=\"/mesos/build\" -DBUILD_FLAGS=\"\" -DBUILD_JAVA_JVM_LIBRARY=\"\" -DHAS_AUTHENTICATION=1 -DLIBDIR=\"/usr/local/libmesos\" -DPICOJSON_USE_INT64 -DPKGDATADIR=\"/usr/local/share/mesos\" -DPKGLIBEXECDIR=\"/usr/local/libexec/mesos\" -DPKGMODULEDIR=\"\" -DSBINDIR=\"\" -DSOURCE_DIR=\"/mesos\" -DTESTLIBEXECDIR=\"\" -DUSE_CMAKE_BUILD_CONFIG -DUSE_STATIC_LIB -DVERSION=\"1.4.0\" -D__STDC_FORMAT_MACROS -O2 -std=c++11 -g -fPIE -I/mesos/build/include -I/mesos/build/include/mesos -I/mesos/build/src -I/mesos/src -isystem /mesos/build/3rdparty/protobuf-2.6.1/src/protobuf-2.6.1-lib/lib/include -isystem /mesos/3rdparty/libprocess/include -isystem /usr/include/apr-1.0 -isystem /mesos/build/3rdparty/boost-1.53.0/src/boost-1.53.0 -isystem /mesos/build/3rdparty/elfio-3.2/src/elfio-3.2 -isystem /mesos/build/3rdparty/glog-0.3.3/src/glog-0.3.3-lib/lib/include -isystem /mesos/build/3rdparty/nvml-352.79/src/nvml-352.79 -isystem /mesos/build/3rdparty/picojson-1.3.0/src/picojson-1.3.0 -isystem /usr/include/subversion-1 -isystem /mesos/3rdparty/stout/include -isystem /mesos/build/3rdparty/http_parser-2.6.2/src/http_parser-2.6.2 -isystem /mesos/build/3rdparty/libev-4.22/src/libev-4.22 -isystem /mesos/build/3rdparty/zookeeper-3.4.8/src/zookeeper-3.4.8/src/c/include -isystem /mesos/build/3rdparty/zookeeper-3.4.8/src/zookeeper-3.4.8/src/c/generated -isystem /mesos/build/3rdparty/leveldb-1.19/src/leveldb-1.19/include -I/mesos/include -isystem /mesos/build/3rdparty/gmock-1.7.0/src/gmock-1.7.0/include -isystem /mesos/build/3rdparty/gmock-1.7.0/src/gmock-1.7.0/gtest/include    -o CMakeFiles/mesos-tests.dir/fetcher_cache_tests.cpp.o -c /mesos/src/tests/fetcher_cache_tests.cpp
/usr/bin/cmake -E cmake_progress_report /mesos/build/CMakeFiles 
[ 90%] Building CXX object src/tests/CMakeFiles/mesos-tests.dir/hdfs_tests.cpp.o
cd /mesos/build/src/tests && /usr/bin/g++   -DBUILD_DIR=\"/mesos/build\" -DBUILD_FLAGS=\"\" -DBUILD_JAVA_JVM_LIBRARY=\"\" -DHAS_AUTHENTICATION=1 -DLIBDIR=\"/usr/local/libmesos\" -DPICOJSON_USE_INT64 -DPKGDATADIR=\"/usr/local/share/mesos\" -DPKGLIBEXECDIR=\"/usr/local/libexec/mesos\" -DPKGMODULEDIR=\"\" -DSBINDIR=\"\" -DSOURCE_DIR=\"/mesos\" -DTESTLIBEXECDIR=\"\" -DUSE_CMAKE_BUILD_CONFIG -DUSE_STATIC_LIB -DVERSION=\"1.4.0\" -D__STDC_FORMAT_MACROS -O2 -std=c++11 -g -fPIE -I/mesos/build/include -I/mesos/build/include/mesos -I/mesos/build/src -I/mesos/src -isystem /mesos/build/3rdparty/protobuf-2.6.1/src/protobuf-2.6.1-lib/lib/include -isystem /mesos/3rdparty/libprocess/include -isystem /usr/include/apr-1.0 -isystem /mesos/build/3rdparty/boost-1.53.0/src/boost-1.53.0 -isystem /mesos/build/3rdparty/elfio-3.2/src/elfio-3.2 -isystem /mesos/build/3rdparty/glog-0.3.3/src/glog-0.3.3-lib/lib/include -isystem /mesos/build/3rdparty/nvml-352.79/src/nvml-352.79 -isystem /mesos/build/3rdparty/picojson-1.3.0/src/picojson-1.3.0 -isystem /usr/include/subversion-1 -isystem /mesos/3rdparty/stout/include -isystem /mesos/build/3rdparty/http_parser-2.6.2/src/http_parser-2.6.2 -isystem /mesos/build/3rdparty/libev-4.22/src/libev-4.22 -isystem /mesos/build/3rdparty/zookeeper-3.4.8/src/zookeeper-3.4.8/src/c/include -isystem /mesos/build/3rdparty/zookeeper-3.4.8/src/zookeeper-3.4.8/src/c/generated -isystem /mesos/build/3rdparty/leveldb-1.19/src/leveldb-1.19/include -I/mesos/include -isystem /mesos/build/3rdparty/gmock-1.7.0/src/gmock-1.7.0/include -isystem /mesos/build/3rdparty/gmock-1.7.0/src/gmock-1.7.0/gtest/include    -o CMakeFiles/mesos-tests.dir/hdfs_tests.cpp.o -c /mesos/src/tests/hdfs_tests.cpp
/usr/bin/cmake -E cmake_progress_report /mesos/build/CMakeFiles 
[ 90%] Building CXX object src/tests/CMakeFiles/mesos-tests.dir/log_tests.cpp.o
cd /mesos/build/src/tests && /usr/bin/g++   -DBUILD_DIR=\"/mesos/build\" -DBUILD_FLAGS=\"\" -DBUILD_JAVA_JVM_LIBRARY=\"\" -DHAS_AUTHENTICATION=1 -DLIBDIR=\"/usr/local/libmesos\" -DPICOJSON_USE_INT64 -DPKGDATADIR=\"/usr/local/share/mesos\" -DPKGLIBEXECDIR=\"/usr/local/libexec/mesos\" -DPKGMODULEDIR=\"\" -DSBINDIR=\"\" -DSOURCE_DIR=\"/mesos\" -DTESTLIBEXECDIR=\"\" -DUSE_CMAKE_BUILD_CONFIG -DUSE_STATIC_LIB -DVERSION=\"1.4.0\" -D__STDC_FORMAT_MACROS -O2 -std=c++11 -g -fPIE -I/mesos/build/include -I/mesos/build/include/mesos -I/mesos/build/src -I/mesos/src -isystem /mesos/build/3rdparty/protobuf-2.6.1/src/protobuf-2.6.1-lib/lib/include -isystem /mesos/3rdparty/libprocess/include -isystem /usr/include/apr-1.0 -isystem /mesos/build/3rdparty/boost-1.53.0/src/boost-1.53.0 -isystem /mesos/build/3rdparty/elfio-3.2/src/elfio-3.2 -isystem /mesos/build/3rdparty/glog-0.3.3/src/glog-0.3.3-lib/lib/include -isystem /mesos/build/3rdparty/nvml-352.79/src/nvml-352.79 -isystem /mesos/build/3rdparty/picojson-1.3.0/src/picojson-1.3.0 -isystem /usr/include/subversion-1 -isystem /mesos/3rdparty/stout/include -isystem /mesos/build/3rdparty/http_parser-2.6.2/src/http_parser-2.6.2 -isystem /mesos/build/3rdparty/libev-4.22/src/libev-4.22 -isystem /mesos/build/3rdparty/zookeeper-3.4.8/src/zookeeper-3.4.8/src/c/include -isystem /mesos/build/3rdparty/zookeeper-3.4.8/src/zookeeper-3.4.8/src/c/generated -isystem /mesos/build/3rdparty/leveldb-1.19/src/leveldb-1.19/include -I/mesos/include -isystem /mesos/build/3rdparty/gmock-1.7.0/src/gmock-1.7.0/include -isystem /mesos/build/3rdparty/gmock-1.7.0/src/gmock-1.7.0/gtest/include    -o CMakeFiles/mesos-tests.dir/log_tests.cpp.o -c /mesos/src/tests/log_tests.cpp
/usr/bin/cmake -E cmake_progress_report /mesos/build/CMakeFiles 70
[ 91%] Building CXX object src/tests/CMakeFiles/mesos-tests.dir/logging_tests.cpp.o
cd /mesos/build/src/tests && /usr/bin/g++   -DBUILD_DIR=\"/mesos/build\" -DBUILD_FLAGS=\"\" -DBUILD_JAVA_JVM_LIBRARY=\"\" -DHAS_AUTHENTICATION=1 -DLIBDIR=\"/usr/local/libmesos\" -DPICOJSON_USE_INT64 -DPKGDATADIR=\"/usr/local/share/mesos\" -DPKGLIBEXECDIR=\"/usr/local/libexec/mesos\" -DPKGMODULEDIR=\"\" -DSBINDIR=\"\" -DSOURCE_DIR=\"/mesos\" -DTESTLIBEXECDIR=\"\" -DUSE_CMAKE_BUILD_CONFIG -DUSE_STATIC_LIB -DVERSION=\"1.4.0\" -D__STDC_FORMAT_MACROS -O2 -std=c++11 -g -fPIE -I/mesos/build/include -I/mesos/build/include/mesos -I/mesos/build/src -I/mesos/src -isystem /mesos/build/3rdparty/protobuf-2.6.1/src/protobuf-2.6.1-lib/lib/include -isystem /mesos/3rdparty/libprocess/include -isystem /usr/include/apr-1.0 -isystem /mesos/build/3rdparty/boost-1.53.0/src/boost-1.53.0 -isystem /mesos/build/3rdparty/elfio-3.2/src/elfio-3.2 -isystem /mesos/build/3rdparty/glog-0.3.3/src/glog-0.3.3-lib/lib/include -isystem /mesos/build/3rdparty/nvml-352.79/src/nvml-352.79 -isystem /mesos/build/3rdparty/picojson-1.3.0/src/picojson-1.3.0 -isystem /usr/include/subversion-1 -isystem /mesos/3rdparty/stout/include -isystem /mesos/build/3rdparty/http_parser-2.6.2/src/http_parser-2.6.2 -isystem /mesos/build/3rdparty/libev-4.22/src/libev-4.22 -isystem /mesos/build/3rdparty/zookeeper-3.4.8/src/zookeeper-3.4.8/src/c/include -isystem /mesos/build/3rdparty/zookeeper-3.4.8/src/zookeeper-3.4.8/src/c/generated -isystem /mesos/build/3rdparty/leveldb-1.19/src/leveldb-1.19/include -I/mesos/include -isystem /mesos/build/3rdparty/gmock-1.7.0/src/gmock-1.7.0/include -isystem /mesos/build/3rdparty/gmock-1.7.0/src/gmock-1.7.0/gtest/include    -o CMakeFiles/mesos-tests.dir/logging_tests.cpp.o -c /mesos/src/tests/logging_tests.cpp
/usr/bin/cmake -E cmake_progress_report /mesos/build/CMakeFiles 
[ 91%] Building CXX object src/tests/CMakeFiles/mesos-tests.dir/master_allocator_tests.cpp.o
cd /mesos/build/src/tests && /usr/bin/g++   -DBUILD_DIR=\"/mesos/build\" -DBUILD_FLAGS=\"\" -DBUILD_JAVA_JVM_LIBRARY=\"\" -DHAS_AUTHENTICATION=1 -DLIBDIR=\"/usr/local/libmesos\" -DPICOJSON_USE_INT64 -DPKGDATADIR=\"/usr/local/share/mesos\" -DPKGLIBEXECDIR=\"/usr/local/libexec/mesos\" -DPKGMODULEDIR=\"\" -DSBINDIR=\"\" -DSOURCE_DIR=\"/mesos\" -DTESTLIBEXECDIR=\"\" -DUSE_CMAKE_BUILD_CONFIG -DUSE_STATIC_LIB -DVERSION=\"1.4.0\" -D__STDC_FORMAT_MACROS -O2 -std=c++11 -g -fPIE -I/mesos/build/include -I/mesos/build/include/mesos -I/mesos/build/src -I/mesos/src -isystem /mesos/build/3rdparty/protobuf-2.6.1/src/protobuf-2.6.1-lib/lib/include -isystem /mesos/3rdparty/libprocess/include -isystem /usr/include/apr-1.0 -isystem /mesos/build/3rdparty/boost-1.53.0/src/boost-1.53.0 -isystem /mesos/build/3rdparty/elfio-3.2/src/elfio-3.2 -isystem /mesos/build/3rdparty/glog-0.3.3/src/glog-0.3.3-lib/lib/include -isystem /mesos/build/3rdparty/nvml-352.79/src/nvml-352.79 -isystem /mesos/build/3rdparty/picojson-1.3.0/src/picojson-1.3.0 -isystem /usr/include/subversion-1 -isystem /mesos/3rdparty/stout/include -isystem /mesos/build/3rdparty/http_parser-2.6.2/src/http_parser-2.6.2 -isystem /mesos/build/3rdparty/libev-4.22/src/libev-4.22 -isystem /mesos/build/3rdparty/zookeeper-3.4.8/src/zookeeper-3.4.8/src/c/include -isystem /mesos/build/3rdparty/zookeeper-3.4.8/src/zookeeper-3.4.8/src/c/generated -isystem /mesos/build/3rdparty/leveldb-1.19/src/leveldb-1.19/include -I/mesos/include -isystem /mesos/build/3rdparty/gmock-1.7.0/src/gmock-1.7.0/include -isystem /mesos/build/3rdparty/gmock-1.7.0/src/gmock-1.7.0/gtest/include    -o CMakeFiles/mesos-tests.dir/master_allocator_tests.cpp.o -c /mesos/src/tests/master_allocator_tests.cpp
/usr/bin/cmake -E cmake_progress_report /mesos/build/CMakeFiles 
[ 91%] Building CXX object src/tests/CMakeFiles/mesos-tests.dir/master_authorization_tests.cpp.o
cd /mesos/build/src/tests && /usr/bin/g++   -DBUILD_DIR=\"/mesos/build\" -DBUILD_FLAGS=\"\" -DBUILD_JAVA_JVM_LIBRARY=\"\" -DHAS_AUTHENTICATION=1 -DLIBDIR=\"/usr/local/libmesos\" -DPICOJSON_USE_INT64 -DPKGDATADIR=\"/usr/local/share/mesos\" -DPKGLIBEXECDIR=\"/usr/local/libexec/mesos\" -DPKGMODULEDIR=\"\" -DSBINDIR=\"\" -DSOURCE_DIR=\"/mesos\" -DTESTLIBEXECDIR=\"\" -DUSE_CMAKE_BUILD_CONFIG -DUSE_STATIC_LIB -DVERSION=\"1.4.0\" -D__STDC_FORMAT_MACROS -O2 -std=c++11 -g -fPIE -I/mesos/build/include -I/mesos/build/include/mesos -I/mesos/build/src -I/mesos/src -isystem /mesos/build/3rdparty/protobuf-2.6.1/src/protobuf-2.6.1-lib/lib/include -isystem /mesos/3rdparty/libprocess/include -isystem /usr/include/apr-1.0 -isystem /mesos/build/3rdparty/boost-1.53.0/src/boost-1.53.0 -isystem /mesos/build/3rdparty/elfio-3.2/src/elfio-3.2 -isystem /mesos/build/3rdparty/glog-0.3.3/src/glog-0.3.3-lib/lib/include -isystem /mesos/build/3rdparty/nvml-352.79/src/nvml-352.79 -isystem /mesos/build/3rdparty/picojson-1.3.0/src/picojson-1.3.0 -isystem /usr/include/subversion-1 -isystem /mesos/3rdparty/stout/include -isystem /mesos/build/3rdparty/http_parser-2.6.2/src/http_parser-2.6.2 -isystem /mesos/build/3rdparty/libev-4.22/src/libev-4.22 -isystem /mesos/build/3rdparty/zookeeper-3.4.8/src/zookeeper-3.4.8/src/c/include -isystem /mesos/build/3rdparty/zookeeper-3.4.8/src/zookeeper-3.4.8/src/c/generated -isystem /mesos/build/3rdparty/leveldb-1.19/src/leveldb-1.19/include -I/mesos/include -isystem /mesos/build/3rdparty/gmock-1.7.0/src/gmock-1.7.0/include -isystem /mesos/build/3rdparty/gmock-1.7.0/src/gmock-1.7.0/gtest/include    -o CMakeFiles/mesos-tests.dir/master_authorization_tests.cpp.o -c /mesos/src/tests/master_authorization_tests.cpp
/usr/bin/cmake -E cmake_progress_report /mesos/build/CMakeFiles 
[ 91%] Building CXX object src/tests/CMakeFiles/mesos-tests.dir/master_contender_detector_tests.cpp.o
cd /mesos/build/src/tests && /usr/bin/g++   -DBUILD_DIR=\"/mesos/build\" -DBUILD_FLAGS=\"\" -DBUILD_JAVA_JVM_LIBRARY=\"\" -DHAS_AUTHENTICATION=1 -DLIBDIR=\"/usr/local/libmesos\" -DPICOJSON_USE_INT64 -DPKGDATADIR=\"/usr/local/share/mesos\" -DPKGLIBEXECDIR=\"/usr/local/libexec/mesos\" -DPKGMODULEDIR=\"\" -DSBINDIR=\"\" -DSOURCE_DIR=\"/mesos\" -DTESTLIBEXECDIR=\"\" -DUSE_CMAKE_BUILD_CONFIG -DUSE_STATIC_LIB -DVERSION=\"1.4.0\" -D__STDC_FORMAT_MACROS -O2 -std=c++11 -g -fPIE -I/mesos/build/include -I/mesos/build/include/mesos -I/mesos/build/src -I/mesos/src -isystem /mesos/build/3rdparty/protobuf-2.6.1/src/protobuf-2.6.1-lib/lib/include -isystem /mesos/3rdparty/libprocess/include -isystem /usr/include/apr-1.0 -isystem /mesos/build/3rdparty/boost-1.53.0/src/boost-1.53.0 -isystem /mesos/build/3rdparty/elfio-3.2/src/elfio-3.2 -isystem /mesos/build/3rdparty/glog-0.3.3/src/glog-0.3.3-lib/lib/include -isystem /mesos/build/3rdparty/nvml-352.79/src/nvml-352.79 -isystem /mesos/build/3rdparty/picojson-1.3.0/src/picojson-1.3.0 -isystem /usr/include/subversion-1 -isystem /mesos/3rdparty/stout/include -isystem /mesos/build/3rdparty/http_parser-2.6.2/src/http_parser-2.6.2 -isystem /mesos/build/3rdparty/libev-4.22/src/libev-4.22 -isystem /mesos/build/3rdparty/zookeeper-3.4.8/src/zookeeper-3.4.8/src/c/include -isystem /mesos/build/3rdparty/zookeeper-3.4.8/src/zookeeper-3.4.8/src/c/generated -isystem /mesos/build/3rdparty/leveldb-1.19/src/leveldb-1.19/include -I/mesos/include -isystem /mesos/build/3rdparty/gmock-1.7.0/src/gmock-1.7.0/include -isystem /mesos/build/3rdparty/gmock-1.7.0/src/gmock-1.7.0/gtest/include    -o CMakeFiles/mesos-tests.dir/master_contender_detector_tests.cpp.o -c /mesos/src/tests/master_contender_detector_tests.cpp
/usr/bin/cmake -E cmake_progress_report /mesos/build/CMakeFiles 
[ 91%] Building CXX object src/tests/CMakeFiles/mesos-tests.dir/master_quota_tests.cpp.o
cd /mesos/build/src/tests && /usr/bin/g++   -DBUILD_DIR=\"/mesos/build\" -DBUILD_FLAGS=\"\" -DBUILD_JAVA_JVM_LIBRARY=\"\" -DHAS_AUTHENTICATION=1 -DLIBDIR=\"/usr/local/libmesos\" -DPICOJSON_USE_INT64 -DPKGDATADIR=\"/usr/local/share/mesos\" -DPKGLIBEXECDIR=\"/usr/local/libexec/mesos\" -DPKGMODULEDIR=\"\" -DSBINDIR=\"\" -DSOURCE_DIR=\"/mesos\" -DTESTLIBEXECDIR=\"\" -DUSE_CMAKE_BUILD_CONFIG -DUSE_STATIC_LIB -DVERSION=\"1.4.0\" -D__STDC_FORMAT_MACROS -O2 -std=c++11 -g -fPIE -I/mesos/build/include -I/mesos/build/include/mesos -I/mesos/build/src -I/mesos/src -isystem /mesos/build/3rdparty/protobuf-2.6.1/src/protobuf-2.6.1-lib/lib/include -isystem /mesos/3rdparty/libprocess/include -isystem /usr/include/apr-1.0 -isystem /mesos/build/3rdparty/boost-1.53.0/src/boost-1.53.0 -isystem /mesos/build/3rdparty/elfio-3.2/src/elfio-3.2 -isystem /mesos/build/3rdparty/glog-0.3.3/src/glog-0.3.3-lib/lib/include -isystem /mesos/build/3rdparty/nvml-352.79/src/nvml-352.79 -isystem /mesos/build/3rdparty/picojson-1.3.0/src/picojson-1.3.0 -isystem /usr/include/subversion-1 -isystem /mesos/3rdparty/stout/include -isystem /mesos/build/3rdparty/http_parser-2.6.2/src/http_parser-2.6.2 -isystem /mesos/build/3rdparty/libev-4.22/src/libev-4.22 -isystem /mesos/build/3rdparty/zookeeper-3.4.8/src/zookeeper-3.4.8/src/c/include -isystem /mesos/build/3rdparty/zookeeper-3.4.8/src/zookeeper-3.4.8/src/c/generated -isystem /mesos/build/3rdparty/leveldb-1.19/src/leveldb-1.19/include -I/mesos/include -isystem /mesos/build/3rdparty/gmock-1.7.0/src/gmock-1.7.0/include -isystem /mesos/build/3rdparty/gmock-1.7.0/src/gmock-1.7.0/gtest/include    -o CMakeFiles/mesos-tests.dir/master_quota_tests.cpp.o -c /mesos/src/tests/master_quota_tests.cpp
/usr/bin/cmake -E cmake_progress_report /mesos/build/CMakeFiles 
[ 91%] Building CXX object src/tests/CMakeFiles/mesos-tests.dir/master_tests.cpp.o
cd /mesos/build/src/tests && /usr/bin/g++   -DBUILD_DIR=\"/mesos/build\" -DBUILD_FLAGS=\"\" -DBUILD_JAVA_JVM_LIBRARY=\"\" -DHAS_AUTHENTICATION=1 -DLIBDIR=\"/usr/local/libmesos\" -DPICOJSON_USE_INT64 -DPKGDATADIR=\"/usr/local/share/mesos\" -DPKGLIBEXECDIR=\"/usr/local/libexec/mesos\" -DPKGMODULEDIR=\"\" -DSBINDIR=\"\" -DSOURCE_DIR=\"/mesos\" -DTESTLIBEXECDIR=\"\" -DUSE_CMAKE_BUILD_CONFIG -DUSE_STATIC_LIB -DVERSION=\"1.4.0\" -D__STDC_FORMAT_MACROS -O2 -std=c++11 -g -fPIE -I/mesos/build/include -I/mesos/build/include/mesos -I/mesos/build/src -I/mesos/src -isystem /mesos/build/3rdparty/protobuf-2.6.1/src/protobuf-2.6.1-lib/lib/include -isystem /mesos/3rdparty/libprocess/include -isystem /usr/include/apr-1.0 -isystem /mesos/build/3rdparty/boost-1.53.0/src/boost-1.53.0 -isystem /mesos/build/3rdparty/elfio-3.2/src/elfio-3.2 -isystem /mesos/build/3rdparty/glog-0.3.3/src/glog-0.3.3-lib/lib/include -isystem /mesos/build/3rdparty/nvml-352.79/src/nvml-352.79 -isystem /mesos/build/3rdparty/picojson-1.3.0/src/picojson-1.3.0 -isystem /usr/include/subversion-1 -isystem /mesos/3rdparty/stout/include -isystem /mesos/build/3rdparty/http_parser-2.6.2/src/http_parser-2.6.2 -isystem /mesos/build/3rdparty/libev-4.22/src/libev-4.22 -isystem /mesos/build/3rdparty/zookeeper-3.4.8/src/zookeeper-3.4.8/src/c/include -isystem /mesos/build/3rdparty/zookeeper-3.4.8/src/zookeeper-3.4.8/src/c/generated -isystem /mesos/build/3rdparty/leveldb-1.19/src/leveldb-1.19/include -I/mesos/include -isystem /mesos/build/3rdparty/gmock-1.7.0/src/gmock-1.7.0/include -isystem /mesos/build/3rdparty/gmock-1.7.0/src/gmock-1.7.0/gtest/include    -o CMakeFiles/mesos-tests.dir/master_tests.cpp.o -c /mesos/src/tests/master_tests.cpp
/usr/bin/cmake -E cmake_progress_report /mesos/build/CMakeFiles 71
[ 92%] Building CXX object src/tests/CMakeFiles/mesos-tests.dir/master_validation_tests.cpp.o
cd /mesos/build/src/tests && /usr/bin/g++   -DBUILD_DIR=\"/mesos/build\" -DBUILD_FLAGS=\"\" -DBUILD_JAVA_JVM_LIBRARY=\"\" -DHAS_AUTHENTICATION=1 -DLIBDIR=\"/usr/local/libmesos\" -DPICOJSON_USE_INT64 -DPKGDATADIR=\"/usr/local/share/mesos\" -DPKGLIBEXECDIR=\"/usr/local/libexec/mesos\" -DPKGMODULEDIR=\"\" -DSBINDIR=\"\" -DSOURCE_DIR=\"/mesos\" -DTESTLIBEXECDIR=\"\" -DUSE_CMAKE_BUILD_CONFIG -DUSE_STATIC_LIB -DVERSION=\"1.4.0\" -D__STDC_FORMAT_MACROS -O2 -std=c++11 -g -fPIE -I/mesos/build/include -I/mesos/build/include/mesos -I/mesos/build/src -I/mesos/src -isystem /mesos/build/3rdparty/protobuf-2.6.1/src/protobuf-2.6.1-lib/lib/include -isystem /mesos/3rdparty/libprocess/include -isystem /usr/include/apr-1.0 -isystem /mesos/build/3rdparty/boost-1.53.0/src/boost-1.53.0 -isystem /mesos/build/3rdparty/elfio-3.2/src/elfio-3.2 -isystem /mesos/build/3rdparty/glog-0.3.3/src/glog-0.3.3-lib/lib/include -isystem /mesos/build/3rdparty/nvml-352.79/src/nvml-352.79 -isystem /mesos/build/3rdparty/picojson-1.3.0/src/picojson-1.3.0 -isystem /usr/include/subversion-1 -isystem /mesos/3rdparty/stout/include -isystem /mesos/build/3rdparty/http_parser-2.6.2/src/http_parser-2.6.2 -isystem /mesos/build/3rdparty/libev-4.22/src/libev-4.22 -isystem /mesos/build/3rdparty/zookeeper-3.4.8/src/zookeeper-3.4.8/src/c/include -isystem /mesos/build/3rdparty/zookeeper-3.4.8/src/zookeeper-3.4.8/src/c/generated -isystem /mesos/build/3rdparty/leveldb-1.19/src/leveldb-1.19/include -I/mesos/include -isystem /mesos/build/3rdparty/gmock-1.7.0/src/gmock-1.7.0/include -isystem /mesos/build/3rdparty/gmock-1.7.0/src/gmock-1.7.0/gtest/include    -o CMakeFiles/mesos-tests.dir/master_validation_tests.cpp.o -c /mesos/src/tests/master_validation_tests.cpp
/usr/bin/cmake -E cmake_progress_report /mesos/build/CMakeFiles 
[ 92%] Building CXX object src/tests/CMakeFiles/mesos-tests.dir/metrics_tests.cpp.o
cd /mesos/build/src/tests && /usr/bin/g++   -DBUILD_DIR=\"/mesos/build\" -DBUILD_FLAGS=\"\" -DBUILD_JAVA_JVM_LIBRARY=\"\" -DHAS_AUTHENTICATION=1 -DLIBDIR=\"/usr/local/libmesos\" -DPICOJSON_USE_INT64 -DPKGDATADIR=\"/usr/local/share/mesos\" -DPKGLIBEXECDIR=\"/usr/local/libexec/mesos\" -DPKGMODULEDIR=\"\" -DSBINDIR=\"\" -DSOURCE_DIR=\"/mesos\" -DTESTLIBEXECDIR=\"\" -DUSE_CMAKE_BUILD_CONFIG -DUSE_STATIC_LIB -DVERSION=\"1.4.0\" -D__STDC_FORMAT_MACROS -O2 -std=c++11 -g -fPIE -I/mesos/build/include -I/mesos/build/include/mesos -I/mesos/build/src -I/mesos/src -isystem /mesos/build/3rdparty/protobuf-2.6.1/src/protobuf-2.6.1-lib/lib/include -isystem /mesos/3rdparty/libprocess/include -isystem /usr/include/apr-1.0 -isystem /mesos/build/3rdparty/boost-1.53.0/src/boost-1.53.0 -isystem /mesos/build/3rdparty/elfio-3.2/src/elfio-3.2 -isystem /mesos/build/3rdparty/glog-0.3.3/src/glog-0.3.3-lib/lib/include -isystem /mesos/build/3rdparty/nvml-352.79/src/nvml-352.79 -isystem /mesos/build/3rdparty/picojson-1.3.0/src/picojson-1.3.0 -isystem /usr/include/subversion-1 -isystem /mesos/3rdparty/stout/include -isystem /mesos/build/3rdparty/http_parser-2.6.2/src/http_parser-2.6.2 -isystem /mesos/build/3rdparty/libev-4.22/src/libev-4.22 -isystem /mesos/build/3rdparty/zookeeper-3.4.8/src/zookeeper-3.4.8/src/c/include -isystem /mesos/build/3rdparty/zookeeper-3.4.8/src/zookeeper-3.4.8/src/c/generated -isystem /mesos/build/3rdparty/leveldb-1.19/src/leveldb-1.19/include -I/mesos/include -isystem /mesos/build/3rdparty/gmock-1.7.0/src/gmock-1.7.0/include -isystem /mesos/build/3rdparty/gmock-1.7.0/src/gmock-1.7.0/gtest/include    -o CMakeFiles/mesos-tests.dir/metrics_tests.cpp.o -c /mesos/src/tests/metrics_tests.cpp
/usr/bin/cmake -E cmake_progress_report /mesos/build/CMakeFiles 
[ 92%] Building CXX object src/tests/CMakeFiles/mesos-tests.dir/module_tests.cpp.o
cd /mesos/build/src/tests && /usr/bin/g++   -DBUILD_DIR=\"/mesos/build\" -DBUILD_FLAGS=\"\" -DBUILD_JAVA_JVM_LIBRARY=\"\" -DHAS_AUTHENTICATION=1 -DLIBDIR=\"/usr/local/libmesos\" -DPICOJSON_USE_INT64 -DPKGDATADIR=\"/usr/local/share/mesos\" -DPKGLIBEXECDIR=\"/usr/local/libexec/mesos\" -DPKGMODULEDIR=\"\" -DSBINDIR=\"\" -DSOURCE_DIR=\"/mesos\" -DTESTLIBEXECDIR=\"\" -DUSE_CMAKE_BUILD_CONFIG -DUSE_STATIC_LIB -DVERSION=\"1.4.0\" -D__STDC_FORMAT_MACROS -O2 -std=c++11 -g -fPIE -I/mesos/build/include -I/mesos/build/include/mesos -I/mesos/build/src -I/mesos/src -isystem /mesos/build/3rdparty/protobuf-2.6.1/src/protobuf-2.6.1-lib/lib/include -isystem /mesos/3rdparty/libprocess/include -isystem /usr/include/apr-1.0 -isystem /mesos/build/3rdparty/boost-1.53.0/src/boost-1.53.0 -isystem /mesos/build/3rdparty/elfio-3.2/src/elfio-3.2 -isystem /mesos/build/3rdparty/glog-0.3.3/src/glog-0.3.3-lib/lib/include -isystem /mesos/build/3rdparty/nvml-352.79/src/nvml-352.79 -isystem /mesos/build/3rdparty/picojson-1.3.0/src/picojson-1.3.0 -isystem /usr/include/subversion-1 -isystem /mesos/3rdparty/stout/include -isystem /mesos/build/3rdparty/http_parser-2.6.2/src/http_parser-2.6.2 -isystem /mesos/build/3rdparty/libev-4.22/src/libev-4.22 -isystem /mesos/build/3rdparty/zookeeper-3.4.8/src/zookeeper-3.4.8/src/c/include -isystem /mesos/build/3rdparty/zookeeper-3.4.8/src/zookeeper-3.4.8/src/c/generated -isystem /mesos/build/3rdparty/leveldb-1.19/src/leveldb-1.19/include -I/mesos/include -isystem /mesos/build/3rdparty/gmock-1.7.0/src/gmock-1.7.0/include -isystem /mesos/build/3rdparty/gmock-1.7.0/src/gmock-1.7.0/gtest/include    -o CMakeFiles/mesos-tests.dir/module_tests.cpp.o -c /mesos/src/tests/module_tests.cpp
/usr/bin/cmake -E cmake_progress_report /mesos/build/CMakeFiles 
[ 92%] Building CXX object src/tests/CMakeFiles/mesos-tests.dir/oversubscription_tests.cpp.o
cd /mesos/build/src/tests && /usr/bin/g++   -DBUILD_DIR=\"/mesos/build\" -DBUILD_FLAGS=\"\" -DBUILD_JAVA_JVM_LIBRARY=\"\" -DHAS_AUTHENTICATION=1 -DLIBDIR=\"/usr/local/libmesos\" -DPICOJSON_USE_INT64 -DPKGDATADIR=\"/usr/local/share/mesos\" -DPKGLIBEXECDIR=\"/usr/local/libexec/mesos\" -DPKGMODULEDIR=\"\" -DSBINDIR=\"\" -DSOURCE_DIR=\"/mesos\" -DTESTLIBEXECDIR=\"\" -DUSE_CMAKE_BUILD_CONFIG -DUSE_STATIC_LIB -DVERSION=\"1.4.0\" -D__STDC_FORMAT_MACROS -O2 -std=c++11 -g -fPIE -I/mesos/build/include -I/mesos/build/include/mesos -I/mesos/build/src -I/mesos/src -isystem /mesos/build/3rdparty/protobuf-2.6.1/src/protobuf-2.6.1-lib/lib/include -isystem /mesos/3rdparty/libprocess/include -isystem /usr/include/apr-1.0 -isystem /mesos/build/3rdparty/boost-1.53.0/src/boost-1.53.0 -isystem /mesos/build/3rdparty/elfio-3.2/src/elfio-3.2 -isystem /mesos/build/3rdparty/glog-0.3.3/src/glog-0.3.3-lib/lib/include -isystem /mesos/build/3rdparty/nvml-352.79/src/nvml-352.79 -isystem /mesos/build/3rdparty/picojson-1.3.0/src/picojson-1.3.0 -isystem /usr/include/subversion-1 -isystem /mesos/3rdparty/stout/include -isystem /mesos/build/3rdparty/http_parser-2.6.2/src/http_parser-2.6.2 -isystem /mesos/build/3rdparty/libev-4.22/src/libev-4.22 -isystem /mesos/build/3rdparty/zookeeper-3.4.8/src/zookeeper-3.4.8/src/c/include -isystem /mesos/build/3rdparty/zookeeper-3.4.8/src/zookeeper-3.4.8/src/c/generated -isystem /mesos/build/3rdparty/leveldb-1.19/src/leveldb-1.19/include -I/mesos/include -isystem /mesos/build/3rdparty/gmock-1.7.0/src/gmock-1.7.0/include -isystem /mesos/build/3rdparty/gmock-1.7.0/src/gmock-1.7.0/gtest/include    -o CMakeFiles/mesos-tests.dir/oversubscription_tests.cpp.o -c /mesos/src/tests/oversubscription_tests.cpp
/usr/bin/cmake -E cmake_progress_report /mesos/build/CMakeFiles 
[ 92%] Building CXX object src/tests/CMakeFiles/mesos-tests.dir/persistent_volume_endpoints_tests.cpp.o
cd /mesos/build/src/tests && /usr/bin/g++   -DBUILD_DIR=\"/mesos/build\" -DBUILD_FLAGS=\"\" -DBUILD_JAVA_JVM_LIBRARY=\"\" -DHAS_AUTHENTICATION=1 -DLIBDIR=\"/usr/local/libmesos\" -DPICOJSON_USE_INT64 -DPKGDATADIR=\"/usr/local/share/mesos\" -DPKGLIBEXECDIR=\"/usr/local/libexec/mesos\" -DPKGMODULEDIR=\"\" -DSBINDIR=\"\" -DSOURCE_DIR=\"/mesos\" -DTESTLIBEXECDIR=\"\" -DUSE_CMAKE_BUILD_CONFIG -DUSE_STATIC_LIB -DVERSION=\"1.4.0\" -D__STDC_FORMAT_MACROS -O2 -std=c++11 -g -fPIE -I/mesos/build/include -I/mesos/build/include/mesos -I/mesos/build/src -I/mesos/src -isystem /mesos/build/3rdparty/protobuf-2.6.1/src/protobuf-2.6.1-lib/lib/include -isystem /mesos/3rdparty/libprocess/include -isystem /usr/include/apr-1.0 -isystem /mesos/build/3rdparty/boost-1.53.0/src/boost-1.53.0 -isystem /mesos/build/3rdparty/elfio-3.2/src/elfio-3.2 -isystem /mesos/build/3rdparty/glog-0.3.3/src/glog-0.3.3-lib/lib/include -isystem /mesos/build/3rdparty/nvml-352.79/src/nvml-352.79 -isystem /mesos/build/3rdparty/picojson-1.3.0/src/picojson-1.3.0 -isystem /usr/include/subversion-1 -isystem /mesos/3rdparty/stout/include -isystem /mesos/build/3rdparty/http_parser-2.6.2/src/http_parser-2.6.2 -isystem /mesos/build/3rdparty/libev-4.22/src/libev-4.22 -isystem /mesos/build/3rdparty/zookeeper-3.4.8/src/zookeeper-3.4.8/src/c/include -isystem /mesos/build/3rdparty/zookeeper-3.4.8/src/zookeeper-3.4.8/src/c/generated -isystem /mesos/build/3rdparty/leveldb-1.19/src/leveldb-1.19/include -I/mesos/include -isystem /mesos/build/3rdparty/gmock-1.7.0/src/gmock-1.7.0/include -isystem /mesos/build/3rdparty/gmock-1.7.0/src/gmock-1.7.0/gtest/include    -o CMakeFiles/mesos-tests.dir/persistent_volume_endpoints_tests.cpp.o -c /mesos/src/tests/persistent_volume_endpoints_tests.cpp
/usr/bin/cmake -E cmake_progress_report /mesos/build/CMakeFiles 
[ 92%] Building CXX object src/tests/CMakeFiles/mesos-tests.dir/persistent_volume_tests.cpp.o
cd /mesos/build/src/tests && /usr/bin/g++   -DBUILD_DIR=\"/mesos/build\" -DBUILD_FLAGS=\"\" -DBUILD_JAVA_JVM_LIBRARY=\"\" -DHAS_AUTHENTICATION=1 -DLIBDIR=\"/usr/local/libmesos\" -DPICOJSON_USE_INT64 -DPKGDATADIR=\"/usr/local/share/mesos\" -DPKGLIBEXECDIR=\"/usr/local/libexec/mesos\" -DPKGMODULEDIR=\"\" -DSBINDIR=\"\" -DSOURCE_DIR=\"/mesos\" -DTESTLIBEXECDIR=\"\" -DUSE_CMAKE_BUILD_CONFIG -DUSE_STATIC_LIB -DVERSION=\"1.4.0\" -D__STDC_FORMAT_MACROS -O2 -std=c++11 -g -fPIE -I/mesos/build/include -I/mesos/build/include/mesos -I/mesos/build/src -I/mesos/src -isystem /mesos/build/3rdparty/protobuf-2.6.1/src/protobuf-2.6.1-lib/lib/include -isystem /mesos/3rdparty/libprocess/include -isystem /usr/include/apr-1.0 -isystem /mesos/build/3rdparty/boost-1.53.0/src/boost-1.53.0 -isystem /mesos/build/3rdparty/elfio-3.2/src/elfio-3.2 -isystem /mesos/build/3rdparty/glog-0.3.3/src/glog-0.3.3-lib/lib/include -isystem /mesos/build/3rdparty/nvml-352.79/src/nvml-352.79 -isystem /mesos/build/3rdparty/picojson-1.3.0/src/picojson-1.3.0 -isystem /usr/include/subversion-1 -isystem /mesos/3rdparty/stout/include -isystem /mesos/build/3rdparty/http_parser-2.6.2/src/http_parser-2.6.2 -isystem /mesos/build/3rdparty/libev-4.22/src/libev-4.22 -isystem /mesos/build/3rdparty/zookeeper-3.4.8/src/zookeeper-3.4.8/src/c/include -isystem /mesos/build/3rdparty/zookeeper-3.4.8/src/zookeeper-3.4.8/src/c/generated -isystem /mesos/build/3rdparty/leveldb-1.19/src/leveldb-1.19/include -I/mesos/include -isystem /mesos/build/3rdparty/gmock-1.7.0/src/gmock-1.7.0/include -isystem /mesos/build/3rdparty/gmock-1.7.0/src/gmock-1.7.0/gtest/include    -o CMakeFiles/mesos-tests.dir/persistent_volume_tests.cpp.o -c /mesos/src/tests/persistent_volume_tests.cpp
/usr/bin/cmake -E cmake_progress_report /mesos/build/CMakeFiles 72
[ 93%] Building CXX object src/tests/CMakeFiles/mesos-tests.dir/protobuf_utils_tests.cpp.o
cd /mesos/build/src/tests && /usr/bin/g++   -DBUILD_DIR=\"/mesos/build\" -DBUILD_FLAGS=\"\" -DBUILD_JAVA_JVM_LIBRARY=\"\" -DHAS_AUTHENTICATION=1 -DLIBDIR=\"/usr/local/libmesos\" -DPICOJSON_USE_INT64 -DPKGDATADIR=\"/usr/local/share/mesos\" -DPKGLIBEXECDIR=\"/usr/local/libexec/mesos\" -DPKGMODULEDIR=\"\" -DSBINDIR=\"\" -DSOURCE_DIR=\"/mesos\" -DTESTLIBEXECDIR=\"\" -DUSE_CMAKE_BUILD_CONFIG -DUSE_STATIC_LIB -DVERSION=\"1.4.0\" -D__STDC_FORMAT_MACROS -O2 -std=c++11 -g -fPIE -I/mesos/build/include -I/mesos/build/include/mesos -I/mesos/build/src -I/mesos/src -isystem /mesos/build/3rdparty/protobuf-2.6.1/src/protobuf-2.6.1-lib/lib/include -isystem /mesos/3rdparty/libprocess/include -isystem /usr/include/apr-1.0 -isystem /mesos/build/3rdparty/boost-1.53.0/src/boost-1.53.0 -isystem /mesos/build/3rdparty/elfio-3.2/src/elfio-3.2 -isystem /mesos/build/3rdparty/glog-0.3.3/src/glog-0.3.3-lib/lib/include -isystem /mesos/build/3rdparty/nvml-352.79/src/nvml-352.79 -isystem /mesos/build/3rdparty/picojson-1.3.0/src/picojson-1.3.0 -isystem /usr/include/subversion-1 -isystem /mesos/3rdparty/stout/include -isystem /mesos/build/3rdparty/http_parser-2.6.2/src/http_parser-2.6.2 -isystem /mesos/build/3rdparty/libev-4.22/src/libev-4.22 -isystem /mesos/build/3rdparty/zookeeper-3.4.8/src/zookeeper-3.4.8/src/c/include -isystem /mesos/build/3rdparty/zookeeper-3.4.8/src/zookeeper-3.4.8/src/c/generated -isystem /mesos/build/3rdparty/leveldb-1.19/src/leveldb-1.19/include -I/mesos/include -isystem /mesos/build/3rdparty/gmock-1.7.0/src/gmock-1.7.0/include -isystem /mesos/build/3rdparty/gmock-1.7.0/src/gmock-1.7.0/gtest/include    -o CMakeFiles/mesos-tests.dir/protobuf_utils_tests.cpp.o -c /mesos/src/tests/protobuf_utils_tests.cpp
/usr/bin/cmake -E cmake_progress_report /mesos/build/CMakeFiles 
[ 93%] Building CXX object src/tests/CMakeFiles/mesos-tests.dir/reconciliation_tests.cpp.o
cd /mesos/build/src/tests && /usr/bin/g++   -DBUILD_DIR=\"/mesos/build\" -DBUILD_FLAGS=\"\" -DBUILD_JAVA_JVM_LIBRARY=\"\" -DHAS_AUTHENTICATION=1 -DLIBDIR=\"/usr/local/libmesos\" -DPICOJSON_USE_INT64 -DPKGDATADIR=\"/usr/local/share/mesos\" -DPKGLIBEXECDIR=\"/usr/local/libexec/mesos\" -DPKGMODULEDIR=\"\" -DSBINDIR=\"\" -DSOURCE_DIR=\"/mesos\" -DTESTLIBEXECDIR=\"\" -DUSE_CMAKE_BUILD_CONFIG -DUSE_STATIC_LIB -DVERSION=\"1.4.0\" -D__STDC_FORMAT_MACROS -O2 -std=c++11 -g -fPIE -I/mesos/build/include -I/mesos/build/include/mesos -I/mesos/build/src -I/mesos/src -isystem /mesos/build/3rdparty/protobuf-2.6.1/src/protobuf-2.6.1-lib/lib/include -isystem /mesos/3rdparty/libprocess/include -isystem /usr/include/apr-1.0 -isystem /mesos/build/3rdparty/boost-1.53.0/src/boost-1.53.0 -isystem /mesos/build/3rdparty/elfio-3.2/src/elfio-3.2 -isystem /mesos/build/3rdparty/glog-0.3.3/src/glog-0.3.3-lib/lib/include -isystem /mesos/build/3rdparty/nvml-352.79/src/nvml-352.79 -isystem /mesos/build/3rdparty/picojson-1.3.0/src/picojson-1.3.0 -isystem /usr/include/subversion-1 -isystem /mesos/3rdparty/stout/include -isystem /mesos/build/3rdparty/http_parser-2.6.2/src/http_parser-2.6.2 -isystem /mesos/build/3rdparty/libev-4.22/src/libev-4.22 -isystem /mesos/build/3rdparty/zookeeper-3.4.8/src/zookeeper-3.4.8/src/c/include -isystem /mesos/build/3rdparty/zookeeper-3.4.8/src/zookeeper-3.4.8/src/c/generated -isystem /mesos/build/3rdparty/leveldb-1.19/src/leveldb-1.19/include -I/mesos/include -isystem /mesos/build/3rdparty/gmock-1.7.0/src/gmock-1.7.0/include -isystem /mesos/build/3rdparty/gmock-1.7.0/src/gmock-1.7.0/gtest/include    -o CMakeFiles/mesos-tests.dir/reconciliation_tests.cpp.o -c /mesos/src/tests/reconciliation_tests.cpp
In file included from /mesos/build/3rdparty/gmock-1.7.0/src/gmock-1.7.0/gtest/include/gtest/gtest.h:58:0,
                 from /mesos/build/3rdparty/gmock-1.7.0/src/gmock-1.7.0/include/gmock/internal/gmock-internal-utils.h:47,
                 from /mesos/build/3rdparty/gmock-1.7.0/src/gmock-1.7.0/include/gmock/gmock-actions.h:46,
                 from /mesos/build/3rdparty/gmock-1.7.0/src/gmock-1.7.0/include/gmock/gmock.h:58,
                 from /mesos/src/tests/persistent_volume_tests.cpp:21:
/mesos/src/tests/persistent_volume_tests.cpp:1374:8: error: redefinition of 'class mesos::internal::tests::PersistentVolumeTest_SharedPersistentVolumeMultipleFrameworks_Test'
 TEST_P(PersistentVolumeTest, SharedPersistentVolumeMultipleFrameworks)
        ^
/mesos/src/tests/persistent_volume_tests.cpp:1194:8: error: previous definition of 'class mesos::internal::tests::PersistentVolumeTest_SharedPersistentVolumeMultipleFrameworks_Test'
 TEST_P(PersistentVolumeTest, SharedPersistentVolumeMultipleFrameworks)
        ^
In file included from /mesos/build/3rdparty/gmock-1.7.0/src/gmock-1.7.0/gtest/include/gtest/gtest.h:62:0,
                 from /mesos/build/3rdparty/gmock-1.7.0/src/gmock-1.7.0/include/gmock/internal/gmock-internal-utils.h:47,
                 from /mesos/build/3rdparty/gmock-1.7.0/src/gmock-1.7.0/include/gmock/gmock-actions.h:46,
                 from /mesos/build/3rdparty/gmock-1.7.0/src/gmock-1.7.0/include/gmock/gmock.h:58,
                 from /mesos/src/tests/persistent_volume_tests.cpp:21:
/mesos/src/tests/persistent_volume_tests.cpp:1374:1: error: redefinition of 'int mesos::internal::tests::PersistentVolumeTest_SharedPersistentVolumeMultipleFrameworks_Test::gtest_registering_dummy_'
 TEST_P(PersistentVolumeTest, SharedPersistentVolumeMultipleFrameworks)
 ^
In file included from /mesos/build/3rdparty/gmock-1.7.0/src/gmock-1.7.0/gtest/include/gtest/gtest.h:58:0,
                 from /mesos/build/3rdparty/gmock-1.7.0/src/gmock-1.7.0/include/gmock/internal/gmock-internal-utils.h:47,
                 from /mesos/build/3rdparty/gmock-1.7.0/src/gmock-1.7.0/include/gmock/gmock-actions.h:46,
                 from /mesos/build/3rdparty/gmock-1.7.0/src/gmock-1.7.0/include/gmock/gmock.h:58,
                 from /mesos/src/tests/persistent_volume_tests.cpp:21:
/mesos/src/tests/persistent_volume_tests.cpp:1194:8: error: 'int mesos::internal::tests::PersistentVolumeTest_SharedPersistentVolumeMultipleFrameworks_Test::gtest_registering_dummy_' previously declared here
 TEST_P(PersistentVolumeTest, SharedPersistentVolumeMultipleFrameworks)
        ^
/mesos/src/tests/persistent_volume_tests.cpp:1374:8: error: redefinition of 'void mesos::internal::tests::PersistentVolumeTest_SharedPersistentVolumeMultipleFrameworks_Test::TestBody()'
 TEST_P(PersistentVolumeTest, SharedPersistentVolumeMultipleFrameworks)
        ^
/mesos/src/tests/persistent_volume_tests.cpp:1194:8: error: 'virtual void mesos::internal::tests::PersistentVolumeTest_SharedPersistentVolumeMultipleFrameworks_Test::TestBody()' previously defined here
 TEST_P(PersistentVolumeTest, SharedPersistentVolumeMultipleFrameworks)
        ^
make[3]: *** [src/tests/CMakeFiles/mesos-tests.dir/persistent_volume_tests.cpp.o] Error 1
make[3]: *** Waiting for unfinished jobs....
make[3]: Leaving directory `/mesos/build'
make[2]: *** [src/tests/CMakeFiles/mesos-tests.dir/all] Error 2
make[2]: Leaving directory `/mesos/build'
make[1]: *** [CMakeFiles/check.dir/rule] Error 2
make[1]: Leaving directory `/mesos/build'
make: *** [check] Error 2
+ docker rmi mesos-1493803349-31419
Untagged: mesos-1493803349-31419:latest
Deleted: sha256:cc94cd512fb6a01542d30385e61e90374ed505306e2564589475fbdfddadd713
Deleted: sha256:e857b7791001894ed4204681d074aafa5803675ce1cba937d18830f39a3f0ff6
Deleted: sha256:a34a358c2864abe6060389bffd05cca974bd4970940a8666f3589e8fd5bcc980
Deleted: sha256:770292d41344cb8e0c2f28e2c0f242906fcdc58e4342de9fa8351b4d4cdafe1d
Deleted: sha256:bb4d86cd62a8220d5542890448a845ca8875b73bc60ae96ff5070afa2d6a6177
Deleted: sha256:a010ec2658bd6e0fd0057959f42c98a999c2d2cceab1681d041215c224a13cc6
Deleted: sha256:c58eca9315ce1c5360128ab2e933935dcedf2a504d57bfe8e7ffbe56e83e31dc
Deleted: sha256:f228b3c4db8f92d74bce76ae50f7e4dfccce2eff0e95b3228966f558704d85ba
Deleted: sha256:52a8a116223a73b01d9a7ed25215f592f5d5b7a289414adee6c9a810e11aa629
Deleted: sha256:7f300534fff5147c416f797f809b7d304f518937240c985c22d98a152a75db94
Deleted: sha256:1e8e44e5c35e34ffa7b6fc47388bd4d386128fa69b8324eb6b268cffaff2522a
Deleted: sha256:e7c32f6acb2b63b6656c26e281b63d5898fba41a768afb8ec9cf5f0132f4b0ac
Deleted: sha256:bc8bf1187db50fd2244f9504190170ed8e53911be85d26974600daea614fe5f8
Deleted: sha256:d40b0ae34267da26b1f2498d185ebbe096819f6328abd2c8de98a33a83ca0197
Deleted: sha256:8995fa3d8dc509eba9ce90fbe80f657f97519850cb5cac07819668b3f379ea42
Deleted: sha256:e9f396c78f8b156c8012a05e53c6079e44b87bb879ae8bc611fa83a6c635082f
Deleted: sha256:a4ce07ae58bfacdf90b45f38cc9d78c70e2e7fd8a8d7e31ad0911f7bc8ca95bc
Deleted: sha256:dd9ea5aeadeb5a4a4bf45e91736568d418fbe5300787a1a6cec978e66bac1d21
Deleted: sha256:8f8a319a5ca13c7f95c500016004f35be86e746a952e2a7119d5c7511ed76fd6
Deleted: sha256:2da57754f409bc18ca05021ecf3ab5fbe3e3bd382a8cb24619b23da726abefcb
Deleted: sha256:92dbdc52b6a2ae710865a8e7ed66a38b5434a15ee658c5b889a6b9ea27cd8a3a
Deleted: sha256:21b517993273058c337d0ca35faaedd22a6532f65352035475abbb2d6576032e
Deleted: sha256:06df38da034b2ef65ddb82d7cfe8669be5c35eb3b602b3962d625a11111aba62
Deleted: sha256:bd70c62bcf804aee7b7a7d8a3efac58eb676009c45000e5dd6377589c9f6dfbd
Build step 'Execute shell' marked build as failure
Not sending mail to unregistered user xujyan@apple.com

Mime
View raw message