mesos-builds mailing list archives

Site index · List index
Message view « Date » · « Thread »
Top « Date » · « Thread »
From Apache Jenkins Server <jenk...@builds.apache.org>
Subject Build failed in Jenkins: Mesos-Buildbot » autotools,clang,--verbose,GLOG_v=1 MESOS_VERBOSE=1,ubuntu:14.04,(docker||Hadoop)&&(!ubuntu-us1)&&(!ubuntu-eu2) #3661
Date Thu, 11 May 2017 20:38:17 GMT
See <https://builds.apache.org/job/Mesos-Buildbot/BUILDTOOL=autotools,COMPILER=clang,CONFIGURATION=--verbose,ENVIRONMENT=GLOG_v=1%20MESOS_VERBOSE=1,OS=ubuntu%3A14.04,label_exp=(docker%7C%7CHadoop)&&(!ubuntu-us1)&&(!ubuntu-eu2)/3661/display/redirect?page=changes>

Changes:

[neil.conway] Adjusted test expectation for change to stout's Version.

[neil.conway] Added another test case for Docker version parsing.

------------------------------------------
[...truncated 27.30 MB...]
[ RUN      ] Endpoint/SlaveEndpointTest.AuthorizedRequest/2
I0511 20:37:47.459338 29117 containerizer.cpp:221] Using isolation: posix/cpu,posix/mem,filesystem/posix,network/cni
W0511 20:37:47.459846 29117 backend.cpp:76] Failed to create 'aufs' backend: AufsBackend requires
root privileges
W0511 20:37:47.459940 29117 backend.cpp:76] Failed to create 'bind' backend: BindBackend requires
root privileges
I0511 20:37:47.459977 29117 provisioner.cpp:249] Using default backend 'copy'
I0511 20:37:47.462826 29139 slave.cpp:225] Mesos agent started on (751)@172.17.0.2:35483
I0511 20:37:47.462862 29139 slave.cpp:226] Flags at startup: --acls="" --appc_simple_discovery_uri_prefix="http://"
--appc_store_dir="/tmp/mesos/store/appc" --authenticate_http_readonly="true" --authenticate_http_readwrite="true"
--authenticatee="crammd5" --authentication_backoff_factor="1secs" --authorizer="local" --cgroups_cpu_enable_pids_and_tids_count="false"
--cgroups_enable_cfs="false" --cgroups_hierarchy="/sys/fs/cgroup" --cgroups_limit_swap="false"
--cgroups_root="mesos" --container_disk_watch_interval="15secs" --containerizers="mesos" --credential="/tmp/Endpoint_SlaveEndpointTest_AuthorizedRequest_2_TQUiln/credential"
--default_role="*" --disk_watch_interval="1mins" --docker="docker" --docker_kill_orphans="true"
--docker_registry="https://registry-1.docker.io" --docker_remove_delay="6hrs" --docker_socket="/var/run/docker.sock"
--docker_stop_timeout="0ns" --docker_store_dir="/tmp/mesos/store/docker" --docker_volume_checkpoint_dir="/var/run/mesos/isolators/docker/volume"
--enforce_container_disk_quota="false" --executor_registration_timeout="1mins" --executor_shutdown_grace_period="5secs"
--fetcher_cache_dir="/tmp/Endpoint_SlaveEndpointTest_AuthorizedRequest_2_TQUiln/fetch" --fetcher_cache_size="2GB"
--frameworks_home="" --gc_delay="1weeks" --gc_disk_headroom="0.1" --hadoop_home="" --help="false"
--hostname_lookup="true" --http_command_executor="false" --http_credentials="/tmp/Endpoint_SlaveEndpointTest_AuthorizedRequest_2_TQUiln/http_credentials"
--http_heartbeat_interval="30secs" --initialize_driver_logging="true" --isolation="posix/cpu,posix/mem"
--launcher="posix" --launcher_dir="/mesos/mesos-1.4.0/_build/src" --logbufsecs="0" --logging_level="INFO"
--max_completed_executors_per_framework="150" --oversubscribed_resources_interval="15secs"
--perf_duration="10secs" --perf_interval="1mins" --port="5051" --qos_correction_interval_min="0ns"
--quiet="false" --recover="reconnect" --recovery_timeout="15mins" --registration_backoff_factor="10ms"
--resources="cpus:2;gpus:0;mem:1024;disk:1024;ports:[31000-32000]" --revocable_cpu_low_priority="true"
--runtime_dir="/tmp/Endpoint_SlaveEndpointTest_AuthorizedRequest_2_TQUiln" --sandbox_directory="/mnt/mesos/sandbox"
--strict="true" --switch_user="true" --systemd_enable_support="true" --systemd_runtime_directory="/run/systemd/system"
--version="false" --work_dir="/tmp/Endpoint_SlaveEndpointTest_AuthorizedRequest_2_49gGp5"
I0511 20:37:47.463340 29139 credentials.hpp:86] Loading credential for authentication from
'/tmp/Endpoint_SlaveEndpointTest_AuthorizedRequest_2_TQUiln/credential'
I0511 20:37:47.463462 29139 slave.cpp:258] Agent using credential for: test-principal
I0511 20:37:47.463481 29139 credentials.hpp:37] Loading credentials for authentication from
'/tmp/Endpoint_SlaveEndpointTest_AuthorizedRequest_2_TQUiln/http_credentials'
I0511 20:37:47.463745 29139 http.cpp:975] Creating default 'basic' HTTP authenticator for
realm 'mesos-agent-readonly'
I0511 20:37:47.463930 29139 http.cpp:975] Creating default 'basic' HTTP authenticator for
realm 'mesos-agent-readwrite'
I0511 20:37:47.465649 29139 slave.cpp:525] Agent resources: cpus(*):2; mem(*):1024; disk(*):1024;
ports(*):[31000-32000]
I0511 20:37:47.465744 29139 slave.cpp:533] Agent attributes: [  ]
I0511 20:37:47.465759 29139 slave.cpp:538] Agent hostname: 31f610681184
I0511 20:37:47.465965 29146 status_update_manager.cpp:177] Pausing sending status updates
I0511 20:37:47.467492 29144 state.cpp:62] Recovering state from '/tmp/Endpoint_SlaveEndpointTest_AuthorizedRequest_2_49gGp5/meta'
I0511 20:37:47.467926 29139 status_update_manager.cpp:203] Recovering status update manager
I0511 20:37:47.468299 29136 containerizer.cpp:608] Recovering containerizer
I0511 20:37:47.470302 29146 provisioner.cpp:410] Provisioner recovery complete
I0511 20:37:47.471043 29136 slave.cpp:5970] Finished recovery
I0511 20:37:47.471582 29136 slave.cpp:6152] Querying resource estimator for oversubscribable
resources
I0511 20:37:47.472000 29149 slave.cpp:6166] Received oversubscribable resources {} from the
resource estimator
I0511 20:37:47.474637 29143 process.cpp:3730] Handling HTTP event for process 'slave(751)'
with path: '/slave(751)/containers'
I0511 20:37:47.476127 29149 http.cpp:1115] HTTP GET for /slave(751)/containers from 172.17.0.2:55309
I0511 20:37:47.476207 29149 http.cpp:936] Authorizing principal 'test-principal' to GET the
'/containers' endpoint
I0511 20:37:47.480700 29138 slave.cpp:790] Agent terminating
[       OK ] Endpoint/SlaveEndpointTest.AuthorizedRequest/2 (31 ms)
[ RUN      ] Endpoint/SlaveEndpointTest.UnauthorizedRequest/0
I0511 20:37:47.490222 29117 containerizer.cpp:221] Using isolation: posix/cpu,posix/mem,filesystem/posix,network/cni
W0511 20:37:47.490665 29117 backend.cpp:76] Failed to create 'aufs' backend: AufsBackend requires
root privileges
W0511 20:37:47.490767 29117 backend.cpp:76] Failed to create 'bind' backend: BindBackend requires
root privileges
I0511 20:37:47.490799 29117 provisioner.cpp:249] Using default backend 'copy'
I0511 20:37:47.493857 29148 slave.cpp:225] Mesos agent started on (752)@172.17.0.2:35483
I0511 20:37:47.493942 29148 slave.cpp:226] Flags at startup: --acls="" --appc_simple_discovery_uri_prefix="http://"
--appc_store_dir="/tmp/mesos/store/appc" --authenticate_http_readonly="true" --authenticate_http_readwrite="true"
--authenticatee="crammd5" --authentication_backoff_factor="1secs" --authorizer="local" --cgroups_cpu_enable_pids_and_tids_count="false"
--cgroups_enable_cfs="false" --cgroups_hierarchy="/sys/fs/cgroup" --cgroups_limit_swap="false"
--cgroups_root="mesos" --container_disk_watch_interval="15secs" --containerizers="mesos" --credential="/tmp/Endpoint_SlaveEndpointTest_UnauthorizedRequest_0_xkh9kx/credential"
--default_role="*" --disk_watch_interval="1mins" --docker="docker" --docker_kill_orphans="true"
--docker_registry="https://registry-1.docker.io" --docker_remove_delay="6hrs" --docker_socket="/var/run/docker.sock"
--docker_stop_timeout="0ns" --docker_store_dir="/tmp/mesos/store/docker" --docker_volume_checkpoint_dir="/var/run/mesos/isolators/docker/volume"
--enforce_container_disk_quota="false" --executor_registration_timeout="1mins" --executor_shutdown_grace_period="5secs"
--fetcher_cache_dir="/tmp/Endpoint_SlaveEndpointTest_UnauthorizedRequest_0_xkh9kx/fetch" --fetcher_cache_size="2GB"
--frameworks_home="" --gc_delay="1weeks" --gc_disk_headroom="0.1" --hadoop_home="" --help="false"
--hostname_lookup="true" --http_command_executor="false" --http_credentials="/tmp/Endpoint_SlaveEndpointTest_UnauthorizedRequest_0_xkh9kx/http_credentials"
--http_heartbeat_interval="30secs" --initialize_driver_logging="true" --isolation="posix/cpu,posix/mem"
--launcher="posix" --launcher_dir="/mesos/mesos-1.4.0/_build/src" --logbufsecs="0" --logging_level="INFO"
--max_completed_executors_per_framework="150" --oversubscribed_resources_interval="15secs"
--perf_duration="10secs" --perf_interval="1mins" --port="5051" --qos_correction_interval_min="0ns"
--quiet="false" --recover="reconnect" --recovery_timeout="15mins" --registration_backoff_factor="10ms"
--resources="cpus:2;gpus:0;mem:1024;disk:1024;ports:[31000-32000]" --revocable_cpu_low_priority="true"
--runtime_dir="/tmp/Endpoint_SlaveEndpointTest_UnauthorizedRequest_0_xkh9kx" --sandbox_directory="/mnt/mesos/sandbox"
--strict="true" --switch_user="true" --systemd_enable_support="true" --systemd_runtime_directory="/run/systemd/system"
--version="false" --work_dir="/tmp/Endpoint_SlaveEndpointTest_UnauthorizedRequest_0_E9Hqkf"
I0511 20:37:47.494532 29148 credentials.hpp:86] Loading credential for authentication from
'/tmp/Endpoint_SlaveEndpointTest_UnauthorizedRequest_0_xkh9kx/credential'
I0511 20:37:47.494763 29148 slave.cpp:258] Agent using credential for: test-principal
I0511 20:37:47.494797 29148 credentials.hpp:37] Loading credentials for authentication from
'/tmp/Endpoint_SlaveEndpointTest_UnauthorizedRequest_0_xkh9kx/http_credentials'
I0511 20:37:47.495092 29148 http.cpp:975] Creating default 'basic' HTTP authenticator for
realm 'mesos-agent-readonly'
I0511 20:37:47.495298 29148 http.cpp:975] Creating default 'basic' HTTP authenticator for
realm 'mesos-agent-readwrite'
I0511 20:37:47.496958 29148 slave.cpp:525] Agent resources: cpus(*):2; mem(*):1024; disk(*):1024;
ports(*):[31000-32000]
I0511 20:37:47.497054 29148 slave.cpp:533] Agent attributes: [  ]
I0511 20:37:47.497071 29148 slave.cpp:538] Agent hostname: 31f610681184
I0511 20:37:47.497282 29137 status_update_manager.cpp:177] Pausing sending status updates
I0511 20:37:47.498955 29135 state.cpp:62] Recovering state from '/tmp/Endpoint_SlaveEndpointTest_UnauthorizedRequest_0_E9Hqkf/meta'
I0511 20:37:47.499467 29148 status_update_manager.cpp:203] Recovering status update manager
I0511 20:37:47.499728 29147 containerizer.cpp:608] Recovering containerizer
I0511 20:37:47.501680 29135 provisioner.cpp:410] Provisioner recovery complete
I0511 20:37:47.502063 29146 slave.cpp:5970] Finished recovery
I0511 20:37:47.502737 29146 slave.cpp:6152] Querying resource estimator for oversubscribable
resources
I0511 20:37:47.503119 29147 slave.cpp:6166] Received oversubscribable resources {} from the
resource estimator
I0511 20:37:47.505949 29141 process.cpp:3730] Handling HTTP event for process 'slave(752)'
with path: '/slave(752)/monitor/statistics'
I0511 20:37:47.507573 29137 http.cpp:1115] HTTP GET for /slave(752)/monitor/statistics from
172.17.0.2:55310
I0511 20:37:47.507660 29137 http.cpp:936] Authorizing principal 'test-principal' to GET the
'/monitor/statistics' endpoint
I0511 20:37:47.510839 29137 slave.cpp:790] Agent terminating
[       OK ] Endpoint/SlaveEndpointTest.UnauthorizedRequest/0 (30 ms)
[ RUN      ] Endpoint/SlaveEndpointTest.UnauthorizedRequest/1
I0511 20:37:47.522249 29117 containerizer.cpp:221] Using isolation: posix/cpu,posix/mem,filesystem/posix,network/cni
W0511 20:37:47.522835 29117 backend.cpp:76] Failed to create 'aufs' backend: AufsBackend requires
root privileges
W0511 20:37:47.522958 29117 backend.cpp:76] Failed to create 'bind' backend: BindBackend requires
root privileges
I0511 20:37:47.523000 29117 provisioner.cpp:249] Using default backend 'copy'
I0511 20:37:47.526722 29143 slave.cpp:225] Mesos agent started on (753)@172.17.0.2:35483
I0511 20:37:47.526762 29143 slave.cpp:226] Flags at startup: --acls="" --appc_simple_discovery_uri_prefix="http://"
--appc_store_dir="/tmp/mesos/store/appc" --authenticate_http_readonly="true" --authenticate_http_readwrite="true"
--authenticatee="crammd5" --authentication_backoff_factor="1secs" --authorizer="local" --cgroups_cpu_enable_pids_and_tids_count="false"
--cgroups_enable_cfs="false" --cgroups_hierarchy="/sys/fs/cgroup" --cgroups_limit_swap="false"
--cgroups_root="mesos" --container_disk_watch_interval="15secs" --containerizers="mesos" --credential="/tmp/Endpoint_SlaveEndpointTest_UnauthorizedRequest_1_Hsx9EH/credential"
--default_role="*" --disk_watch_interval="1mins" --docker="docker" --docker_kill_orphans="true"
--docker_registry="https://registry-1.docker.io" --docker_remove_delay="6hrs" --docker_socket="/var/run/docker.sock"
--docker_stop_timeout="0ns" --docker_store_dir="/tmp/mesos/store/docker" --docker_volume_checkpoint_dir="/var/run/mesos/isolators/docker/volume"
--enforce_container_disk_quota="false" --executor_registration_timeout="1mins" --executor_shutdown_grace_period="5secs"
--fetcher_cache_dir="/tmp/Endpoint_SlaveEndpointTest_UnauthorizedRequest_1_Hsx9EH/fetch" --fetcher_cache_size="2GB"
--frameworks_home="" --gc_delay="1weeks" --gc_disk_headroom="0.1" --hadoop_home="" --help="false"
--hostname_lookup="true" --http_command_executor="false" --http_credentials="/tmp/Endpoint_SlaveEndpointTest_UnauthorizedRequest_1_Hsx9EH/http_credentials"
--http_heartbeat_interval="30secs" --initialize_driver_logging="true" --isolation="posix/cpu,posix/mem"
--launcher="posix" --launcher_dir="/mesos/mesos-1.4.0/_build/src" --logbufsecs="0" --logging_level="INFO"
--max_completed_executors_per_framework="150" --oversubscribed_resources_interval="15secs"
--perf_duration="10secs" --perf_interval="1mins" --port="5051" --qos_correction_interval_min="0ns"
--quiet="false" --recover="reconnect" --recovery_timeout="15mins" --registration_backoff_factor="10ms"
--resources="cpus:2;gpus:0;mem:1024;disk:1024;ports:[31000-32000]" --revocable_cpu_low_priority="true"
--runtime_dir="/tmp/Endpoint_SlaveEndpointTest_UnauthorizedRequest_1_Hsx9EH" --sandbox_directory="/mnt/mesos/sandbox"
--strict="true" --switch_user="true" --systemd_enable_support="true" --systemd_runtime_directory="/run/systemd/system"
--version="false" --work_dir="/tmp/Endpoint_SlaveEndpointTest_UnauthorizedRequest_1_AGKmzp"
I0511 20:37:47.527181 29143 credentials.hpp:86] Loading credential for authentication from
'/tmp/Endpoint_SlaveEndpointTest_UnauthorizedRequest_1_Hsx9EH/credential'
I0511 20:37:47.527360 29143 slave.cpp:258] Agent using credential for: test-principal
I0511 20:37:47.527386 29143 credentials.hpp:37] Loading credentials for authentication from
'/tmp/Endpoint_SlaveEndpointTest_UnauthorizedRequest_1_Hsx9EH/http_credentials'
I0511 20:37:47.527657 29143 http.cpp:975] Creating default 'basic' HTTP authenticator for
realm 'mesos-agent-readonly'
I0511 20:37:47.527838 29143 http.cpp:975] Creating default 'basic' HTTP authenticator for
realm 'mesos-agent-readwrite'
I0511 20:37:47.529441 29143 slave.cpp:525] Agent resources: cpus(*):2; mem(*):1024; disk(*):1024;
ports(*):[31000-32000]
I0511 20:37:47.529538 29143 slave.cpp:533] Agent attributes: [  ]
I0511 20:37:47.529552 29143 slave.cpp:538] Agent hostname: 31f610681184
I0511 20:37:47.529726 29144 status_update_manager.cpp:177] Pausing sending status updates
I0511 20:37:47.531072 29142 state.cpp:62] Recovering state from '/tmp/Endpoint_SlaveEndpointTest_UnauthorizedRequest_1_AGKmzp/meta'
I0511 20:37:47.531389 29137 status_update_manager.cpp:203] Recovering status update manager
I0511 20:37:47.531622 29144 containerizer.cpp:608] Recovering containerizer
I0511 20:37:47.533169 29140 provisioner.cpp:410] Provisioner recovery complete
I0511 20:37:47.533871 29138 slave.cpp:5970] Finished recovery
I0511 20:37:47.534670 29138 slave.cpp:6152] Querying resource estimator for oversubscribable
resources
I0511 20:37:47.535014 29147 slave.cpp:6166] Received oversubscribable resources {} from the
resource estimator
I0511 20:37:47.537564 29142 process.cpp:3730] Handling HTTP event for process 'slave(753)'
with path: '/slave(753)/monitor/statistics.json'
I0511 20:37:47.538967 29143 http.cpp:1115] HTTP GET for /slave(753)/monitor/statistics.json
from 172.17.0.2:55311
I0511 20:37:47.539057 29143 http.cpp:936] Authorizing principal 'test-principal' to GET the
'/monitor/statistics.json' endpoint
I0511 20:37:47.541636 29142 slave.cpp:790] Agent terminating
[       OK ] Endpoint/SlaveEndpointTest.UnauthorizedRequest/1 (31 ms)
[ RUN      ] Endpoint/SlaveEndpointTest.UnauthorizedRequest/2
I0511 20:37:47.553553 29117 containerizer.cpp:221] Using isolation: posix/cpu,posix/mem,filesystem/posix,network/cni
W0511 20:37:47.554131 29117 backend.cpp:76] Failed to create 'aufs' backend: AufsBackend requires
root privileges
W0511 20:37:47.554260 29117 backend.cpp:76] Failed to create 'bind' backend: BindBackend requires
root privileges
I0511 20:37:47.554311 29117 provisioner.cpp:249] Using default backend 'copy'
I0511 20:37:47.557790 29144 slave.cpp:225] Mesos agent started on (754)@172.17.0.2:35483
I0511 20:37:47.557829 29144 slave.cpp:226] Flags at startup: --acls="" --appc_simple_discovery_uri_prefix="http://"
--appc_store_dir="/tmp/mesos/store/appc" --authenticate_http_readonly="true" --authenticate_http_readwrite="true"
--authenticatee="crammd5" --authentication_backoff_factor="1secs" --authorizer="local" --cgroups_cpu_enable_pids_and_tids_count="false"
--cgroups_enable_cfs="false" --cgroups_hierarchy="/sys/fs/cgroup" --cgroups_limit_swap="false"
--cgroups_root="mesos" --container_disk_watch_interval="15secs" --containerizers="mesos" --credential="/tmp/Endpoint_SlaveEndpointTest_UnauthorizedRequest_2_BKICjS/credential"
--default_role="*" --disk_watch_interval="1mins" --docker="docker" --docker_kill_orphans="true"
--docker_registry="https://registry-1.docker.io" --docker_remove_delay="6hrs" --docker_socket="/var/run/docker.sock"
--docker_stop_timeout="0ns" --docker_store_dir="/tmp/mesos/store/docker" --docker_volume_checkpoint_dir="/var/run/mesos/isolators/docker/volume"
--enforce_container_disk_quota="false" --executor_registration_timeout="1mins" --executor_shutdown_grace_period="5secs"
--fetcher_cache_dir="/tmp/Endpoint_SlaveEndpointTest_UnauthorizedRequest_2_BKICjS/fetch" --fetcher_cache_size="2GB"
--frameworks_home="" --gc_delay="1weeks" --gc_disk_headroom="0.1" --hadoop_home="" --help="false"
--hostname_lookup="true" --http_command_executor="false" --http_credentials="/tmp/Endpoint_SlaveEndpointTest_UnauthorizedRequest_2_BKICjS/http_credentials"
--http_heartbeat_interval="30secs" --initialize_driver_logging="true" --isolation="posix/cpu,posix/mem"
--launcher="posix" --launcher_dir="/mesos/mesos-1.4.0/_build/src" --logbufsecs="0" --logging_level="INFO"
--max_completed_executors_per_framework="150" --oversubscribed_resources_interval="15secs"
--perf_duration="10secs" --perf_interval="1mins" --port="5051" --qos_correction_interval_min="0ns"
--quiet="false" --recover="reconnect" --recovery_timeout="15mins" --registration_backoff_factor="10ms"
--resources="cpus:2;gpus:0;mem:1024;disk:1024;ports:[31000-32000]" --revocable_cpu_low_priority="true"
--runtime_dir="/tmp/Endpoint_SlaveEndpointTest_UnauthorizedRequest_2_BKICjS" --sandbox_directory="/mnt/mesos/sandbox"
--strict="true" --switch_user="true" --systemd_enable_support="true" --systemd_runtime_directory="/run/systemd/system"
--version="false" --work_dir="/tmp/Endpoint_SlaveEndpointTest_UnauthorizedRequest_2_IdCJ8z"
I0511 20:37:47.558328 29144 credentials.hpp:86] Loading credential for authentication from
'/tmp/Endpoint_SlaveEndpointTest_UnauthorizedRequest_2_BKICjS/credential'
I0511 20:37:47.558560 29144 slave.cpp:258] Agent using credential for: test-principal
I0511 20:37:47.558588 29144 credentials.hpp:37] Loading credentials for authentication from
'/tmp/Endpoint_SlaveEndpointTest_UnauthorizedRequest_2_BKICjS/http_credentials'
I0511 20:37:47.558915 29144 http.cpp:975] Creating default 'basic' HTTP authenticator for
realm 'mesos-agent-readonly'
I0511 20:37:47.559156 29144 http.cpp:975] Creating default 'basic' HTTP authenticator for
realm 'mesos-agent-readwrite'
I0511 20:37:47.561012 29144 slave.cpp:525] Agent resources: cpus(*):2; mem(*):1024; disk(*):1024;
ports(*):[31000-32000]
I0511 20:37:47.561120 29144 slave.cpp:533] Agent attributes: [  ]
I0511 20:37:47.561141 29144 slave.cpp:538] Agent hostname: 31f610681184
I0511 20:37:47.561309 29147 status_update_manager.cpp:177] Pausing sending status updates
I0511 20:37:47.563498 29149 state.cpp:62] Recovering state from '/tmp/Endpoint_SlaveEndpointTest_UnauthorizedRequest_2_IdCJ8z/meta'
I0511 20:37:47.563886 29148 status_update_manager.cpp:203] Recovering status update manager
I0511 20:37:47.564162 29145 containerizer.cpp:608] Recovering containerizer
I0511 20:37:47.566004 29143 provisioner.cpp:410] Provisioner recovery complete
I0511 20:37:47.566606 29135 slave.cpp:5970] Finished recovery
I0511 20:37:47.567186 29135 slave.cpp:6152] Querying resource estimator for oversubscribable
resources
I0511 20:37:47.567507 29149 slave.cpp:6166] Received oversubscribable resources {} from the
resource estimator
I0511 20:37:47.570719 29148 process.cpp:3730] Handling HTTP event for process 'slave(754)'
with path: '/slave(754)/containers'
I0511 20:37:47.572118 29148 http.cpp:1115] HTTP GET for /slave(754)/containers from 172.17.0.2:55312
I0511 20:37:47.572192 29148 http.cpp:936] Authorizing principal 'test-principal' to GET the
'/containers' endpoint
I0511 20:37:47.575003 29141 slave.cpp:790] Agent terminating
[       OK ] Endpoint/SlaveEndpointTest.UnauthorizedRequest/2 (32 ms)
[ RUN      ] Endpoint/SlaveEndpointTest.NoAuthorizer/0
I0511 20:37:47.586349 29117 containerizer.cpp:221] Using isolation: posix/cpu,posix/mem,filesystem/posix,network/cni
W0511 20:37:47.586916 29117 backend.cpp:76] Failed to create 'aufs' backend: AufsBackend requires
root privileges
W0511 20:37:47.587028 29117 backend.cpp:76] Failed to create 'bind' backend: BindBackend requires
root privileges
I0511 20:37:47.587072 29117 provisioner.cpp:249] Using default backend 'copy'
I0511 20:37:47.589339 29117 cluster.cpp:448] Creating default 'local' authorizer
I0511 20:37:47.591305 29136 slave.cpp:225] Mesos agent started on (755)@172.17.0.2:35483
I0511 20:37:47.591351 29136 slave.cpp:226] Flags at startup: --acls="" --appc_simple_discovery_uri_prefix="http://"
--appc_store_dir="/tmp/mesos/store/appc" --authenticate_http_readonly="true" --authenticate_http_readwrite="true"
--authenticatee="crammd5" --authentication_backoff_factor="1secs" --authorizer="local" --cgroups_cpu_enable_pids_and_tids_count="false"
--cgroups_enable_cfs="false" --cgroups_hierarchy="/sys/fs/cgroup" --cgroups_limit_swap="false"
--cgroups_root="mesos" --container_disk_watch_interval="15secs" --containerizers="mesos" --credential="/tmp/Endpoint_SlaveEndpointTest_NoAuthorizer_0_HIckj3/credential"
--default_role="*" --disk_watch_interval="1mins" --docker="docker" --docker_kill_orphans="true"
--docker_registry="https://registry-1.docker.io" --docker_remove_delay="6hrs" --docker_socket="/var/run/docker.sock"
--docker_stop_timeout="0ns" --docker_store_dir="/tmp/mesos/store/docker" --docker_volume_checkpoint_dir="/var/run/mesos/isolators/docker/volume"
--enforce_container_disk_quota="false" --executor_registration_timeout="1mins" --executor_shutdown_grace_period="5secs"
--fetcher_cache_dir="/tmp/Endpoint_SlaveEndpointTest_NoAuthorizer_0_HIckj3/fetch" --fetcher_cache_size="2GB"
--frameworks_home="" --gc_delay="1weeks" --gc_disk_headroom="0.1" --hadoop_home="" --help="false"
--hostname_lookup="true" --http_command_executor="false" --http_credentials="/tmp/Endpoint_SlaveEndpointTest_NoAuthorizer_0_HIckj3/http_credentials"
--http_heartbeat_interval="30secs" --initialize_driver_logging="true" --isolation="posix/cpu,posix/mem"
--launcher="posix" --launcher_dir="/mesos/mesos-1.4.0/_build/src" --logbufsecs="0" --logging_level="INFO"
--max_completed_executors_per_framework="150" --oversubscribed_resources_interval="15secs"
--perf_duration="10secs" --perf_interval="1mins" --port="5051" --qos_correction_interval_min="0ns"
--quiet="false" --recover="reconnect" --recovery_timeout="15mins" --registration_backoff_factor="10ms"
--resources="cpus:2;gpus:0;mem:1024;disk:1024;ports:[31000-32000]" --revocable_cpu_low_priority="true"
--runtime_dir="/tmp/Endpoint_SlaveEndpointTest_NoAuthorizer_0_HIckj3" --sandbox_directory="/mnt/mesos/sandbox"
--strict="true" --switch_user="true" --systemd_enable_support="true" --systemd_runtime_directory="/run/systemd/system"
--version="false" --work_dir="/tmp/Endpoint_SlaveEndpointTest_NoAuthorizer_0_EFa92K"
I0511 20:37:47.591938 29136 credentials.hpp:86] Loading credential for authentication from
'/tmp/Endpoint_SlaveEndpointTest_NoAuthorizer_0_HIckj3/credential'
I0511 20:37:47.592173 29136 slave.cpp:258] Agent using credential for: test-principal
I0511 20:37:47.592197 29136 credentials.hpp:37] Loading credentials for authentication from
'/tmp/Endpoint_SlaveEndpointTest_NoAuthorizer_0_HIckj3/http_credentials'
I0511 20:37:47.592463 29136 http.cpp:975] Creating default 'basic' HTTP authenticator for
realm 'mesos-agent-readonly'
I0511 20:37:47.592619 29136 http.cpp:975] Creating default 'basic' HTTP authenticator for
realm 'mesos-agent-readwrite'
I0511 20:37:47.594364 29136 slave.cpp:525] Agent resources: cpus(*):2; mem(*):1024; disk(*):1024;
ports(*):[31000-32000]
I0511 20:37:47.594461 29136 slave.cpp:533] Agent attributes: [  ]
I0511 20:37:47.594475 29136 slave.cpp:538] Agent hostname: 31f610681184
I0511 20:37:47.594633 29142 status_update_manager.cpp:177] Pausing sending status updates
I0511 20:37:47.596101 29142 state.cpp:62] Recovering state from '/tmp/Endpoint_SlaveEndpointTest_NoAuthorizer_0_EFa92K/meta'
I0511 20:37:47.596465 29146 status_update_manager.cpp:203] Recovering status update manager
I0511 20:37:47.596839 29138 containerizer.cpp:608] Recovering containerizer
I0511 20:37:47.598565 29144 provisioner.cpp:410] Provisioner recovery complete
I0511 20:37:47.599011 29148 slave.cpp:5970] Finished recovery
I0511 20:37:47.599510 29148 slave.cpp:6152] Querying resource estimator for oversubscribable
resources
I0511 20:37:47.599795 29142 slave.cpp:6166] Received oversubscribable resources {} from the
resource estimator
I0511 20:37:47.602402 29139 process.cpp:3730] Handling HTTP event for process 'slave(755)'
with path: '/slave(755)/monitor/statistics'
I0511 20:37:47.603876 29149 http.cpp:1115] HTTP GET for /slave(755)/monitor/statistics from
172.17.0.2:55313
I0511 20:37:47.603947 29149 http.cpp:936] Authorizing principal 'test-principal' to GET the
'/monitor/statistics' endpoint
I0511 20:37:47.607846 29141 slave.cpp:790] Agent terminating
[       OK ] Endpoint/SlaveEndpointTest.NoAuthorizer/0 (33 ms)
[ RUN      ] Endpoint/SlaveEndpointTest.NoAuthorizer/1
I0511 20:37:47.621394 29117 containerizer.cpp:221] Using isolation: posix/cpu,posix/mem,filesystem/posix,network/cni
W0511 20:37:47.621953 29117 backend.cpp:76] Failed to create 'aufs' backend: AufsBackend requires
root privileges
W0511 20:37:47.622061 29117 backend.cpp:76] Failed to create 'bind' backend: BindBackend requires
root privileges
I0511 20:37:47.622098 29117 provisioner.cpp:249] Using default backend 'copy'
I0511 20:37:47.623957 29117 cluster.cpp:448] Creating default 'local' authorizer
I0511 20:37:47.626507 29137 slave.cpp:225] Mesos agent started on (756)@172.17.0.2:35483
I0511 20:37:47.626556 29137 slave.cpp:226] Flags at startup: --acls="" --appc_simple_discovery_uri_prefix="http://"
--appc_store_dir="/tmp/mesos/store/appc" --authenticate_http_readonly="true" --authenticate_http_readwrite="true"
--authenticatee="crammd5" --authentication_backoff_factor="1secs" --authorizer="local" --cgroups_cpu_enable_pids_and_tids_count="false"
--cgroups_enable_cfs="false" --cgroups_hierarchy="/sys/fs/cgroup" --cgroups_limit_swap="false"
--cgroups_root="mesos" --container_disk_watch_interval="15secs" --containerizers="mesos" --credential="/tmp/Endpoint_SlaveEndpointTest_NoAuthorizer_1_nxJbFe/credential"
--default_role="*" --disk_watch_interval="1mins" --docker="docker" --docker_kill_orphans="true"
--docker_registry="https://registry-1.docker.io" --docker_remove_delay="6hrs" --docker_socket="/var/run/docker.sock"
--docker_stop_timeout="0ns" --docker_store_dir="/tmp/mesos/store/docker" --docker_volume_checkpoint_dir="/var/run/mesos/isolators/docker/volume"
--enforce_container_disk_quota="false" --executor_registration_timeout="1mins" --executor_shutdown_grace_period="5secs"
--fetcher_cache_dir="/tmp/Endpoint_SlaveEndpointTest_NoAuthorizer_1_nxJbFe/fetch" --fetcher_cache_size="2GB"
--frameworks_home="" --gc_delay="1weeks" --gc_disk_headroom="0.1" --hadoop_home="" --help="false"
--hostname_lookup="true" --http_command_executor="false" --http_credentials="/tmp/Endpoint_SlaveEndpointTest_NoAuthorizer_1_nxJbFe/http_credentials"
--http_heartbeat_interval="30secs" --initialize_driver_logging="true" --isolation="posix/cpu,posix/mem"
--launcher="posix" --launcher_dir="/mesos/mesos-1.4.0/_build/src" --logbufsecs="0" --logging_level="INFO"
--max_completed_executors_per_framework="150" --oversubscribed_resources_interval="15secs"
--perf_duration="10secs" --perf_interval="1mins" --port="5051" --qos_correction_interval_min="0ns"
--quiet="false" --recover="reconnect" --recovery_timeout="15mins" --registration_backoff_factor="10ms"
--resources="cpus:2;gpus:0;mem:1024;disk:1024;ports:[31000-32000]" --revocable_cpu_low_priority="true"
--runtime_dir="/tmp/Endpoint_SlaveEndpointTest_NoAuthorizer_1_nxJbFe" --sandbox_directory="/mnt/mesos/sandbox"
--strict="true" --switch_user="true" --systemd_enable_support="true" --systemd_runtime_directory="/run/systemd/system"
--version="false" --work_dir="/tmp/Endpoint_SlaveEndpointTest_NoAuthorizer_1_uzPmjW"
I0511 20:37:47.627141 29137 credentials.hpp:86] Loading credential for authentication from
'/tmp/Endpoint_SlaveEndpointTest_NoAuthorizer_1_nxJbFe/credential'
I0511 20:37:47.627351 29137 slave.cpp:258] Agent using credential for: test-principal
I0511 20:37:47.627384 29137 credentials.hpp:37] Loading credentials for authentication from
'/tmp/Endpoint_SlaveEndpointTest_NoAuthorizer_1_nxJbFe/http_credentials'
I0511 20:37:47.627671 29137 http.cpp:975] Creating default 'basic' HTTP authenticator for
realm 'mesos-agent-readonly'
I0511 20:37:47.627851 29137 http.cpp:975] Creating default 'basic' HTTP authenticator for
realm 'mesos-agent-readwrite'
I0511 20:37:47.629876 29137 slave.cpp:525] Agent resources: cpus(*):2; mem(*):1024; disk(*):1024;
ports(*):[31000-32000]
I0511 20:37:47.629973 29137 slave.cpp:533] Agent attributes: [  ]
I0511 20:37:47.629990 29137 slave.cpp:538] Agent hostname: 31f610681184
I0511 20:37:47.630288 29136 status_update_manager.cpp:177] Pausing sending status updates
I0511 20:37:47.632165 29135 state.cpp:62] Recovering state from '/tmp/Endpoint_SlaveEndpointTest_NoAuthorizer_1_uzPmjW/meta'
I0511 20:37:47.632560 29141 status_update_manager.cpp:203] Recovering status update manager
I0511 20:37:47.633036 29140 containerizer.cpp:608] Recovering containerizer
I0511 20:37:47.634860 29148 provisioner.cpp:410] Provisioner recovery complete
I0511 20:37:47.635299 29143 slave.cpp:5970] Finished recovery
I0511 20:37:47.635785 29143 slave.cpp:6152] Querying resource estimator for oversubscribable
resources
I0511 20:37:47.636080 29146 slave.cpp:6166] Received oversubscribable resources {} from the
resource estimator
I0511 20:37:47.638833 29150 process.cpp:3730] Handling HTTP event for process 'slave(756)'
with path: '/slave(756)/monitor/statistics.json'
I0511 20:37:47.640794 29142 http.cpp:1115] HTTP GET for /slave(756)/monitor/statistics.json
from 172.17.0.2:55314
I0511 20:37:47.640875 29142 http.cpp:936] Authorizing principal 'test-principal' to GET the
'/monitor/statistics.json' endpoint
I0511 20:37:47.645278 29146 slave.cpp:790] Agent terminating
[       OK ] Endpoint/SlaveEndpointTest.NoAuthorizer/1 (35 ms)
[ RUN      ] Endpoint/SlaveEndpointTest.NoAuthorizer/2
I0511 20:37:47.659448 29117 containerizer.cpp:221] Using isolation: posix/cpu,posix/mem,filesystem/posix,network/cni
W0511 20:37:47.660010 29117 backend.cpp:76] Failed to create 'aufs' backend: AufsBackend requires
root privileges
W0511 20:37:47.660126 29117 backend.cpp:76] Failed to create 'bind' backend: BindBackend requires
root privileges
I0511 20:37:47.660173 29117 provisioner.cpp:249] Using default backend 'copy'
I0511 20:37:47.662283 29117 cluster.cpp:448] Creating default 'local' authorizer
I0511 20:37:47.664319 29138 slave.cpp:225] Mesos agent started on (757)@172.17.0.2:35483
I0511 20:37:47.664366 29138 slave.cpp:226] Flags at startup: --acls="" --appc_simple_discovery_uri_prefix="http://"
--appc_store_dir="/tmp/mesos/store/appc" --authenticate_http_readonly="true" --authenticate_http_readwrite="true"
--authenticatee="crammd5" --authentication_backoff_factor="1secs" --authorizer="local" --cgroups_cpu_enable_pids_and_tids_count="false"
--cgroups_enable_cfs="false" --cgroups_hierarchy="/sys/fs/cgroup" --cgroups_limit_swap="false"
--cgroups_root="mesos" --container_disk_watch_interval="15secs" --containerizers="mesos" --credential="/tmp/Endpoint_SlaveEndpointTest_NoAuthorizer_2_55dBpq/credential"
--default_role="*" --disk_watch_interval="1mins" --docker="docker" --docker_kill_orphans="true"
--docker_registry="https://registry-1.docker.io" --docker_remove_delay="6hrs" --docker_socket="/var/run/docker.sock"
--docker_stop_timeout="0ns" --docker_store_dir="/tmp/mesos/store/docker" --docker_volume_checkpoint_dir="/var/run/mesos/isolators/docker/volume"
--enforce_container_disk_quota="false" --executor_registration_timeout="1mins" --executor_shutdown_grace_period="5secs"
--fetcher_cache_dir="/tmp/Endpoint_SlaveEndpointTest_NoAuthorizer_2_55dBpq/fetch" --fetcher_cache_size="2GB"
--frameworks_home="" --gc_delay="1weeks" --gc_disk_headroom="0.1" --hadoop_home="" --help="false"
--hostname_lookup="true" --http_command_executor="false" --http_credentials="/tmp/Endpoint_SlaveEndpointTest_NoAuthorizer_2_55dBpq/http_credentials"
--http_heartbeat_interval="30secs" --initialize_driver_logging="true" --isolation="posix/cpu,posix/mem"
--launcher="posix" --launcher_dir="/mesos/mesos-1.4.0/_build/src" --logbufsecs="0" --logging_level="INFO"
--max_completed_executors_per_framework="150" --oversubscribed_resources_interval="15secs"
--perf_duration="10secs" --perf_interval="1mins" --port="5051" --qos_correction_interval_min="0ns"
--quiet="false" --recover="reconnect" --recovery_timeout="15mins" --registration_backoff_factor="10ms"
--resources="cpus:2;gpus:0;mem:1024;disk:1024;ports:[31000-32000]" --revocable_cpu_low_priority="true"
--runtime_dir="/tmp/Endpoint_SlaveEndpointTest_NoAuthorizer_2_55dBpq" --sandbox_directory="/mnt/mesos/sandbox"
--strict="true" --switch_user="true" --systemd_enable_support="true" --systemd_runtime_directory="/run/systemd/system"
--version="false" --work_dir="/tmp/Endpoint_SlaveEndpointTest_NoAuthorizer_2_QI5yX7"
I0511 20:37:47.665035 29138 credentials.hpp:86] Loading credential for authentication from
'/tmp/Endpoint_SlaveEndpointTest_NoAuthorizer_2_55dBpq/credential'
I0511 20:37:47.665252 29138 slave.cpp:258] Agent using credential for: test-principal
I0511 20:37:47.665280 29138 credentials.hpp:37] Loading credentials for authentication from
'/tmp/Endpoint_SlaveEndpointTest_NoAuthorizer_2_55dBpq/http_credentials'
I0511 20:37:47.665560 29138 http.cpp:975] Creating default 'basic' HTTP authenticator for
realm 'mesos-agent-readonly'
I0511 20:37:47.665738 29138 http.cpp:975] Creating default 'basic' HTTP authenticator for
realm 'mesos-agent-readwrite'
I0511 20:37:47.667485 29138 slave.cpp:525] Agent resources: cpus(*):2; mem(*):1024; disk(*):1024;
ports(*):[31000-32000]
I0511 20:37:47.667582 29138 slave.cpp:533] Agent attributes: [  ]
I0511 20:37:47.667598 29138 slave.cpp:538] Agent hostname: 31f610681184
I0511 20:37:47.667780 29142 status_update_manager.cpp:177] Pausing sending status updates
I0511 20:37:47.669329 29140 state.cpp:62] Recovering state from '/tmp/Endpoint_SlaveEndpointTest_NoAuthorizer_2_QI5yX7/meta'
I0511 20:37:47.669611 29144 status_update_manager.cpp:203] Recovering status update manager
I0511 20:37:47.669842 29150 containerizer.cpp:608] Recovering containerizer
I0511 20:37:47.671306 29149 provisioner.cpp:410] Provisioner recovery complete
I0511 20:37:47.671782 29136 slave.cpp:5970] Finished recovery
I0511 20:37:47.672308 29136 slave.cpp:6152] Querying resource estimator for oversubscribable
resources
I0511 20:37:47.672598 29137 slave.cpp:6166] Received oversubscribable resources {} from the
resource estimator
I0511 20:37:47.675096 29149 process.cpp:3730] Handling HTTP event for process 'slave(757)'
with path: '/slave(757)/containers'
I0511 20:37:47.676349 29145 http.cpp:1115] HTTP GET for /slave(757)/containers from 172.17.0.2:55315
I0511 20:37:47.676432 29145 http.cpp:936] Authorizing principal 'test-principal' to GET the
'/containers' endpoint
I0511 20:37:47.681349 29149 slave.cpp:790] Agent terminating
[       OK ] Endpoint/SlaveEndpointTest.NoAuthorizer/2 (33 ms)
[----------] 9 tests from Endpoint/SlaveEndpointTest (306 ms total)

[----------] Global test environment tear-down
[==========] 1577 tests from 175 test cases ran. (581017 ms total)
[  PASSED  ] 1575 tests.
[  FAILED  ] 2 tests, listed below:
[  FAILED  ] ProvisionerDockerLocalStoreTest.LocalStoreTestWithTar
[  FAILED  ] ProvisionerDockerLocalStoreTest.MetadataManagerInitialization

 2 FAILED TESTS
  YOU HAVE 19 DISABLED TESTS

E0511 20:37:47.750118 29151 process.cpp:950] Failed to accept socket: future discarded
make[4]: *** [check-local] Error 1
make[4]: Leaving directory `/mesos/mesos-1.4.0/_build/src'
make[3]: *** [check-am] Error 2
make[3]: Leaving directory `/mesos/mesos-1.4.0/_build/src'
make[2]: *** [check] Error 2
make[2]: Leaving directory `/mesos/mesos-1.4.0/_build/src'
make[1]: *** [check-recursive] Error 1
make[1]: Leaving directory `/mesos/mesos-1.4.0/_build'
make: *** [distcheck] Error 1
+ docker rmi mesos-1494531925-20594
Untagged: mesos-1494531925-20594:latest
Deleted: sha256:55bad6515bcd0de542abf4a5df427be36490ce8c39e7640bf40f729f769eca3f
Deleted: sha256:49955c4a63c328d0053c9d9c71704a87c21046672f35214cb82cd6d5c4f8e5a2
Deleted: sha256:9113b5527d76f9cfd0c45ab345cf00ba9e7741ee49f5f0c6efac513160c8ff44
Deleted: sha256:86b5dab6496e32d1092bc5d908ab4f2dacd541cd26e1dfc71f520bc9ccef2d2b
Deleted: sha256:c7b3149c796dddbc64d3f0c438f4ca3063129d6de1b97866372a02fe1b010323
Deleted: sha256:7c2d308d7e8792c2aae0c425783a57a524bb2a3019803cc77a1360a98d6e8c08
Deleted: sha256:597bb8463408b978bf16fe76245b6b1e051397be97bceeadeef546e9a3a54eb6
Deleted: sha256:7506fddb769780180bdd4201772e58777d07aa34e56f529f907bb95c59d1723f
Deleted: sha256:7c139e147fb512788c53294d588ed6124ad21bd460fbcfaafdebbc5abe071df8
Deleted: sha256:1e768bb7b264956bdacbedacb83d6f38df30af2dbabf4111288b62d03125d436
Deleted: sha256:7f3f99bfb2fdfe1cfd35643fef2ff7de685a1d689e3d0980b535ba538727e9ed
Deleted: sha256:4825a5db31ad41b40a99b750ff998ded65eb87c4d6805c912de65148239f6231
Deleted: sha256:3e8e23729486dccad857b44439dc80bbced159056aca786af7d332bf517324aa
Deleted: sha256:504c169b8fd2cd4c9e7960c6cc56cdf748ccccd4fc4b96e0dffdf9f00430e75a
Deleted: sha256:776eb5db12ece8c522e88ba584884cc54df65af1060e74c9b3ed691c972b69cd
Deleted: sha256:07c2e74a961527683dc0714b7460e42e8aa9c170eac3c4d7ff507db060c3dc3d
Deleted: sha256:91c345fefe89f2866a01b78376179073c0afdf3a744d4176febbac03b5bb5a9d
Deleted: sha256:ef6ff7f89fc03041320981410cefbbf4e6ce04da0c45d7978dc2e11d80999eb3
Deleted: sha256:d4b5755ba2e115b16be6c162ae56be5ca178485d8b75ebcd36d7c87bcf6d9a65
Deleted: sha256:13b77717c7dc0e4a56cc6ee5269b7196b405bc9e5b85e50426b2f9999d79c683
Deleted: sha256:bbabbeeef0994797ac57921921dd906cf3e31e0c49d9bac54cdef7b61ac2afb5
Deleted: sha256:7d6b98f27a92d75d83c1efdada854eda6ef576e854e288ed1e23a191d392f227
Deleted: sha256:ce0e5cb15bdbec723a73782d7c6921c7e15895253e33dc388d9a03f54b39da39
Deleted: sha256:f66b0e788671a63c0c21f24a010e46972bd4df386a187d6f1e6725b6370370ba
Build step 'Execute shell' marked build as failure
Not sending mail to unregistered user neil.conway@gmail.com

Mime
View raw message