mesos-builds mailing list archives

Site index · List index
Message view « Date » · « Thread »
Top « Date » · « Thread »
From Apache Jenkins Server <jenk...@builds.apache.org>
Subject Build failed in Jenkins: Mesos-Buildbot » autotools,clang,--verbose --enable-libevent --enable-ssl,GLOG_v=1 MESOS_VERBOSE=1,ubuntu:14.04,(docker||Hadoop)&&(!ubuntu-us1)&&(!ubuntu-eu2) #3648
Date Wed, 10 May 2017 09:07:38 GMT
See <https://builds.apache.org/job/Mesos-Buildbot/BUILDTOOL=autotools,COMPILER=clang,CONFIGURATION=--verbose%20--enable-libevent%20--enable-ssl,ENVIRONMENT=GLOG_v=1%20MESOS_VERBOSE=1,OS=ubuntu%3A14.04,label_exp=(docker%7C%7CHadoop)&&(!ubuntu-us1)&&(!ubuntu-eu2)/3648/display/redirect?page=changes>

Changes:

[neil.conway] Added MESOS-7464, MESOS-7484 to 1.2.1 CHANGELOG.

[neil.conway] Sorted 1.2.1 CHANGELOG entries.

[neil.conway] Added MESOS-{1987,6976,7389,7464,7484} to 1.3.0 CHANGELOG.

------------------------------------------
[...truncated 2.63 MB...]
I0510 09:07:12.681972 26405 openssl.cpp:419] CA file path is unspecified! NOTE: Set CA file
path with LIBPROCESS_SSL_CA_FILE=<filepath>
I0510 09:07:12.681998 26405 openssl.cpp:424] CA directory path unspecified! NOTE: Set CA directory
path with LIBPROCESS_SSL_CA_DIR=<dirpath>
I0510 09:07:12.682004 26405 openssl.cpp:429] Will not verify peer certificate!
NOTE: Set LIBPROCESS_SSL_VERIFY_CERT=1 to enable peer certificate verification
I0510 09:07:12.682008 26405 openssl.cpp:435] Will only verify peer certificate if presented!
NOTE: Set LIBPROCESS_SSL_REQUIRE_CERT=1 to require peer certificate verification
E0510 09:07:12.682531 27502 process.cpp:950] Failed to accept socket: future discarded
I0510 09:07:12.702925 26405 process.cpp:1266] libprocess is initialized on 172.17.0.2:35558
with 16 worker threads
I0510 09:07:12.708665 27509 process.cpp:3730] Handling HTTP event for process '(87)' with
path: '/(87)/pipe'
[       OK ] Scheme/HTTPTest.StreamingGetComplete/0 (381 ms)
[ RUN      ] Scheme/HTTPTest.StreamingGetComplete/1
I0510 09:07:12.759907 26405 process.cpp:1266] libprocess is initialized on 172.17.0.2:39957
with 16 worker threads
I0510 09:07:12.761761 27530 process.cpp:3730] Handling HTTP event for process '(88)' with
path: '/(88)/pipe'
[       OK ] Scheme/HTTPTest.StreamingGetComplete/1 (8 ms)
[ RUN      ] Scheme/HTTPTest.StreamingGetFailure/0
I0510 09:07:13.070782 26405 openssl.cpp:419] CA file path is unspecified! NOTE: Set CA file
path with LIBPROCESS_SSL_CA_FILE=<filepath>
I0510 09:07:13.070806 26405 openssl.cpp:424] CA directory path unspecified! NOTE: Set CA directory
path with LIBPROCESS_SSL_CA_DIR=<dirpath>
I0510 09:07:13.070811 26405 openssl.cpp:429] Will not verify peer certificate!
NOTE: Set LIBPROCESS_SSL_VERIFY_CERT=1 to enable peer certificate verification
I0510 09:07:13.070814 26405 openssl.cpp:435] Will only verify peer certificate if presented!
NOTE: Set LIBPROCESS_SSL_REQUIRE_CERT=1 to require peer certificate verification
E0510 09:07:13.071247 27536 process.cpp:950] Failed to accept socket: future discarded
I0510 09:07:13.073487 26405 process.cpp:1266] libprocess is initialized on 172.17.0.2:39180
with 16 worker threads
I0510 09:07:13.079578 27551 process.cpp:3730] Handling HTTP event for process '(89)' with
path: '/(89)/pipe'
I0510 09:07:13.117574 27542 process.cpp:1624] Failed to read from stream: oops
[       OK ] Scheme/HTTPTest.StreamingGetFailure/0 (356 ms)
[ RUN      ] Scheme/HTTPTest.StreamingGetFailure/1
I0510 09:07:13.138041 26405 process.cpp:1266] libprocess is initialized on 172.17.0.2:45457
with 16 worker threads
I0510 09:07:13.139084 27561 process.cpp:3730] Handling HTTP event for process '(90)' with
path: '/(90)/pipe'
I0510 09:07:13.140792 27558 process.cpp:1624] Failed to read from stream: oops
[       OK ] Scheme/HTTPTest.StreamingGetFailure/1 (20 ms)
[ RUN      ] Scheme/HTTPTest.PipeEquality/0
I0510 09:07:13.621218 26405 openssl.cpp:419] CA file path is unspecified! NOTE: Set CA file
path with LIBPROCESS_SSL_CA_FILE=<filepath>
I0510 09:07:13.621243 26405 openssl.cpp:424] CA directory path unspecified! NOTE: Set CA directory
path with LIBPROCESS_SSL_CA_DIR=<dirpath>
I0510 09:07:13.621248 26405 openssl.cpp:429] Will not verify peer certificate!
NOTE: Set LIBPROCESS_SSL_VERIFY_CERT=1 to enable peer certificate verification
I0510 09:07:13.621253 26405 openssl.cpp:435] Will only verify peer certificate if presented!
NOTE: Set LIBPROCESS_SSL_REQUIRE_CERT=1 to require peer certificate verification
E0510 09:07:13.621853 27570 process.cpp:950] Failed to accept socket: future discarded
I0510 09:07:13.637266 26405 process.cpp:1266] libprocess is initialized on 172.17.0.2:48893
with 16 worker threads
[       OK ] Scheme/HTTPTest.PipeEquality/0 (496 ms)
[ RUN      ] Scheme/HTTPTest.PipeEquality/1
I0510 09:07:13.639652 26405 process.cpp:1266] libprocess is initialized on 172.17.0.2:60526
with 16 worker threads
[       OK ] Scheme/HTTPTest.PipeEquality/1 (2 ms)
[ RUN      ] Scheme/HTTPTest.Post/0
I0510 09:07:14.240239 26405 openssl.cpp:419] CA file path is unspecified! NOTE: Set CA file
path with LIBPROCESS_SSL_CA_FILE=<filepath>
I0510 09:07:14.240262 26405 openssl.cpp:424] CA directory path unspecified! NOTE: Set CA directory
path with LIBPROCESS_SSL_CA_DIR=<dirpath>
I0510 09:07:14.240267 26405 openssl.cpp:429] Will not verify peer certificate!
NOTE: Set LIBPROCESS_SSL_VERIFY_CERT=1 to enable peer certificate verification
I0510 09:07:14.240270 26405 openssl.cpp:435] Will only verify peer certificate if presented!
NOTE: Set LIBPROCESS_SSL_REQUIRE_CERT=1 to require peer certificate verification
E0510 09:07:14.240695 27604 process.cpp:950] Failed to accept socket: future discarded
I0510 09:07:14.242290 26405 process.cpp:1266] libprocess is initialized on 172.17.0.2:57246
with 16 worker threads
I0510 09:07:14.247488 27613 process.cpp:3730] Handling HTTP event for process '(91)' with
path: '/(91)/post'
I0510 09:07:14.290068 27618 process.cpp:3730] Handling HTTP event for process '(91)' with
path: '/(91)/post'
[       OK ] Scheme/HTTPTest.Post/0 (691 ms)
[ RUN      ] Scheme/HTTPTest.Post/1
I0510 09:07:14.332732 26405 process.cpp:1266] libprocess is initialized on 172.17.0.2:40463
with 16 worker threads
I0510 09:07:14.333806 27622 process.cpp:3730] Handling HTTP event for process '(92)' with
path: '/(92)/post'
I0510 09:07:14.335773 27622 process.cpp:3730] Handling HTTP event for process '(92)' with
path: '/(92)/post'
[       OK ] Scheme/HTTPTest.Post/1 (7 ms)
[ RUN      ] Scheme/HTTPTest.Delete/0
I0510 09:07:14.621557 26405 openssl.cpp:419] CA file path is unspecified! NOTE: Set CA file
path with LIBPROCESS_SSL_CA_FILE=<filepath>
I0510 09:07:14.621587 26405 openssl.cpp:424] CA directory path unspecified! NOTE: Set CA directory
path with LIBPROCESS_SSL_CA_DIR=<dirpath>
I0510 09:07:14.621596 26405 openssl.cpp:429] Will not verify peer certificate!
NOTE: Set LIBPROCESS_SSL_VERIFY_CERT=1 to enable peer certificate verification
I0510 09:07:14.621603 26405 openssl.cpp:435] Will only verify peer certificate if presented!
NOTE: Set LIBPROCESS_SSL_REQUIRE_CERT=1 to require peer certificate verification
E0510 09:07:14.622151 27638 process.cpp:950] Failed to accept socket: future discarded
I0510 09:07:14.624503 26405 process.cpp:1266] libprocess is initialized on 172.17.0.2:61000
with 16 worker threads
I0510 09:07:14.630187 27640 process.cpp:3730] Handling HTTP event for process '(93)' with
path: '/(93)/delete'
[       OK ] Scheme/HTTPTest.Delete/0 (295 ms)
[ RUN      ] Scheme/HTTPTest.Delete/1
I0510 09:07:14.636173 26405 process.cpp:1266] libprocess is initialized on 172.17.0.2:33985
with 16 worker threads
I0510 09:07:14.637349 27663 process.cpp:3730] Handling HTTP event for process '(94)' with
path: '/(94)/delete'
[       OK ] Scheme/HTTPTest.Delete/1 (6 ms)
[ RUN      ] Scheme/HTTPTest.Request/0
I0510 09:07:14.989500 26405 openssl.cpp:419] CA file path is unspecified! NOTE: Set CA file
path with LIBPROCESS_SSL_CA_FILE=<filepath>
I0510 09:07:14.989524 26405 openssl.cpp:424] CA directory path unspecified! NOTE: Set CA directory
path with LIBPROCESS_SSL_CA_DIR=<dirpath>
I0510 09:07:14.989531 26405 openssl.cpp:429] Will not verify peer certificate!
NOTE: Set LIBPROCESS_SSL_VERIFY_CERT=1 to enable peer certificate verification
I0510 09:07:14.989534 26405 openssl.cpp:435] Will only verify peer certificate if presented!
NOTE: Set LIBPROCESS_SSL_REQUIRE_CERT=1 to require peer certificate verification
E0510 09:07:14.990221 27672 process.cpp:950] Failed to accept socket: future discarded
I0510 09:07:14.995177 26405 process.cpp:1266] libprocess is initialized on 172.17.0.2:53182
with 16 worker threads
I0510 09:07:15.003213 27688 process.cpp:3730] Handling HTTP event for process '(95)' with
path: '/(95)/request'
[       OK ] Scheme/HTTPTest.Request/0 (370 ms)
[ RUN      ] Scheme/HTTPTest.Request/1
I0510 09:07:15.015053 26405 process.cpp:1266] libprocess is initialized on 172.17.0.2:47987
with 16 worker threads
I0510 09:07:15.017102 27692 process.cpp:3730] Handling HTTP event for process '(96)' with
path: '/(96)/request'
[       OK ] Scheme/HTTPTest.Request/1 (9 ms)
[ RUN      ] Scheme/HTTPTest.QueryEncodeDecode/0
I0510 09:07:15.675902 26405 openssl.cpp:419] CA file path is unspecified! NOTE: Set CA file
path with LIBPROCESS_SSL_CA_FILE=<filepath>
I0510 09:07:15.675931 26405 openssl.cpp:424] CA directory path unspecified! NOTE: Set CA directory
path with LIBPROCESS_SSL_CA_DIR=<dirpath>
I0510 09:07:15.675940 26405 openssl.cpp:429] Will not verify peer certificate!
NOTE: Set LIBPROCESS_SSL_VERIFY_CERT=1 to enable peer certificate verification
I0510 09:07:15.675946 26405 openssl.cpp:435] Will only verify peer certificate if presented!
NOTE: Set LIBPROCESS_SSL_REQUIRE_CERT=1 to require peer certificate verification
E0510 09:07:15.676614 27706 process.cpp:950] Failed to accept socket: future discarded
I0510 09:07:15.689880 26405 process.cpp:1266] libprocess is initialized on 172.17.0.2:43232
with 16 worker threads
[       OK ] Scheme/HTTPTest.QueryEncodeDecode/0 (671 ms)
[ RUN      ] Scheme/HTTPTest.QueryEncodeDecode/1
I0510 09:07:15.693644 26405 process.cpp:1266] libprocess is initialized on 172.17.0.2:36453
with 16 worker threads
[       OK ] Scheme/HTTPTest.QueryEncodeDecode/1 (4 ms)
[ RUN      ] Scheme/HTTPTest.Headers/0
I0510 09:07:15.935605 26405 openssl.cpp:419] CA file path is unspecified! NOTE: Set CA file
path with LIBPROCESS_SSL_CA_FILE=<filepath>
I0510 09:07:15.935628 26405 openssl.cpp:424] CA directory path unspecified! NOTE: Set CA directory
path with LIBPROCESS_SSL_CA_DIR=<dirpath>
I0510 09:07:15.935633 26405 openssl.cpp:429] Will not verify peer certificate!
NOTE: Set LIBPROCESS_SSL_VERIFY_CERT=1 to enable peer certificate verification
I0510 09:07:15.935637 26405 openssl.cpp:435] Will only verify peer certificate if presented!
NOTE: Set LIBPROCESS_SSL_REQUIRE_CERT=1 to require peer certificate verification
E0510 09:07:15.936120 27740 process.cpp:950] Failed to accept socket: future discarded
I0510 09:07:15.942029 26405 process.cpp:1266] libprocess is initialized on 172.17.0.2:36351
with 16 worker threads
[       OK ] Scheme/HTTPTest.Headers/0 (248 ms)
[ RUN      ] Scheme/HTTPTest.Headers/1
I0510 09:07:15.944805 26405 process.cpp:1266] libprocess is initialized on 172.17.0.2:43048
with 16 worker threads
[       OK ] Scheme/HTTPTest.Headers/1 (2 ms)
[ RUN      ] Scheme/HTTPTest.CaseInsensitiveHeaders/0
I0510 09:07:16.215822 26405 openssl.cpp:419] CA file path is unspecified! NOTE: Set CA file
path with LIBPROCESS_SSL_CA_FILE=<filepath>
I0510 09:07:16.215843 26405 openssl.cpp:424] CA directory path unspecified! NOTE: Set CA directory
path with LIBPROCESS_SSL_CA_DIR=<dirpath>
I0510 09:07:16.215848 26405 openssl.cpp:429] Will not verify peer certificate!
NOTE: Set LIBPROCESS_SSL_VERIFY_CERT=1 to enable peer certificate verification
I0510 09:07:16.215852 26405 openssl.cpp:435] Will only verify peer certificate if presented!
NOTE: Set LIBPROCESS_SSL_REQUIRE_CERT=1 to require peer certificate verification
E0510 09:07:16.216320 27774 process.cpp:950] Failed to accept socket: future discarded
I0510 09:07:16.221952 26405 process.cpp:1266] libprocess is initialized on 172.17.0.2:49005
with 16 worker threads
[       OK ] Scheme/HTTPTest.CaseInsensitiveHeaders/0 (277 ms)
[ RUN      ] Scheme/HTTPTest.CaseInsensitiveHeaders/1
I0510 09:07:16.224453 26405 process.cpp:1266] libprocess is initialized on 172.17.0.2:47192
with 16 worker threads
[       OK ] Scheme/HTTPTest.CaseInsensitiveHeaders/1 (2 ms)
[ RUN      ] Scheme/HTTPTest.WWWAuthenticateHeader/0
I0510 09:07:17.019094 26405 openssl.cpp:419] CA file path is unspecified! NOTE: Set CA file
path with LIBPROCESS_SSL_CA_FILE=<filepath>
I0510 09:07:17.019121 26405 openssl.cpp:424] CA directory path unspecified! NOTE: Set CA directory
path with LIBPROCESS_SSL_CA_DIR=<dirpath>
I0510 09:07:17.019129 26405 openssl.cpp:429] Will not verify peer certificate!
NOTE: Set LIBPROCESS_SSL_VERIFY_CERT=1 to enable peer certificate verification
I0510 09:07:17.019134 26405 openssl.cpp:435] Will only verify peer certificate if presented!
NOTE: Set LIBPROCESS_SSL_REQUIRE_CERT=1 to require peer certificate verification
E0510 09:07:17.019768 27808 process.cpp:950] Failed to accept socket: future discarded
I0510 09:07:17.026254 26405 process.cpp:1266] libprocess is initialized on 172.17.0.2:48345
with 16 worker threads
[       OK ] Scheme/HTTPTest.WWWAuthenticateHeader/0 (802 ms)
[ RUN      ] Scheme/HTTPTest.WWWAuthenticateHeader/1
I0510 09:07:17.028625 26405 process.cpp:1266] libprocess is initialized on 172.17.0.2:47648
with 16 worker threads
[       OK ] Scheme/HTTPTest.WWWAuthenticateHeader/1 (2 ms)
[ RUN      ] Scheme/HTTPTest.Accepts/0
I0510 09:07:17.371954 26405 openssl.cpp:419] CA file path is unspecified! NOTE: Set CA file
path with LIBPROCESS_SSL_CA_FILE=<filepath>
I0510 09:07:17.371989 26405 openssl.cpp:424] CA directory path unspecified! NOTE: Set CA directory
path with LIBPROCESS_SSL_CA_DIR=<dirpath>
I0510 09:07:17.371996 26405 openssl.cpp:429] Will not verify peer certificate!
NOTE: Set LIBPROCESS_SSL_VERIFY_CERT=1 to enable peer certificate verification
I0510 09:07:17.372002 26405 openssl.cpp:435] Will only verify peer certificate if presented!
NOTE: Set LIBPROCESS_SSL_REQUIRE_CERT=1 to require peer certificate verification
E0510 09:07:17.372552 27842 process.cpp:950] Failed to accept socket: future discarded
I0510 09:07:17.382099 26405 process.cpp:1266] libprocess is initialized on 172.17.0.2:51075
with 16 worker threads
[       OK ] Scheme/HTTPTest.Accepts/0 (355 ms)
[ RUN      ] Scheme/HTTPTest.Accepts/1
I0510 09:07:17.385152 26405 process.cpp:1266] libprocess is initialized on 172.17.0.2:46082
with 16 worker threads
[       OK ] Scheme/HTTPTest.Accepts/1 (2 ms)
E0510 09:07:17.386371 27876 process.cpp:950] Failed to accept socket: future discarded
I0510 09:07:17.388551 26405 process.cpp:1266] libprocess is initialized on 172.17.0.2:36602
with 16 worker threads
[----------] 42 tests from Scheme/HTTPTest (9398 ms total)

[----------] 4 tests from Encryption/NetSocketTest
[ RUN      ] Encryption/NetSocketTest.EOFBeforeRecv/0
I0510 09:07:17.475127 26405 openssl.cpp:419] CA file path is unspecified! NOTE: Set CA file
path with LIBPROCESS_SSL_CA_FILE=<filepath>
I0510 09:07:17.475152 26405 openssl.cpp:424] CA directory path unspecified! NOTE: Set CA directory
path with LIBPROCESS_SSL_CA_DIR=<dirpath>
I0510 09:07:17.475155 26405 openssl.cpp:429] Will not verify peer certificate!
NOTE: Set LIBPROCESS_SSL_VERIFY_CERT=1 to enable peer certificate verification
I0510 09:07:17.475159 26405 openssl.cpp:435] Will only verify peer certificate if presented!
NOTE: Set LIBPROCESS_SSL_REQUIRE_CERT=1 to require peer certificate verification
E0510 09:07:17.475599 27893 process.cpp:950] Failed to accept socket: future discarded
I0510 09:07:17.481997 26405 process.cpp:1266] libprocess is initialized on 172.17.0.2:44589
with 16 worker threads
[       OK ] Encryption/NetSocketTest.EOFBeforeRecv/0 (137 ms)
[ RUN      ] Encryption/NetSocketTest.EOFBeforeRecv/1
I0510 09:07:17.528347 26405 process.cpp:1266] libprocess is initialized on 172.17.0.2:34268
with 16 worker threads
[       OK ] Encryption/NetSocketTest.EOFBeforeRecv/1 (4 ms)
[ RUN      ] Encryption/NetSocketTest.EOFAfterRecv/0
I0510 09:07:17.853677 26405 openssl.cpp:419] CA file path is unspecified! NOTE: Set CA file
path with LIBPROCESS_SSL_CA_FILE=<filepath>
I0510 09:07:17.853700 26405 openssl.cpp:424] CA directory path unspecified! NOTE: Set CA directory
path with LIBPROCESS_SSL_CA_DIR=<dirpath>
I0510 09:07:17.853705 26405 openssl.cpp:429] Will not verify peer certificate!
NOTE: Set LIBPROCESS_SSL_VERIFY_CERT=1 to enable peer certificate verification
I0510 09:07:17.853709 26405 openssl.cpp:435] Will only verify peer certificate if presented!
NOTE: Set LIBPROCESS_SSL_REQUIRE_CERT=1 to require peer certificate verification
E0510 09:07:17.854302 27927 process.cpp:950] Failed to accept socket: future discarded
*** Aborted at 1494407237 (unix time) try "date -d @1494407237" if you are using GNU date
***
I0510 09:07:17.857777 26405 process.cpp:1266] libprocess is initialized on 172.17.0.2:44174
with 16 worker threads
PC: @     0x2ae78309764e (unknown)
*** SIGSEGV (@0x5aa9268) received by PID 26405 (TID 0x2ae789531700) from PID 95064680; stack
trace: ***
    @     0x2ae7809e9330 (unknown)
    @     0x2ae78309764e (unknown)
    @     0x2ae782897e30 (unknown)
    @     0x2ae78289848c (unknown)
    @           0x443b8f process::UPID::UPID()
    @           0xa07dce process::DispatchEvent::DispatchEvent()
    @           0x9f1593 process::internal::dispatch()
    @           0xa0788d process::dispatch<>()
    @           0x9f05b7 process::ProcessBase::route()
    @           0xb1701d process::ProcessBase::route<>()
    @           0xb148f0 process::Help::initialize()
    @           0xb149a2 process::Help::initialize()
    @           0x9eb030 process::ProcessManager::resume()
    @           0x9f99cc process::ProcessManager::init_threads()::$_2::operator()()
    @           0x9f98d5 _ZNSt12_Bind_simpleIFZN7process14ProcessManager12init_threadsEvE3$_2vEE9_M_invokeIJEEEvSt12_Index_tupleIJXspT_EEE
    @           0x9f98a5 std::_Bind_simple<>::operator()()
    @           0x9f987c std::thread::_Impl<>::_M_run()
    @     0x2ae78288ea60 (unknown)
    @     0x2ae7809e1184 start_thread
    @     0x2ae7830fabed (unknown)
make[7]: *** [check-local] Segmentation fault
make[7]: Leaving directory `/mesos/mesos-1.4.0/_build/3rdparty/libprocess'
make[6]: *** [check-am] Error 2
make[6]: Leaving directory `/mesos/mesos-1.4.0/_build/3rdparty/libprocess'
make[5]: *** [check-recursive] Error 1
make[5]: Leaving directory `/mesos/mesos-1.4.0/_build/3rdparty/libprocess'
make[4]: *** [check] Error 2
make[4]: Leaving directory `/mesos/mesos-1.4.0/_build/3rdparty/libprocess'
make[3]: *** [check-recursive] Error 1
make[3]: Leaving directory `/mesos/mesos-1.4.0/_build/3rdparty'
make[2]: *** [check] Error 2
make[2]: Leaving directory `/mesos/mesos-1.4.0/_build/3rdparty'
make[1]: *** [check-recursive] Error 1
make[1]: Leaving directory `/mesos/mesos-1.4.0/_build'
make: *** [distcheck] Error 1
+ docker rmi mesos-1494405686-16267
Untagged: mesos-1494405686-16267:latest
Deleted: sha256:dba3266cf0c800b54617048bdd7679e2309c090d2581d2fc701a0a8e4e0456ad
Deleted: sha256:729d139e98104d8930ea03fabaeeaf79b7e9d8a40653b64b161f427c9190f54f
Deleted: sha256:6cd823874e5401710d4fcf889bf82db1666179fafa71c578a54e1fc906ef2eed
Deleted: sha256:b2a8145e7db99513fd14fa0275b7bb90d2c26f00f66ab1be02970ab24a04c1e7
Deleted: sha256:553fc6b018f06008bffec0fe4851dadbe9d343360871202a384e2eaf75cd623a
Deleted: sha256:65a0872e8cd0b5ff49c59058157dd0c418fd5586ad10efb5646f7eb86e51f71a
Deleted: sha256:3a6d6d2d48687f0530bbfc2a92c82e3fc67f80e156db0d2e6270a427c481077f
Deleted: sha256:60125511f3d4b45187762068a154b3223a0568ee02ed2d4145a5bfb74711850b
Deleted: sha256:08c561801d3c3803388181a118e102ab97dcef5fe040262528f0c1be659c5afe
Deleted: sha256:e7040249705531d2688d2c966204360a082133071aa97f33fc7633defcf3e4ae
Deleted: sha256:907bb750874f3eb992f6330c53bbc750617d1a59797aab93cd0c7acff9fb3cec
Deleted: sha256:b11b1d685b406d3d8dade7c7528690a7bcd003da2e3bdae81686a9927dd112df
Deleted: sha256:797b367acdd4ae92c299993466e085e4172b3fcbe3a3735545e006ecd305493e
Deleted: sha256:1e8a59b1d48fd100cfcae3b5d1fb5b8625b03a04ad84e223025eeb212116010d
Deleted: sha256:45edacd10891908f4a599cecff2a3d17ac359305aad1295409b38436aaba9f41
Deleted: sha256:73ba066080702fa47133b4354496d6312b305bed326d0a7b6716e74b592f5fd8
Deleted: sha256:e37f92a15d34a0e079e037e127cc732e7c91756f9d7d45fedf1ef5e81181aad3
Deleted: sha256:56661d30fb4098ed2070de48f201a19367a7feeafb6616f5636b8a1ac01cc55e
Deleted: sha256:e3c90d767b4031a2c797519d436bd7b8638f6e9dad544f5c947ebece6f9aac51
Deleted: sha256:09e9b82559f87a7bf08baee45c8ff818198c2638fc9b812c5f61d441320f6214
Deleted: sha256:31ab1a8f905cc33afbf42082e59172abe169bf6b15f5a41de4ceb4126132ac4e
Deleted: sha256:81a849d33b048456262ef8c1e7407dfc7fed7f6faeac66b3aa96bde244d78f68
Deleted: sha256:bf5c0d90e113af2020e7857c8dae75392af4f373a501f787026bb1641499213d
Deleted: sha256:f6384792b6ce4be45bc5a56a5db06f1101078913c8e7abc16eebc9559df215bc
Build step 'Execute shell' marked build as failure
Not sending mail to unregistered user neil.conway@gmail.com

Mime
View raw message