mesos-builds mailing list archives

Site index · List index
Message view « Date » · « Thread »
Top « Date » · « Thread »
From Apache Jenkins Server <jenk...@builds.apache.org>
Subject Build failed in Jenkins: Mesos-Buildbot » autotools,gcc,--verbose --enable-libevent --enable-ssl,GLOG_v=1 MESOS_VERBOSE=1,ubuntu:14.04,(docker||Hadoop)&&(!ubuntu-us1)&&(!ubuntu-eu2) #3698
Date Fri, 19 May 2017 17:30:53 GMT
See <https://builds.apache.org/job/Mesos-Buildbot/BUILDTOOL=autotools,COMPILER=gcc,CONFIGURATION=--verbose%20--enable-libevent%20--enable-ssl,ENVIRONMENT=GLOG_v=1%20MESOS_VERBOSE=1,OS=ubuntu%3A14.04,label_exp=(docker%7C%7CHadoop)&&(!ubuntu-us1)&&(!ubuntu-eu2)/3698/display/redirect>

------------------------------------------
[...truncated 28.51 MB...]
I0519 17:30:44.329996 18716 slave.cpp:6170] Received oversubscribable resources {} from the
resource estimator
I0519 17:30:44.332748 18723 process.cpp:3730] Handling HTTP event for process 'slave(752)'
with path: '/slave(752)/containers'
I0519 17:30:44.334734 18722 http.cpp:1115] HTTP GET for /slave(752)/containers from 172.17.0.3:33948
I0519 17:30:44.334831 18722 http.cpp:936] Authorizing principal 'test-principal' to GET the
'/containers' endpoint
I0519 17:30:44.339187   503 slave.cpp:794] Agent terminating
[       OK ] Endpoint/SlaveEndpointTest.AuthorizedRequest/2 (50 ms)
[ RUN      ] Endpoint/SlaveEndpointTest.UnauthorizedRequest/0
I0519 17:30:44.367640   503 containerizer.cpp:221] Using isolation: posix/cpu,posix/mem,filesystem/posix,network/cni
W0519 17:30:44.368155   503 backend.cpp:76] Failed to create 'aufs' backend: AufsBackend requires
root privileges
W0519 17:30:44.368254   503 backend.cpp:76] Failed to create 'bind' backend: BindBackend requires
root privileges
I0519 17:30:44.368295   503 provisioner.cpp:249] Using default backend 'copy'
I0519 17:30:44.372048 18728 slave.cpp:225] Mesos agent started on (753)@172.17.0.3:58645
I0519 17:30:44.372076 18728 slave.cpp:226] Flags at startup: --acls="" --appc_simple_discovery_uri_prefix="http://"
--appc_store_dir="/tmp/mesos/store/appc" --authenticate_http_executors="true" --authenticate_http_readonly="true"
--authenticate_http_readwrite="true" --authenticatee="crammd5" --authentication_backoff_factor="1secs"
--authorizer="local" --cgroups_cpu_enable_pids_and_tids_count="false" --cgroups_enable_cfs="false"
--cgroups_hierarchy="/sys/fs/cgroup" --cgroups_limit_swap="false" --cgroups_root="mesos" --container_disk_watch_interval="15secs"
--containerizers="mesos" --credential="/tmp/Endpoint_SlaveEndpointTest_UnauthorizedRequest_0_nqOy4e/credential"
--default_role="*" --disk_watch_interval="1mins" --docker="docker" --docker_kill_orphans="true"
--docker_registry="https://registry-1.docker.io" --docker_remove_delay="6hrs" --docker_socket="/var/run/docker.sock"
--docker_stop_timeout="0ns" --docker_store_dir="/tmp/mesos/store/docker" --docker_volume_checkpoint_dir="/var/run/mesos/isolators/docker/volume"
--enforce_container_disk_quota="false" --executor_registration_timeout="1mins" --executor_secret_key="/tmp/Endpoint_SlaveEndpointTest_UnauthorizedRequest_0_nqOy4e/executor_secret_key"
--executor_shutdown_grace_period="5secs" --fetcher_cache_dir="/tmp/Endpoint_SlaveEndpointTest_UnauthorizedRequest_0_nqOy4e/fetch"
--fetcher_cache_size="2GB" --frameworks_home="" --gc_delay="1weeks" --gc_disk_headroom="0.1"
--hadoop_home="" --help="false" --hostname_lookup="true" --http_command_executor="false" --http_credentials="/tmp/Endpoint_SlaveEndpointTest_UnauthorizedRequest_0_nqOy4e/http_credentials"
--http_heartbeat_interval="30secs" --initialize_driver_logging="true" --isolation="posix/cpu,posix/mem"
--launcher="posix" --launcher_dir="/mesos/mesos-1.4.0/_build/src" --logbufsecs="0" --logging_level="INFO"
--max_completed_executors_per_framework="150" --oversubscribed_resources_interval="15secs"
--perf_duration="10secs" --perf_interval="1mins" --port="5051" --qos_correction_interval_min="0ns"
--quiet="false" --recover="reconnect" --recovery_timeout="15mins" --registration_backoff_factor="10ms"
--resources="cpus:2;gpus:0;mem:1024;disk:1024;ports:[31000-32000]" --revocable_cpu_low_priority="true"
--runtime_dir="/tmp/Endpoint_SlaveEndpointTest_UnauthorizedRequest_0_nqOy4e" --sandbox_directory="/mnt/mesos/sandbox"
--strict="true" --switch_user="true" --systemd_enable_support="true" --systemd_runtime_directory="/run/systemd/system"
--version="false" --work_dir="/tmp/Endpoint_SlaveEndpointTest_UnauthorizedRequest_0_UG09KU"
I0519 17:30:44.372586 18728 credentials.hpp:86] Loading credential for authentication from
'/tmp/Endpoint_SlaveEndpointTest_UnauthorizedRequest_0_nqOy4e/credential'
I0519 17:30:44.372740 18728 slave.cpp:258] Agent using credential for: test-principal
I0519 17:30:44.372762 18728 credentials.hpp:37] Loading credentials for authentication from
'/tmp/Endpoint_SlaveEndpointTest_UnauthorizedRequest_0_nqOy4e/http_credentials'
I0519 17:30:44.373015 18728 http.cpp:975] Creating default 'basic' HTTP authenticator for
realm 'mesos-agent-executor'
I0519 17:30:44.373126 18728 http.cpp:996] Creating default 'jwt' HTTP authenticator for realm
'mesos-agent-executor'
I0519 17:30:44.373312 18728 http.cpp:975] Creating default 'basic' HTTP authenticator for
realm 'mesos-agent-readonly'
I0519 17:30:44.373394 18728 http.cpp:996] Creating default 'jwt' HTTP authenticator for realm
'mesos-agent-readonly'
I0519 17:30:44.373687 18728 http.cpp:975] Creating default 'basic' HTTP authenticator for
realm 'mesos-agent-readwrite'
I0519 17:30:44.373796 18728 http.cpp:996] Creating default 'jwt' HTTP authenticator for realm
'mesos-agent-readwrite'
I0519 17:30:44.375228 18728 slave.cpp:529] Agent resources: cpus(*):2; mem(*):1024; disk(*):1024;
ports(*):[31000-32000]
I0519 17:30:44.375304 18728 slave.cpp:537] Agent attributes: [  ]
I0519 17:30:44.375345 18728 slave.cpp:542] Agent hostname: 94002b6d41b0
I0519 17:30:44.375576 18714 status_update_manager.cpp:177] Pausing sending status updates
I0519 17:30:44.376982 18714 state.cpp:62] Recovering state from '/tmp/Endpoint_SlaveEndpointTest_UnauthorizedRequest_0_UG09KU/meta'
I0519 17:30:44.377288 18720 status_update_manager.cpp:203] Recovering status update manager
I0519 17:30:44.377605 18722 containerizer.cpp:608] Recovering containerizer
I0519 17:30:44.379014 18728 provisioner.cpp:410] Provisioner recovery complete
I0519 17:30:44.379405 18721 slave.cpp:5974] Finished recovery
I0519 17:30:44.380043 18721 slave.cpp:6156] Querying resource estimator for oversubscribable
resources
I0519 17:30:44.380302 18721 slave.cpp:6170] Received oversubscribable resources {} from the
resource estimator
I0519 17:30:44.383090 18716 process.cpp:3730] Handling HTTP event for process 'slave(753)'
with path: '/slave(753)/monitor/statistics'
I0519 17:30:44.385023 18718 http.cpp:1115] HTTP GET for /slave(753)/monitor/statistics from
172.17.0.3:33949
I0519 17:30:44.385110 18718 http.cpp:936] Authorizing principal 'test-principal' to GET the
'/monitor/statistics' endpoint
I0519 17:30:44.387511 18719 slave.cpp:794] Agent terminating
[       OK ] Endpoint/SlaveEndpointTest.UnauthorizedRequest/0 (29 ms)
[ RUN      ] Endpoint/SlaveEndpointTest.UnauthorizedRequest/1
I0519 17:30:44.398481   503 containerizer.cpp:221] Using isolation: posix/cpu,posix/mem,filesystem/posix,network/cni
W0519 17:30:44.399030   503 backend.cpp:76] Failed to create 'aufs' backend: AufsBackend requires
root privileges
W0519 17:30:44.399134   503 backend.cpp:76] Failed to create 'bind' backend: BindBackend requires
root privileges
I0519 17:30:44.399180   503 provisioner.cpp:249] Using default backend 'copy'
I0519 17:30:44.402170 18718 slave.cpp:225] Mesos agent started on (754)@172.17.0.3:58645
I0519 17:30:44.402197 18718 slave.cpp:226] Flags at startup: --acls="" --appc_simple_discovery_uri_prefix="http://"
--appc_store_dir="/tmp/mesos/store/appc" --authenticate_http_executors="true" --authenticate_http_readonly="true"
--authenticate_http_readwrite="true" --authenticatee="crammd5" --authentication_backoff_factor="1secs"
--authorizer="local" --cgroups_cpu_enable_pids_and_tids_count="false" --cgroups_enable_cfs="false"
--cgroups_hierarchy="/sys/fs/cgroup" --cgroups_limit_swap="false" --cgroups_root="mesos" --container_disk_watch_interval="15secs"
--containerizers="mesos" --credential="/tmp/Endpoint_SlaveEndpointTest_UnauthorizedRequest_1_DyD1ux/credential"
--default_role="*" --disk_watch_interval="1mins" --docker="docker" --docker_kill_orphans="true"
--docker_registry="https://registry-1.docker.io" --docker_remove_delay="6hrs" --docker_socket="/var/run/docker.sock"
--docker_stop_timeout="0ns" --docker_store_dir="/tmp/mesos/store/docker" --docker_volume_checkpoint_dir="/var/run/mesos/isolators/docker/volume"
--enforce_container_disk_quota="false" --executor_registration_timeout="1mins" --executor_secret_key="/tmp/Endpoint_SlaveEndpointTest_UnauthorizedRequest_1_DyD1ux/executor_secret_key"
--executor_shutdown_grace_period="5secs" --fetcher_cache_dir="/tmp/Endpoint_SlaveEndpointTest_UnauthorizedRequest_1_DyD1ux/fetch"
--fetcher_cache_size="2GB" --frameworks_home="" --gc_delay="1weeks" --gc_disk_headroom="0.1"
--hadoop_home="" --help="false" --hostname_lookup="true" --http_command_executor="false" --http_credentials="/tmp/Endpoint_SlaveEndpointTest_UnauthorizedRequest_1_DyD1ux/http_credentials"
--http_heartbeat_interval="30secs" --initialize_driver_logging="true" --isolation="posix/cpu,posix/mem"
--launcher="posix" --launcher_dir="/mesos/mesos-1.4.0/_build/src" --logbufsecs="0" --logging_level="INFO"
--max_completed_executors_per_framework="150" --oversubscribed_resources_interval="15secs"
--perf_duration="10secs" --perf_interval="1mins" --port="5051" --qos_correction_interval_min="0ns"
--quiet="false" --recover="reconnect" --recovery_timeout="15mins" --registration_backoff_factor="10ms"
--resources="cpus:2;gpus:0;mem:1024;disk:1024;ports:[31000-32000]" --revocable_cpu_low_priority="true"
--runtime_dir="/tmp/Endpoint_SlaveEndpointTest_UnauthorizedRequest_1_DyD1ux" --sandbox_directory="/mnt/mesos/sandbox"
--strict="true" --switch_user="true" --systemd_enable_support="true" --systemd_runtime_directory="/run/systemd/system"
--version="false" --work_dir="/tmp/Endpoint_SlaveEndpointTest_UnauthorizedRequest_1_Er8B6c"
I0519 17:30:44.402681 18718 credentials.hpp:86] Loading credential for authentication from
'/tmp/Endpoint_SlaveEndpointTest_UnauthorizedRequest_1_DyD1ux/credential'
I0519 17:30:44.402909 18718 slave.cpp:258] Agent using credential for: test-principal
I0519 17:30:44.403038 18718 credentials.hpp:37] Loading credentials for authentication from
'/tmp/Endpoint_SlaveEndpointTest_UnauthorizedRequest_1_DyD1ux/http_credentials'
I0519 17:30:44.403373 18718 http.cpp:975] Creating default 'basic' HTTP authenticator for
realm 'mesos-agent-executor'
I0519 17:30:44.403512 18718 http.cpp:996] Creating default 'jwt' HTTP authenticator for realm
'mesos-agent-executor'
I0519 17:30:44.403802 18718 http.cpp:975] Creating default 'basic' HTTP authenticator for
realm 'mesos-agent-readonly'
I0519 17:30:44.403916 18718 http.cpp:996] Creating default 'jwt' HTTP authenticator for realm
'mesos-agent-readonly'
I0519 17:30:44.404096 18718 http.cpp:975] Creating default 'basic' HTTP authenticator for
realm 'mesos-agent-readwrite'
I0519 17:30:44.404227 18718 http.cpp:996] Creating default 'jwt' HTTP authenticator for realm
'mesos-agent-readwrite'
I0519 17:30:44.405666 18718 slave.cpp:529] Agent resources: cpus(*):2; mem(*):1024; disk(*):1024;
ports(*):[31000-32000]
I0519 17:30:44.405738 18718 slave.cpp:537] Agent attributes: [  ]
I0519 17:30:44.405753 18718 slave.cpp:542] Agent hostname: 94002b6d41b0
I0519 17:30:44.405891 18714 status_update_manager.cpp:177] Pausing sending status updates
I0519 17:30:44.407169 18723 state.cpp:62] Recovering state from '/tmp/Endpoint_SlaveEndpointTest_UnauthorizedRequest_1_Er8B6c/meta'
I0519 17:30:44.407577 18728 status_update_manager.cpp:203] Recovering status update manager
I0519 17:30:44.407763 18720 containerizer.cpp:608] Recovering containerizer
I0519 17:30:44.409283 18719 provisioner.cpp:410] Provisioner recovery complete
I0519 17:30:44.409665 18724 slave.cpp:5974] Finished recovery
I0519 17:30:44.410178 18724 slave.cpp:6156] Querying resource estimator for oversubscribable
resources
I0519 17:30:44.410578 18720 slave.cpp:6170] Received oversubscribable resources {} from the
resource estimator
I0519 17:30:44.413461 18728 process.cpp:3730] Handling HTTP event for process 'slave(754)'
with path: '/slave(754)/monitor/statistics.json'
I0519 17:30:44.415333 18728 http.cpp:1115] HTTP GET for /slave(754)/monitor/statistics.json
from 172.17.0.3:33950
I0519 17:30:44.415477 18728 http.cpp:936] Authorizing principal 'test-principal' to GET the
'/monitor/statistics.json' endpoint
I0519 17:30:44.417471 18727 slave.cpp:794] Agent terminating
[       OK ] Endpoint/SlaveEndpointTest.UnauthorizedRequest/1 (28 ms)
[ RUN      ] Endpoint/SlaveEndpointTest.UnauthorizedRequest/2
I0519 17:30:44.429004   503 containerizer.cpp:221] Using isolation: posix/cpu,posix/mem,filesystem/posix,network/cni
W0519 17:30:44.429597   503 backend.cpp:76] Failed to create 'aufs' backend: AufsBackend requires
root privileges
W0519 17:30:44.429721   503 backend.cpp:76] Failed to create 'bind' backend: BindBackend requires
root privileges
I0519 17:30:44.429764   503 provisioner.cpp:249] Using default backend 'copy'
I0519 17:30:44.432648 18725 slave.cpp:225] Mesos agent started on (755)@172.17.0.3:58645
I0519 17:30:44.432670 18725 slave.cpp:226] Flags at startup: --acls="" --appc_simple_discovery_uri_prefix="http://"
--appc_store_dir="/tmp/mesos/store/appc" --authenticate_http_executors="true" --authenticate_http_readonly="true"
--authenticate_http_readwrite="true" --authenticatee="crammd5" --authentication_backoff_factor="1secs"
--authorizer="local" --cgroups_cpu_enable_pids_and_tids_count="false" --cgroups_enable_cfs="false"
--cgroups_hierarchy="/sys/fs/cgroup" --cgroups_limit_swap="false" --cgroups_root="mesos" --container_disk_watch_interval="15secs"
--containerizers="mesos" --credential="/tmp/Endpoint_SlaveEndpointTest_UnauthorizedRequest_2_l47WkR/credential"
--default_role="*" --disk_watch_interval="1mins" --docker="docker" --docker_kill_orphans="true"
--docker_registry="https://registry-1.docker.io" --docker_remove_delay="6hrs" --docker_socket="/var/run/docker.sock"
--docker_stop_timeout="0ns" --docker_store_dir="/tmp/mesos/store/docker" --docker_volume_checkpoint_dir="/var/run/mesos/isolators/docker/volume"
--enforce_container_disk_quota="false" --executor_registration_timeout="1mins" --executor_secret_key="/tmp/Endpoint_SlaveEndpointTest_UnauthorizedRequest_2_l47WkR/executor_secret_key"
--executor_shutdown_grace_period="5secs" --fetcher_cache_dir="/tmp/Endpoint_SlaveEndpointTest_UnauthorizedRequest_2_l47WkR/fetch"
--fetcher_cache_size="2GB" --frameworks_home="" --gc_delay="1weeks" --gc_disk_headroom="0.1"
--hadoop_home="" --help="false" --hostname_lookup="true" --http_command_executor="false" --http_credentials="/tmp/Endpoint_SlaveEndpointTest_UnauthorizedRequest_2_l47WkR/http_credentials"
--http_heartbeat_interval="30secs" --initialize_driver_logging="true" --isolation="posix/cpu,posix/mem"
--launcher="posix" --launcher_dir="/mesos/mesos-1.4.0/_build/src" --logbufsecs="0" --logging_level="INFO"
--max_completed_executors_per_framework="150" --oversubscribed_resources_interval="15secs"
--perf_duration="10secs" --perf_interval="1mins" --port="5051" --qos_correction_interval_min="0ns"
--quiet="false" --recover="reconnect" --recovery_timeout="15mins" --registration_backoff_factor="10ms"
--resources="cpus:2;gpus:0;mem:1024;disk:1024;ports:[31000-32000]" --revocable_cpu_low_priority="true"
--runtime_dir="/tmp/Endpoint_SlaveEndpointTest_UnauthorizedRequest_2_l47WkR" --sandbox_directory="/mnt/mesos/sandbox"
--strict="true" --switch_user="true" --systemd_enable_support="true" --systemd_runtime_directory="/run/systemd/system"
--version="false" --work_dir="/tmp/Endpoint_SlaveEndpointTest_UnauthorizedRequest_2_271HRw"
I0519 17:30:44.433074 18725 credentials.hpp:86] Loading credential for authentication from
'/tmp/Endpoint_SlaveEndpointTest_UnauthorizedRequest_2_l47WkR/credential'
I0519 17:30:44.433218 18725 slave.cpp:258] Agent using credential for: test-principal
I0519 17:30:44.433244 18725 credentials.hpp:37] Loading credentials for authentication from
'/tmp/Endpoint_SlaveEndpointTest_UnauthorizedRequest_2_l47WkR/http_credentials'
I0519 17:30:44.433531 18725 http.cpp:975] Creating default 'basic' HTTP authenticator for
realm 'mesos-agent-executor'
I0519 17:30:44.433668 18725 http.cpp:996] Creating default 'jwt' HTTP authenticator for realm
'mesos-agent-executor'
I0519 17:30:44.433914 18725 http.cpp:975] Creating default 'basic' HTTP authenticator for
realm 'mesos-agent-readonly'
I0519 17:30:44.434041 18725 http.cpp:996] Creating default 'jwt' HTTP authenticator for realm
'mesos-agent-readonly'
I0519 17:30:44.434331 18725 http.cpp:975] Creating default 'basic' HTTP authenticator for
realm 'mesos-agent-readwrite'
I0519 17:30:44.434557 18725 http.cpp:996] Creating default 'jwt' HTTP authenticator for realm
'mesos-agent-readwrite'
I0519 17:30:44.436655 18725 slave.cpp:529] Agent resources: cpus(*):2; mem(*):1024; disk(*):1024;
ports(*):[31000-32000]
I0519 17:30:44.436787 18725 slave.cpp:537] Agent attributes: [  ]
I0519 17:30:44.436805 18725 slave.cpp:542] Agent hostname: 94002b6d41b0
I0519 17:30:44.437618 18727 status_update_manager.cpp:177] Pausing sending status updates
I0519 17:30:44.438885 18721 state.cpp:62] Recovering state from '/tmp/Endpoint_SlaveEndpointTest_UnauthorizedRequest_2_271HRw/meta'
I0519 17:30:44.439273 18719 status_update_manager.cpp:203] Recovering status update manager
I0519 17:30:44.439501 18719 containerizer.cpp:608] Recovering containerizer
I0519 17:30:44.441247 18728 provisioner.cpp:410] Provisioner recovery complete
I0519 17:30:44.441673 18727 slave.cpp:5974] Finished recovery
I0519 17:30:44.442232 18727 slave.cpp:6156] Querying resource estimator for oversubscribable
resources
I0519 17:30:44.442592 18724 slave.cpp:6170] Received oversubscribable resources {} from the
resource estimator
I0519 17:30:44.445766 18723 process.cpp:3730] Handling HTTP event for process 'slave(755)'
with path: '/slave(755)/containers'
I0519 17:30:44.447959 18718 http.cpp:1115] HTTP GET for /slave(755)/containers from 172.17.0.3:33951
I0519 17:30:44.448045 18718 http.cpp:936] Authorizing principal 'test-principal' to GET the
'/containers' endpoint
I0519 17:30:44.450788 18728 slave.cpp:794] Agent terminating
[       OK ] Endpoint/SlaveEndpointTest.UnauthorizedRequest/2 (45 ms)
[ RUN      ] Endpoint/SlaveEndpointTest.NoAuthorizer/0
I0519 17:30:44.473975   503 containerizer.cpp:221] Using isolation: posix/cpu,posix/mem,filesystem/posix,network/cni
W0519 17:30:44.474525   503 backend.cpp:76] Failed to create 'aufs' backend: AufsBackend requires
root privileges
W0519 17:30:44.474634   503 backend.cpp:76] Failed to create 'bind' backend: BindBackend requires
root privileges
I0519 17:30:44.474680   503 provisioner.cpp:249] Using default backend 'copy'
I0519 17:30:44.476285   503 cluster.cpp:448] Creating default 'local' authorizer
I0519 17:30:44.477906 18720 slave.cpp:225] Mesos agent started on (756)@172.17.0.3:58645
I0519 17:30:44.477941 18720 slave.cpp:226] Flags at startup: --acls="" --appc_simple_discovery_uri_prefix="http://"
--appc_store_dir="/tmp/mesos/store/appc" --authenticate_http_executors="true" --authenticate_http_readonly="true"
--authenticate_http_readwrite="true" --authenticatee="crammd5" --authentication_backoff_factor="1secs"
--authorizer="local" --cgroups_cpu_enable_pids_and_tids_count="false" --cgroups_enable_cfs="false"
--cgroups_hierarchy="/sys/fs/cgroup" --cgroups_limit_swap="false" --cgroups_root="mesos" --container_disk_watch_interval="15secs"
--containerizers="mesos" --credential="/tmp/Endpoint_SlaveEndpointTest_NoAuthorizer_0_DtzcCb/credential"
--default_role="*" --disk_watch_interval="1mins" --docker="docker" --docker_kill_orphans="true"
--docker_registry="https://registry-1.docker.io" --docker_remove_delay="6hrs" --docker_socket="/var/run/docker.sock"
--docker_stop_timeout="0ns" --docker_store_dir="/tmp/mesos/store/docker" --docker_volume_checkpoint_dir="/var/run/mesos/isolators/docker/volume"
--enforce_container_disk_quota="false" --executor_registration_timeout="1mins" --executor_secret_key="/tmp/Endpoint_SlaveEndpointTest_NoAuthorizer_0_DtzcCb/executor_secret_key"
--executor_shutdown_grace_period="5secs" --fetcher_cache_dir="/tmp/Endpoint_SlaveEndpointTest_NoAuthorizer_0_DtzcCb/fetch"
--fetcher_cache_size="2GB" --frameworks_home="" --gc_delay="1weeks" --gc_disk_headroom="0.1"
--hadoop_home="" --help="false" --hostname_lookup="true" --http_command_executor="false" --http_credentials="/tmp/Endpoint_SlaveEndpointTest_NoAuthorizer_0_DtzcCb/http_credentials"
--http_heartbeat_interval="30secs" --initialize_driver_logging="true" --isolation="posix/cpu,posix/mem"
--launcher="posix" --launcher_dir="/mesos/mesos-1.4.0/_build/src" --logbufsecs="0" --logging_level="INFO"
--max_completed_executors_per_framework="150" --oversubscribed_resources_interval="15secs"
--perf_duration="10secs" --perf_interval="1mins" --port="5051" --qos_correction_interval_min="0ns"
--quiet="false" --recover="reconnect" --recovery_timeout="15mins" --registration_backoff_factor="10ms"
--resources="cpus:2;gpus:0;mem:1024;disk:1024;ports:[31000-32000]" --revocable_cpu_low_priority="true"
--runtime_dir="/tmp/Endpoint_SlaveEndpointTest_NoAuthorizer_0_DtzcCb" --sandbox_directory="/mnt/mesos/sandbox"
--strict="true" --switch_user="true" --systemd_enable_support="true" --systemd_runtime_directory="/run/systemd/system"
--version="false" --work_dir="/tmp/Endpoint_SlaveEndpointTest_NoAuthorizer_0_WRcC1Q"
I0519 17:30:44.478634 18720 credentials.hpp:86] Loading credential for authentication from
'/tmp/Endpoint_SlaveEndpointTest_NoAuthorizer_0_DtzcCb/credential'
I0519 17:30:44.478869 18720 slave.cpp:258] Agent using credential for: test-principal
I0519 17:30:44.478904 18720 credentials.hpp:37] Loading credentials for authentication from
'/tmp/Endpoint_SlaveEndpointTest_NoAuthorizer_0_DtzcCb/http_credentials'
I0519 17:30:44.479365 18720 http.cpp:975] Creating default 'basic' HTTP authenticator for
realm 'mesos-agent-executor'
I0519 17:30:44.479512 18720 http.cpp:996] Creating default 'jwt' HTTP authenticator for realm
'mesos-agent-executor'
I0519 17:30:44.479868 18720 http.cpp:975] Creating default 'basic' HTTP authenticator for
realm 'mesos-agent-readonly'
I0519 17:30:44.479969 18720 http.cpp:996] Creating default 'jwt' HTTP authenticator for realm
'mesos-agent-readonly'
I0519 17:30:44.480258 18720 http.cpp:975] Creating default 'basic' HTTP authenticator for
realm 'mesos-agent-readwrite'
I0519 17:30:44.480367 18720 http.cpp:996] Creating default 'jwt' HTTP authenticator for realm
'mesos-agent-readwrite'
I0519 17:30:44.481809 18720 slave.cpp:529] Agent resources: cpus(*):2; mem(*):1024; disk(*):1024;
ports(*):[31000-32000]
I0519 17:30:44.481896 18720 slave.cpp:537] Agent attributes: [  ]
I0519 17:30:44.481916 18720 slave.cpp:542] Agent hostname: 94002b6d41b0
I0519 17:30:44.482065 18721 status_update_manager.cpp:177] Pausing sending status updates
I0519 17:30:44.483551 18718 state.cpp:62] Recovering state from '/tmp/Endpoint_SlaveEndpointTest_NoAuthorizer_0_WRcC1Q/meta'
I0519 17:30:44.483911 18715 status_update_manager.cpp:203] Recovering status update manager
I0519 17:30:44.484149 18716 containerizer.cpp:608] Recovering containerizer
I0519 17:30:44.485602 18721 provisioner.cpp:410] Provisioner recovery complete
I0519 17:30:44.486048 18722 slave.cpp:5974] Finished recovery
I0519 17:30:44.486558 18722 slave.cpp:6156] Querying resource estimator for oversubscribable
resources
I0519 17:30:44.486814 18724 slave.cpp:6170] Received oversubscribable resources {} from the
resource estimator
I0519 17:30:44.489042 18716 process.cpp:3730] Handling HTTP event for process 'slave(756)'
with path: '/slave(756)/monitor/statistics'
I0519 17:30:44.490774 18713 http.cpp:1115] HTTP GET for /slave(756)/monitor/statistics from
172.17.0.3:33953
I0519 17:30:44.490854 18713 http.cpp:936] Authorizing principal 'test-principal' to GET the
'/monitor/statistics' endpoint
I0519 17:30:44.494204 18718 slave.cpp:794] Agent terminating
[       OK ] Endpoint/SlaveEndpointTest.NoAuthorizer/0 (50 ms)
[ RUN      ] Endpoint/SlaveEndpointTest.NoAuthorizer/1
I0519 17:30:44.524902   503 containerizer.cpp:221] Using isolation: posix/cpu,posix/mem,filesystem/posix,network/cni
W0519 17:30:44.525439   503 backend.cpp:76] Failed to create 'aufs' backend: AufsBackend requires
root privileges
W0519 17:30:44.525579   503 backend.cpp:76] Failed to create 'bind' backend: BindBackend requires
root privileges
I0519 17:30:44.525622   503 provisioner.cpp:249] Using default backend 'copy'
I0519 17:30:44.527178   503 cluster.cpp:448] Creating default 'local' authorizer
I0519 17:30:44.528733 18715 slave.cpp:225] Mesos agent started on (757)@172.17.0.3:58645
I0519 17:30:44.528758 18715 slave.cpp:226] Flags at startup: --acls="" --appc_simple_discovery_uri_prefix="http://"
--appc_store_dir="/tmp/mesos/store/appc" --authenticate_http_executors="true" --authenticate_http_readonly="true"
--authenticate_http_readwrite="true" --authenticatee="crammd5" --authentication_backoff_factor="1secs"
--authorizer="local" --cgroups_cpu_enable_pids_and_tids_count="false" --cgroups_enable_cfs="false"
--cgroups_hierarchy="/sys/fs/cgroup" --cgroups_limit_swap="false" --cgroups_root="mesos" --container_disk_watch_interval="15secs"
--containerizers="mesos" --credential="/tmp/Endpoint_SlaveEndpointTest_NoAuthorizer_1_PUOppw/credential"
--default_role="*" --disk_watch_interval="1mins" --docker="docker" --docker_kill_orphans="true"
--docker_registry="https://registry-1.docker.io" --docker_remove_delay="6hrs" --docker_socket="/var/run/docker.sock"
--docker_stop_timeout="0ns" --docker_store_dir="/tmp/mesos/store/docker" --docker_volume_checkpoint_dir="/var/run/mesos/isolators/docker/volume"
--enforce_container_disk_quota="false" --executor_registration_timeout="1mins" --executor_secret_key="/tmp/Endpoint_SlaveEndpointTest_NoAuthorizer_1_PUOppw/executor_secret_key"
--executor_shutdown_grace_period="5secs" --fetcher_cache_dir="/tmp/Endpoint_SlaveEndpointTest_NoAuthorizer_1_PUOppw/fetch"
--fetcher_cache_size="2GB" --frameworks_home="" --gc_delay="1weeks" --gc_disk_headroom="0.1"
--hadoop_home="" --help="false" --hostname_lookup="true" --http_command_executor="false" --http_credentials="/tmp/Endpoint_SlaveEndpointTest_NoAuthorizer_1_PUOppw/http_credentials"
--http_heartbeat_interval="30secs" --initialize_driver_logging="true" --isolation="posix/cpu,posix/mem"
--launcher="posix" --launcher_dir="/mesos/mesos-1.4.0/_build/src" --logbufsecs="0" --logging_level="INFO"
--max_completed_executors_per_framework="150" --oversubscribed_resources_interval="15secs"
--perf_duration="10secs" --perf_interval="1mins" --port="5051" --qos_correction_interval_min="0ns"
--quiet="false" --recover="reconnect" --recovery_timeout="15mins" --registration_backoff_factor="10ms"
--resources="cpus:2;gpus:0;mem:1024;disk:1024;ports:[31000-32000]" --revocable_cpu_low_priority="true"
--runtime_dir="/tmp/Endpoint_SlaveEndpointTest_NoAuthorizer_1_PUOppw" --sandbox_directory="/mnt/mesos/sandbox"
--strict="true" --switch_user="true" --systemd_enable_support="true" --systemd_runtime_directory="/run/systemd/system"
--version="false" --work_dir="/tmp/Endpoint_SlaveEndpointTest_NoAuthorizer_1_ipmzGb"
I0519 17:30:44.529294 18715 credentials.hpp:86] Loading credential for authentication from
'/tmp/Endpoint_SlaveEndpointTest_NoAuthorizer_1_PUOppw/credential'
I0519 17:30:44.529497 18715 slave.cpp:258] Agent using credential for: test-principal
I0519 17:30:44.529548 18715 credentials.hpp:37] Loading credentials for authentication from
'/tmp/Endpoint_SlaveEndpointTest_NoAuthorizer_1_PUOppw/http_credentials'
I0519 17:30:44.529925 18715 http.cpp:975] Creating default 'basic' HTTP authenticator for
realm 'mesos-agent-executor'
I0519 17:30:44.530057 18715 http.cpp:996] Creating default 'jwt' HTTP authenticator for realm
'mesos-agent-executor'
I0519 17:30:44.530391 18715 http.cpp:975] Creating default 'basic' HTTP authenticator for
realm 'mesos-agent-readonly'
I0519 17:30:44.530504 18715 http.cpp:996] Creating default 'jwt' HTTP authenticator for realm
'mesos-agent-readonly'
I0519 17:30:44.530851 18715 http.cpp:975] Creating default 'basic' HTTP authenticator for
realm 'mesos-agent-readwrite'
I0519 17:30:44.531060 18715 http.cpp:996] Creating default 'jwt' HTTP authenticator for realm
'mesos-agent-readwrite'
I0519 17:30:44.532666 18715 slave.cpp:529] Agent resources: cpus(*):2; mem(*):1024; disk(*):1024;
ports(*):[31000-32000]
I0519 17:30:44.532747 18715 slave.cpp:537] Agent attributes: [  ]
I0519 17:30:44.532768 18715 slave.cpp:542] Agent hostname: 94002b6d41b0
I0519 17:30:44.532917 18718 status_update_manager.cpp:177] Pausing sending status updates
I0519 17:30:44.534354 18724 state.cpp:62] Recovering state from '/tmp/Endpoint_SlaveEndpointTest_NoAuthorizer_1_ipmzGb/meta'
I0519 17:30:44.534729 18718 status_update_manager.cpp:203] Recovering status update manager
I0519 17:30:44.534930 18726 containerizer.cpp:608] Recovering containerizer
I0519 17:30:44.536279 18717 provisioner.cpp:410] Provisioner recovery complete
I0519 17:30:44.536692 18714 slave.cpp:5974] Finished recovery
I0519 17:30:44.537207 18714 slave.cpp:6156] Querying resource estimator for oversubscribable
resources
I0519 17:30:44.537467 18724 slave.cpp:6170] Received oversubscribable resources {} from the
resource estimator
I0519 17:30:44.540177 18720 process.cpp:3730] Handling HTTP event for process 'slave(757)'
with path: '/slave(757)/monitor/statistics.json'
I0519 17:30:44.542197 18716 http.cpp:1115] HTTP GET for /slave(757)/monitor/statistics.json
from 172.17.0.3:33955
I0519 17:30:44.542286 18716 http.cpp:936] Authorizing principal 'test-principal' to GET the
'/monitor/statistics.json' endpoint
I0519 17:30:44.545699 18726 slave.cpp:794] Agent terminating
[       OK ] Endpoint/SlaveEndpointTest.NoAuthorizer/1 (31 ms)
[ RUN      ] Endpoint/SlaveEndpointTest.NoAuthorizer/2
I0519 17:30:44.555840   503 containerizer.cpp:221] Using isolation: posix/cpu,posix/mem,filesystem/posix,network/cni
W0519 17:30:44.556356   503 backend.cpp:76] Failed to create 'aufs' backend: AufsBackend requires
root privileges
W0519 17:30:44.556453   503 backend.cpp:76] Failed to create 'bind' backend: BindBackend requires
root privileges
I0519 17:30:44.556491   503 provisioner.cpp:249] Using default backend 'copy'
I0519 17:30:44.558009   503 cluster.cpp:448] Creating default 'local' authorizer
I0519 17:30:44.559739 18716 slave.cpp:225] Mesos agent started on (758)@172.17.0.3:58645
I0519 17:30:44.559846 18716 slave.cpp:226] Flags at startup: --acls="" --appc_simple_discovery_uri_prefix="http://"
--appc_store_dir="/tmp/mesos/store/appc" --authenticate_http_executors="true" --authenticate_http_readonly="true"
--authenticate_http_readwrite="true" --authenticatee="crammd5" --authentication_backoff_factor="1secs"
--authorizer="local" --cgroups_cpu_enable_pids_and_tids_count="false" --cgroups_enable_cfs="false"
--cgroups_hierarchy="/sys/fs/cgroup" --cgroups_limit_swap="false" --cgroups_root="mesos" --container_disk_watch_interval="15secs"
--containerizers="mesos" --credential="/tmp/Endpoint_SlaveEndpointTest_NoAuthorizer_2_Xxl8zR/credential"
--default_role="*" --disk_watch_interval="1mins" --docker="docker" --docker_kill_orphans="true"
--docker_registry="https://registry-1.docker.io" --docker_remove_delay="6hrs" --docker_socket="/var/run/docker.sock"
--docker_stop_timeout="0ns" --docker_store_dir="/tmp/mesos/store/docker" --docker_volume_checkpoint_dir="/var/run/mesos/isolators/docker/volume"
--enforce_container_disk_quota="false" --executor_registration_timeout="1mins" --executor_secret_key="/tmp/Endpoint_SlaveEndpointTest_NoAuthorizer_2_Xxl8zR/executor_secret_key"
--executor_shutdown_grace_period="5secs" --fetcher_cache_dir="/tmp/Endpoint_SlaveEndpointTest_NoAuthorizer_2_Xxl8zR/fetch"
--fetcher_cache_size="2GB" --frameworks_home="" --gc_delay="1weeks" --gc_disk_headroom="0.1"
--hadoop_home="" --help="false" --hostname_lookup="true" --http_command_executor="false" --http_credentials="/tmp/Endpoint_SlaveEndpointTest_NoAuthorizer_2_Xxl8zR/http_credentials"
--http_heartbeat_interval="30secs" --initialize_driver_logging="true" --isolation="posix/cpu,posix/mem"
--launcher="posix" --launcher_dir="/mesos/mesos-1.4.0/_build/src" --logbufsecs="0" --logging_level="INFO"
--max_completed_executors_per_framework="150" --oversubscribed_resources_interval="15secs"
--perf_duration="10secs" --perf_interval="1mins" --port="5051" --qos_correction_interval_min="0ns"
--quiet="false" --recover="reconnect" --recovery_timeout="15mins" --registration_backoff_factor="10ms"
--resources="cpus:2;gpus:0;mem:1024;disk:1024;ports:[31000-32000]" --revocable_cpu_low_priority="true"
--runtime_dir="/tmp/Endpoint_SlaveEndpointTest_NoAuthorizer_2_Xxl8zR" --sandbox_directory="/mnt/mesos/sandbox"
--strict="true" --switch_user="true" --systemd_enable_support="true" --systemd_runtime_directory="/run/systemd/system"
--version="false" --work_dir="/tmp/Endpoint_SlaveEndpointTest_NoAuthorizer_2_yNadMw"
I0519 17:30:44.560251 18716 credentials.hpp:86] Loading credential for authentication from
'/tmp/Endpoint_SlaveEndpointTest_NoAuthorizer_2_Xxl8zR/credential'
I0519 17:30:44.573937 18716 slave.cpp:258] Agent using credential for: test-principal
I0519 17:30:44.573971 18716 credentials.hpp:37] Loading credentials for authentication from
'/tmp/Endpoint_SlaveEndpointTest_NoAuthorizer_2_Xxl8zR/http_credentials'
I0519 17:30:44.574375 18716 http.cpp:975] Creating default 'basic' HTTP authenticator for
realm 'mesos-agent-executor'
I0519 17:30:44.574514 18716 http.cpp:996] Creating default 'jwt' HTTP authenticator for realm
'mesos-agent-executor'
I0519 17:30:44.574789 18716 http.cpp:975] Creating default 'basic' HTTP authenticator for
realm 'mesos-agent-readonly'
I0519 17:30:44.574954 18716 http.cpp:996] Creating default 'jwt' HTTP authenticator for realm
'mesos-agent-readonly'
I0519 17:30:44.575242 18716 http.cpp:975] Creating default 'basic' HTTP authenticator for
realm 'mesos-agent-readwrite'
I0519 17:30:44.575376 18716 http.cpp:996] Creating default 'jwt' HTTP authenticator for realm
'mesos-agent-readwrite'
I0519 17:30:44.576666 18716 slave.cpp:529] Agent resources: cpus(*):2; mem(*):1024; disk(*):1024;
ports(*):[31000-32000]
I0519 17:30:44.576740 18716 slave.cpp:537] Agent attributes: [  ]
I0519 17:30:44.576751 18716 slave.cpp:542] Agent hostname: 94002b6d41b0
I0519 17:30:44.576885 18717 status_update_manager.cpp:177] Pausing sending status updates
I0519 17:30:44.578120 18714 state.cpp:62] Recovering state from '/tmp/Endpoint_SlaveEndpointTest_NoAuthorizer_2_yNadMw/meta'
I0519 17:30:44.578554 18715 status_update_manager.cpp:203] Recovering status update manager
I0519 17:30:44.578743 18717 containerizer.cpp:608] Recovering containerizer
I0519 17:30:44.580183 18722 provisioner.cpp:410] Provisioner recovery complete
I0519 17:30:44.580557 18728 slave.cpp:5974] Finished recovery
I0519 17:30:44.581117 18728 slave.cpp:6156] Querying resource estimator for oversubscribable
resources
I0519 17:30:44.581446 18714 slave.cpp:6170] Received oversubscribable resources {} from the
resource estimator
I0519 17:30:44.583709 18724 process.cpp:3730] Handling HTTP event for process 'slave(758)'
with path: '/slave(758)/containers'
I0519 17:30:44.585618 18721 http.cpp:1115] HTTP GET for /slave(758)/containers from 172.17.0.3:33956
I0519 17:30:44.585706 18721 http.cpp:936] Authorizing principal 'test-principal' to GET the
'/containers' endpoint
I0519 17:30:44.589146 18723 slave.cpp:794] Agent terminating
[       OK ] Endpoint/SlaveEndpointTest.NoAuthorizer/2 (63 ms)
[----------] 9 tests from Endpoint/SlaveEndpointTest (399 ms total)

[----------] Global test environment tear-down
[==========] 1583 tests from 177 test cases ran. (662881 ms total)
[  PASSED  ] 1582 tests.
[  FAILED  ] 1 test, listed below:
[  FAILED  ] MasterTest.IgnoreOldAgentReregistration

 1 FAILED TEST
  YOU HAVE 22 DISABLED TESTS

E0519 17:30:44.680768 18729 process.cpp:950] Failed to accept socket: future discarded
make[4]: *** [check-local] Error 1
make[4]: Leaving directory `/mesos/mesos-1.4.0/_build/src'
make[3]: *** [check-am] Error 2
make[3]: Leaving directory `/mesos/mesos-1.4.0/_build/src'
make[2]: *** [check] Error 2
make[2]: Leaving directory `/mesos/mesos-1.4.0/_build/src'
make[1]: *** [check-recursive] Error 1
make[1]: Leaving directory `/mesos/mesos-1.4.0/_build'
make: *** [distcheck] Error 1
+ docker rmi mesos-1495211466-5612
Untagged: mesos-1495211466-5612:latest
Deleted: sha256:8e41923d4387ae5d360664e39638bac2556f9852201bd99f1fc0fffe22be4204
Deleted: sha256:ce082220fba11d0aeedb1522099099893f27c248ac9717cf5fd1ed47e4db5bdb
Deleted: sha256:e5891cddcc5a726e4c12cecb68bb55c67363518be349236efcf24b1beb40ffa6
Deleted: sha256:bb8e5da1fe26d536f048a5312754ee8d3715ffa6b92d9b582d324f9cf60cb268
Deleted: sha256:1295eaa0bc2c3c65330052a5325a6d9296eba60908c773d4159e21e020f01d70
Deleted: sha256:e1d554c8b1fde8a0ac1e61b60000e22591b3531eb9033c3e8fe3e668128a9bfb
Deleted: sha256:575f06306c55dd7feea3b59beb08be0cfb13a65b9e324b55fe2444139bb2be96
Deleted: sha256:11ecd9d73c2750a83ab4104bd4db549b3cfea488f030cb757e6aefe853288076
Deleted: sha256:3c675efca4c0da1c450e3f11d44e07451e3ae54846858189dd63c8065e65bc4f
Deleted: sha256:86f714596c50946da931460470999b7e256f5752a0838c18d70f14ec56934501
Deleted: sha256:c072421b4f8443fdeb9b9b22298f5e91a0e982ff6aa2b807bbf9ac225521f0a2
Deleted: sha256:bac2785f5dce14c1b59a70b0b8d1017b8133a41a43b15d8774ce3f40e61d4800
Deleted: sha256:ef63d0adf01be9c523b92291a85d897f0177b0830e199506ac9944e410566763
Deleted: sha256:46e7a352e2765e37fc18fc71581f4ff60a6e888f25d06c8a2ebec4480daca69a
Deleted: sha256:3995b599b5a1c0e0e489715db174f05845f1639b4212217b4914c5a23c731640
Deleted: sha256:3ea5e6c953edc0a2179e93d72d2cc4b74629c13089c2de87f10cfa2761f7df6d
Deleted: sha256:962f1903f6cd9aacedf37a2a82a2a49c47eedaedd101fd7ad04557ab85388d4d
Deleted: sha256:f71d904cb1f1fcd2d0120d2bf6a2d0baf1c36a4d8c784009eedc7975116a2c63
Deleted: sha256:fd7997230f249c73607037bc694614db67023f11925a39cfafd37cdf17a652d7
Deleted: sha256:7c5b5c86d12e3abdd61f2cda39bbdbf02ca840f27d6bcf4c77f41df72bdf66f5
Deleted: sha256:adef2ba7d465b33f7800c4e66372a0ac13b167387973e5db3cfd31f5fff85a30
Deleted: sha256:7f9976340c652580ff64fcd535981f7f83db053ffa31377856d7eba60e6f00ed
Deleted: sha256:761bcd1438b02d0a7f0a0d097a75cf7fa25f145a3d7a153371dcff667e433e1c
Deleted: sha256:dae296e1ee2aaa2c3c84f52ee3df82ce103a30247d32be84192c23abebc43fff
Build step 'Execute shell' marked build as failure

Mime
View raw message