mesos-builds mailing list archives

Site index · List index
Message view « Date » · « Thread »
Top « Date » · « Thread »
From Apache Jenkins Server <jenk...@builds.apache.org>
Subject Build failed in Jenkins: Mesos-Buildbot » autotools,gcc,--verbose --enable-libevent --enable-ssl,GLOG_v=1 MESOS_VERBOSE=1,centos:7,(docker||Hadoop)&&(!ubuntu-us1)&&(!ubuntu-eu2) #3753
Date Wed, 31 May 2017 21:55:53 GMT
See <https://builds.apache.org/job/Mesos-Buildbot/BUILDTOOL=autotools,COMPILER=gcc,CONFIGURATION=--verbose%20--enable-libevent%20--enable-ssl,ENVIRONMENT=GLOG_v=1%20MESOS_VERBOSE=1,OS=centos%3A7,label_exp=(docker%7C%7CHadoop)&&(!ubuntu-us1)&&(!ubuntu-eu2)/3753/display/redirect?page=changes>

Changes:

[neil.conway] Fixed flakiness in OneWayPartitionTest.MasterToSlave.

[neil.conway] Cleaned up agent re-registration code in the master slightly.

[neil.conway] Removed code for handling missing FrameworkInfo of a running task.

[neil.conway] Removed orphaned tasks from webui.

[neil.conway] Fixed some inaccurate comments.

[neil.conway] Removed outdated comments.

[neil.conway] Removed code for old agents when handling status updates.

[neil.conway] Removed logic for handling missing FrameworkID in ExecutorInfo.

[neil.conway] Cleaned up master code to check for PARTITION_AWARE capability.

[neil.conway] Marked a few deprecated proto fields with the "deprecated" option.

[neil.conway] Simplified master logic for agent re-registration.

------------------------------------------
[...truncated 2.67 MB...]
NOTE: Set LIBPROCESS_SSL_VERIFY_CERT=1 to enable peer certificate verification
I0531 21:55:40.922338  2387 openssl.cpp:435] Will only verify peer certificate if presented!
NOTE: Set LIBPROCESS_SSL_REQUIRE_CERT=1 to require peer certificate verification
I0531 21:55:40.934479  2404 libevent_ssl_socket.cpp:1170] Socket error: error:140760FC:SSL
routines:SSL23_GET_CLIENT_HELLO:unknown protocol
I0531 21:55:41.022456  2387 ssl_tests.cpp:638] Testing server protocol 'LIBPROCESS_SSL_ENABLE_TLS_V1_1'
I0531 21:55:41.023193  2387 openssl.cpp:419] CA file path is unspecified! NOTE: Set CA file
path with LIBPROCESS_SSL_CA_FILE=<filepath>
I0531 21:55:41.023303  2387 openssl.cpp:424] CA directory path unspecified! NOTE: Set CA directory
path with LIBPROCESS_SSL_CA_DIR=<dirpath>
I0531 21:55:41.023389  2387 openssl.cpp:429] Will not verify peer certificate!
NOTE: Set LIBPROCESS_SSL_VERIFY_CERT=1 to enable peer certificate verification
I0531 21:55:41.023406  2387 openssl.cpp:435] Will only verify peer certificate if presented!
NOTE: Set LIBPROCESS_SSL_REQUIRE_CERT=1 to require peer certificate verification
I0531 21:55:41.035768  2404 libevent_ssl_socket.cpp:1170] Socket error: error:140760FC:SSL
routines:SSL23_GET_CLIENT_HELLO:unknown protocol
I0531 21:55:41.123597  2387 ssl_tests.cpp:638] Testing server protocol 'LIBPROCESS_SSL_ENABLE_TLS_V1_2'
I0531 21:55:41.124336  2387 openssl.cpp:419] CA file path is unspecified! NOTE: Set CA file
path with LIBPROCESS_SSL_CA_FILE=<filepath>
I0531 21:55:41.124392  2387 openssl.cpp:424] CA directory path unspecified! NOTE: Set CA directory
path with LIBPROCESS_SSL_CA_DIR=<dirpath>
I0531 21:55:41.124419  2387 openssl.cpp:429] Will not verify peer certificate!
NOTE: Set LIBPROCESS_SSL_VERIFY_CERT=1 to enable peer certificate verification
I0531 21:55:41.124442  2387 openssl.cpp:435] Will only verify peer certificate if presented!
NOTE: Set LIBPROCESS_SSL_REQUIRE_CERT=1 to require peer certificate verification
I0531 21:55:41.136803  2404 libevent_ssl_socket.cpp:1170] Socket error: error:140760FC:SSL
routines:SSL23_GET_CLIENT_HELLO:unknown protocol
[       OK ] SSLTest.NoValidDowngradeEachProtocol (705 ms)
[ RUN      ] SSLTest.PeerAddress
I0531 21:55:41.739172  2387 openssl.cpp:419] CA file path is unspecified! NOTE: Set CA file
path with LIBPROCESS_SSL_CA_FILE=<filepath>
I0531 21:55:41.739197  2387 openssl.cpp:424] CA directory path unspecified! NOTE: Set CA directory
path with LIBPROCESS_SSL_CA_DIR=<dirpath>
I0531 21:55:41.739202  2387 openssl.cpp:429] Will not verify peer certificate!
NOTE: Set LIBPROCESS_SSL_VERIFY_CERT=1 to enable peer certificate verification
I0531 21:55:41.739210  2387 openssl.cpp:435] Will only verify peer certificate if presented!
NOTE: Set LIBPROCESS_SSL_REQUIRE_CERT=1 to require peer certificate verification
[       OK ] SSLTest.PeerAddress (520 ms)
[ RUN      ] SSLTest.HTTPSGet
I0531 21:55:42.358686  2387 openssl.cpp:419] CA file path is unspecified! NOTE: Set CA file
path with LIBPROCESS_SSL_CA_FILE=<filepath>
I0531 21:55:42.358711  2387 openssl.cpp:424] CA directory path unspecified! NOTE: Set CA directory
path with LIBPROCESS_SSL_CA_DIR=<dirpath>
I0531 21:55:42.358719  2387 openssl.cpp:429] Will not verify peer certificate!
NOTE: Set LIBPROCESS_SSL_VERIFY_CERT=1 to enable peer certificate verification
I0531 21:55:42.358723  2387 openssl.cpp:435] Will only verify peer certificate if presented!
NOTE: Set LIBPROCESS_SSL_REQUIRE_CERT=1 to require peer certificate verification
[       OK ] SSLTest.HTTPSGet (619 ms)
[ RUN      ] SSLTest.HTTPSPost
I0531 21:55:43.038259  2387 openssl.cpp:419] CA file path is unspecified! NOTE: Set CA file
path with LIBPROCESS_SSL_CA_FILE=<filepath>
I0531 21:55:43.038283  2387 openssl.cpp:424] CA directory path unspecified! NOTE: Set CA directory
path with LIBPROCESS_SSL_CA_DIR=<dirpath>
I0531 21:55:43.038288  2387 openssl.cpp:429] Will not verify peer certificate!
NOTE: Set LIBPROCESS_SSL_VERIFY_CERT=1 to enable peer certificate verification
I0531 21:55:43.038296  2387 openssl.cpp:435] Will only verify peer certificate if presented!
NOTE: Set LIBPROCESS_SSL_REQUIRE_CERT=1 to require peer certificate verification
[       OK ] SSLTest.HTTPSPost (680 ms)
[ RUN      ] SSLTest.SilentSocket
I0531 21:55:43.308635  2387 openssl.cpp:419] CA file path is unspecified! NOTE: Set CA file
path with LIBPROCESS_SSL_CA_FILE=<filepath>
I0531 21:55:43.308660  2387 openssl.cpp:424] CA directory path unspecified! NOTE: Set CA directory
path with LIBPROCESS_SSL_CA_DIR=<dirpath>
I0531 21:55:43.308668  2387 openssl.cpp:429] Will not verify peer certificate!
NOTE: Set LIBPROCESS_SSL_VERIFY_CERT=1 to enable peer certificate verification
I0531 21:55:43.308675  2387 openssl.cpp:435] Will only verify peer certificate if presented!
NOTE: Set LIBPROCESS_SSL_REQUIRE_CERT=1 to require peer certificate verification
I0531 21:55:43.314676  2404 libevent_ssl_socket.cpp:1170] Socket error: error:00000000:lib(0):func(0):reason(0)
[       OK ] SSLTest.SilentSocket (270 ms)
[----------] 15 tests from SSLTest (8734 ms total)

[----------] 42 tests from Scheme/HTTPTest
[ RUN      ] Scheme/HTTPTest.Endpoints/0
I0531 21:55:43.643916  2387 openssl.cpp:419] CA file path is unspecified! NOTE: Set CA file
path with LIBPROCESS_SSL_CA_FILE=<filepath>
I0531 21:55:43.643939  2387 openssl.cpp:424] CA directory path unspecified! NOTE: Set CA directory
path with LIBPROCESS_SSL_CA_DIR=<dirpath>
I0531 21:55:43.643942  2387 openssl.cpp:429] Will not verify peer certificate!
NOTE: Set LIBPROCESS_SSL_VERIFY_CERT=1 to enable peer certificate verification
I0531 21:55:43.643950  2387 openssl.cpp:435] Will only verify peer certificate if presented!
NOTE: Set LIBPROCESS_SSL_REQUIRE_CERT=1 to require peer certificate verification
E0531 21:55:43.644346  2404 process.cpp:968] Failed to accept socket: future discarded
I0531 21:55:43.647352  2387 process.cpp:1282] libprocess is initialized on 172.17.0.2:41798
with 16 worker threads
I0531 21:55:43.652612  3151 process.cpp:3778] Handling HTTP event for process '(74)' with
path: '/(74)/body'
I0531 21:55:43.657573  3137 process.cpp:3778] Handling HTTP event for process '(74)' with
path: '/(74)/pipe'
I0531 21:55:43.663116  3140 process.cpp:3778] Handling HTTP event for process '(74)' with
path: '/(74)/body'
I0531 21:55:43.663581  3146 process.cpp:3835] Failed to process request for '/(74)/body':
failure
I0531 21:55:43.663650  3149 process.cpp:1495] Returning '500 Internal Server Error' for '/(74)/body'
(failure)
[       OK ] Scheme/HTTPTest.Endpoints/0 (349 ms)
[ RUN      ] Scheme/HTTPTest.Endpoints/1
I0531 21:55:43.667814  2387 process.cpp:1282] libprocess is initialized on 172.17.0.2:43682
with 16 worker threads
I0531 21:55:43.668697  3163 process.cpp:3778] Handling HTTP event for process '(75)' with
path: '/(75)/body'
I0531 21:55:43.670487  3163 process.cpp:3778] Handling HTTP event for process '(75)' with
path: '/(75)/pipe'
I0531 21:55:43.672289  3166 process.cpp:3778] Handling HTTP event for process '(75)' with
path: '/(75)/body'
I0531 21:55:43.672699  3164 process.cpp:3835] Failed to process request for '/(75)/body':
failure
I0531 21:55:43.672724  3155 process.cpp:1495] Returning '500 Internal Server Error' for '/(75)/body'
(failure)
I0531 21:55:43.673290  3170 process.cpp:855] Decode failure: Connection reset by peer
E0531 21:55:43.673352  3170 process.cpp:2468] Failed to shutdown socket with fd 9, address
172.17.0.2:43682: Transport endpoint is not connected
[       OK ] Scheme/HTTPTest.Endpoints/1 (9 ms)
[ RUN      ] Scheme/HTTPTest.EndpointsHelp/0
I0531 21:55:44.279096  2387 openssl.cpp:419] CA file path is unspecified! NOTE: Set CA file
path with LIBPROCESS_SSL_CA_FILE=<filepath>
I0531 21:55:44.279121  2387 openssl.cpp:424] CA directory path unspecified! NOTE: Set CA directory
path with LIBPROCESS_SSL_CA_DIR=<dirpath>
I0531 21:55:44.279129  2387 openssl.cpp:429] Will not verify peer certificate!
NOTE: Set LIBPROCESS_SSL_VERIFY_CERT=1 to enable peer certificate verification
I0531 21:55:44.279134  2387 openssl.cpp:435] Will only verify peer certificate if presented!
NOTE: Set LIBPROCESS_SSL_REQUIRE_CERT=1 to require peer certificate verification
E0531 21:55:44.279541  3170 process.cpp:968] Failed to accept socket: future discarded
I0531 21:55:44.281450  2387 process.cpp:1282] libprocess is initialized on 172.17.0.2:46447
with 16 worker threads
I0531 21:55:44.286834  3181 process.cpp:3778] Handling HTTP event for process 'help' with
path: '/help'
I0531 21:55:44.292492  3174 process.cpp:3778] Handling HTTP event for process 'help' with
path: '/help'
I0531 21:55:44.298779  3182 process.cpp:3778] Handling HTTP event for process 'help' with
path: '/help/(76)/body'
I0531 21:55:44.304103  3183 process.cpp:3778] Handling HTTP event for process 'help' with
path: '/help/(76)/a/b/c'
[       OK ] Scheme/HTTPTest.EndpointsHelp/0 (632 ms)
[ RUN      ] Scheme/HTTPTest.EndpointsHelp/1
I0531 21:55:44.308023  2387 process.cpp:1282] libprocess is initialized on 172.17.0.2:55387
with 16 worker threads
I0531 21:55:44.309044  3200 process.cpp:3778] Handling HTTP event for process 'help' with
path: '/help'
I0531 21:55:44.311033  3199 process.cpp:3778] Handling HTTP event for process 'help' with
path: '/help'
I0531 21:55:44.313699  3200 process.cpp:3778] Handling HTTP event for process 'help' with
path: '/help/(77)/body'
I0531 21:55:44.315343  3192 process.cpp:3778] Handling HTTP event for process 'help' with
path: '/help/(77)/a/b/c'
[       OK ] Scheme/HTTPTest.EndpointsHelp/1 (11 ms)
[ RUN      ] Scheme/HTTPTest.EndpointsHelpRemoval/0
I0531 21:55:44.652467  2387 openssl.cpp:419] CA file path is unspecified! NOTE: Set CA file
path with LIBPROCESS_SSL_CA_FILE=<filepath>
I0531 21:55:44.652492  2387 openssl.cpp:424] CA directory path unspecified! NOTE: Set CA directory
path with LIBPROCESS_SSL_CA_DIR=<dirpath>
I0531 21:55:44.652496  2387 openssl.cpp:429] Will not verify peer certificate!
NOTE: Set LIBPROCESS_SSL_VERIFY_CERT=1 to enable peer certificate verification
I0531 21:55:44.652504  2387 openssl.cpp:435] Will only verify peer certificate if presented!
NOTE: Set LIBPROCESS_SSL_REQUIRE_CERT=1 to require peer certificate verification
E0531 21:55:44.652918  3204 process.cpp:968] Failed to accept socket: future discarded
I0531 21:55:44.654881  2387 process.cpp:1282] libprocess is initialized on 172.17.0.2:56231
with 16 worker threads
I0531 21:55:44.660464  3208 process.cpp:3778] Handling HTTP event for process 'help' with
path: '/help/(78)/body'
I0531 21:55:44.666059  3210 process.cpp:3778] Handling HTTP event for process 'help' with
path: '/help/(78)/bogus'
[       OK ] Scheme/HTTPTest.EndpointsHelpRemoval/0 (351 ms)
[ RUN      ] Scheme/HTTPTest.EndpointsHelpRemoval/1
I0531 21:55:44.669826  2387 process.cpp:1282] libprocess is initialized on 172.17.0.2:43446
with 16 worker threads
I0531 21:55:44.671038  3233 process.cpp:3778] Handling HTTP event for process 'help' with
path: '/help/(79)/body'
I0531 21:55:44.673105  3228 process.cpp:3778] Handling HTTP event for process 'help' with
path: '/help/(79)/bogus'
[       OK ] Scheme/HTTPTest.EndpointsHelpRemoval/1 (7 ms)
[ RUN      ] Scheme/HTTPTest.PipeEOF/0
I0531 21:55:44.948614  2387 openssl.cpp:419] CA file path is unspecified! NOTE: Set CA file
path with LIBPROCESS_SSL_CA_FILE=<filepath>
I0531 21:55:44.948638  2387 openssl.cpp:424] CA directory path unspecified! NOTE: Set CA directory
path with LIBPROCESS_SSL_CA_DIR=<dirpath>
I0531 21:55:44.948643  2387 openssl.cpp:429] Will not verify peer certificate!
NOTE: Set LIBPROCESS_SSL_VERIFY_CERT=1 to enable peer certificate verification
I0531 21:55:44.948652  2387 openssl.cpp:435] Will only verify peer certificate if presented!
NOTE: Set LIBPROCESS_SSL_REQUIRE_CERT=1 to require peer certificate verification
E0531 21:55:44.949105  3238 process.cpp:968] Failed to accept socket: future discarded
I0531 21:55:44.951119  2387 process.cpp:1282] libprocess is initialized on 172.17.0.2:33181
with 16 worker threads
[       OK ] Scheme/HTTPTest.PipeEOF/0 (278 ms)
[ RUN      ] Scheme/HTTPTest.PipeEOF/1
I0531 21:55:44.962319  2387 process.cpp:1282] libprocess is initialized on 172.17.0.2:44634
with 16 worker threads
[       OK ] Scheme/HTTPTest.PipeEOF/1 (10 ms)
[ RUN      ] Scheme/HTTPTest.PipeFailure/0
I0531 21:55:45.158002  2387 openssl.cpp:419] CA file path is unspecified! NOTE: Set CA file
path with LIBPROCESS_SSL_CA_FILE=<filepath>
I0531 21:55:45.158025  2387 openssl.cpp:424] CA directory path unspecified! NOTE: Set CA directory
path with LIBPROCESS_SSL_CA_DIR=<dirpath>
I0531 21:55:45.158030  2387 openssl.cpp:429] Will not verify peer certificate!
NOTE: Set LIBPROCESS_SSL_VERIFY_CERT=1 to enable peer certificate verification
I0531 21:55:45.158032  2387 openssl.cpp:435] Will only verify peer certificate if presented!
NOTE: Set LIBPROCESS_SSL_REQUIRE_CERT=1 to require peer certificate verification
E0531 21:55:45.158525  3272 process.cpp:968] Failed to accept socket: future discarded
I0531 21:55:45.162309  2387 process.cpp:1282] libprocess is initialized on 172.17.0.2:59614
with 16 worker threads
[       OK ] Scheme/HTTPTest.PipeFailure/0 (200 ms)
[ RUN      ] Scheme/HTTPTest.PipeFailure/1
I0531 21:55:45.164876  2387 process.cpp:1282] libprocess is initialized on 172.17.0.2:38700
with 16 worker threads
[       OK ] Scheme/HTTPTest.PipeFailure/1 (3 ms)
[ RUN      ] Scheme/HTTPTest.PipeReaderCloses/0
I0531 21:55:45.409502  2387 openssl.cpp:419] CA file path is unspecified! NOTE: Set CA file
path with LIBPROCESS_SSL_CA_FILE=<filepath>
I0531 21:55:45.409525  2387 openssl.cpp:424] CA directory path unspecified! NOTE: Set CA directory
path with LIBPROCESS_SSL_CA_DIR=<dirpath>
I0531 21:55:45.409533  2387 openssl.cpp:429] Will not verify peer certificate!
NOTE: Set LIBPROCESS_SSL_VERIFY_CERT=1 to enable peer certificate verification
I0531 21:55:45.409538  2387 openssl.cpp:435] Will only verify peer certificate if presented!
NOTE: Set LIBPROCESS_SSL_REQUIRE_CERT=1 to require peer certificate verification
E0531 21:55:45.409978  3306 process.cpp:968] Failed to accept socket: future discarded
I0531 21:55:45.411967  2387 process.cpp:1282] libprocess is initialized on 172.17.0.2:54344
with 16 worker threads
[       OK ] Scheme/HTTPTest.PipeReaderCloses/0 (247 ms)
[ RUN      ] Scheme/HTTPTest.PipeReaderCloses/1
I0531 21:55:45.426043  2387 process.cpp:1282] libprocess is initialized on 172.17.0.2:50824
with 16 worker threads
[       OK ] Scheme/HTTPTest.PipeReaderCloses/1 (14 ms)
[ RUN      ] Scheme/HTTPTest.Encode/0
I0531 21:55:45.818956  2387 openssl.cpp:419] CA file path is unspecified! NOTE: Set CA file
path with LIBPROCESS_SSL_CA_FILE=<filepath>
I0531 21:55:45.818981  2387 openssl.cpp:424] CA directory path unspecified! NOTE: Set CA directory
path with LIBPROCESS_SSL_CA_DIR=<dirpath>
I0531 21:55:45.818986  2387 openssl.cpp:429] Will not verify peer certificate!
NOTE: Set LIBPROCESS_SSL_VERIFY_CERT=1 to enable peer certificate verification
I0531 21:55:45.818994  2387 openssl.cpp:435] Will only verify peer certificate if presented!
NOTE: Set LIBPROCESS_SSL_REQUIRE_CERT=1 to require peer certificate verification
E0531 21:55:45.819474  3340 process.cpp:968] Failed to accept socket: future discarded
I0531 21:55:45.821538  2387 process.cpp:1282] libprocess is initialized on 172.17.0.2:39129
with 16 worker threads
[       OK ] Scheme/HTTPTest.Encode/0 (395 ms)
[ RUN      ] Scheme/HTTPTest.Encode/1
I0531 21:55:45.824056  2387 process.cpp:1282] libprocess is initialized on 172.17.0.2:34540
with 16 worker threads
[       OK ] Scheme/HTTPTest.Encode/1 (3 ms)
[ RUN      ] Scheme/HTTPTest.PathParse/0
I0531 21:55:46.122378  2387 openssl.cpp:419] CA file path is unspecified! NOTE: Set CA file
path with LIBPROCESS_SSL_CA_FILE=<filepath>
I0531 21:55:46.122404  2387 openssl.cpp:424] CA directory path unspecified! NOTE: Set CA directory
path with LIBPROCESS_SSL_CA_DIR=<dirpath>
I0531 21:55:46.122412  2387 openssl.cpp:429] Will not verify peer certificate!
NOTE: Set LIBPROCESS_SSL_VERIFY_CERT=1 to enable peer certificate verification
I0531 21:55:46.122418  2387 openssl.cpp:435] Will only verify peer certificate if presented!
NOTE: Set LIBPROCESS_SSL_REQUIRE_CERT=1 to require peer certificate verification
E0531 21:55:46.122912  3374 process.cpp:968] Failed to accept socket: future discarded
*** Aborted at 1496267746 (unix time) try "date -d @1496267746" if you are using GNU date
***
PC: @     0x7f34e5069c86 __memcpy_ssse3_back
I0531 21:55:46.125207  2387 process.cpp:1282] libprocess is initialized on 172.17.0.2:53445
with 16 worker threads
*** SIGSEGV (@0x3d69468) received by PID 2387 (TID 0x7f34db147700) from PID 64394344; stack
trace: ***
[       OK ] Scheme/HTTPTest.PathParse/0 (301 ms)
[ RUN      ] Scheme/HTTPTest.PathParse/1
    @     0x7f34e6132370 (unknown)
    @     0x7f34e5069c86 __memcpy_ssse3_back
    @     0x7f34e58b68e0 (unknown)
    @     0x7f34e58b6f8c (unknown)
    @           0x42b133 process::UPID::UPID()
    @           0x8f9af6 process::DispatchEvent::DispatchEvent()
    @           0x8f1f7f process::internal::dispatch()
    @           0x90cd0c process::dispatch<>()
    @           0x8f0e8e process::ProcessBase::route()
    @           0x9e569d process::ProcessBase::route<>()
    @           0x9e18e0 process::Help::initialize()
    @           0x8ea3a4 process::ProcessManager::resume()
    @           0x8e67a2 _ZZN7process14ProcessManager12init_threadsEvENKUt_clEv
    @           0x8f9096 _ZNSt12_Bind_simpleIFZN7process14ProcessManager12init_threadsEvEUt_vEE9_M_invokeIIEEEvSt12_Index_tupleIIXspT_EEE
    @           0x8f8fda _ZNSt12_Bind_simpleIFZN7process14ProcessManager12init_threadsEvEUt_vEEclEv
    @           0x8f8f64 _ZNSt6thread5_ImplISt12_Bind_simpleIFZN7process14ProcessManager12init_threadsEvEUt_vEEE6_M_runEv
    @     0x7f34e58ad230 (unknown)
    @     0x7f34e612adc5 start_thread
    @     0x7f34e501676d __clone
make[7]: *** [check-local] Segmentation fault
make[7]: Leaving directory `/mesos/mesos-1.4.0/_build/3rdparty/libprocess'
make[6]: *** [check-am] Error 2
make[6]: Leaving directory `/mesos/mesos-1.4.0/_build/3rdparty/libprocess'
make[5]: *** [check-recursive] Error 1
make[5]: Leaving directory `/mesos/mesos-1.4.0/_build/3rdparty/libprocess'
make[4]: *** [check] Error 2
make[4]: Leaving directory `/mesos/mesos-1.4.0/_build/3rdparty/libprocess'
make[3]: *** [check-recursive] Error 1
make[3]: Leaving directory `/mesos/mesos-1.4.0/_build/3rdparty'
make[2]: *** [check] Error 2
make[2]: Leaving directory `/mesos/mesos-1.4.0/_build/3rdparty'
make[1]: *** [check-recursive] Error 1
make[1]: Leaving directory `/mesos/mesos-1.4.0/_build'
make: *** [distcheck] Error 1
+ docker rmi mesos-1496266511-15256
Untagged: mesos-1496266511-15256:latest
Deleted: sha256:e8183eb346315563ea2b2ff4434ac18d3dc0ffcd4db2d4316ad7e716ecf144f7
Deleted: sha256:1e2a45dd9a7951fe7dbad87174698aa042c1987b2d46d212de240dcc252ac6c5
Deleted: sha256:e5f538603395c4e0db529dff95774d750e944acdb6d361b77b8fa2ce42181797
Deleted: sha256:2de578e44d3b800a153b6d9401f5d9d04cd96f7e96cb0233bbdd28e899efeac5
Deleted: sha256:064141f1540b8171048f10aa94092f2ef2184b479eb3e2489d8a885932aabfcf
Deleted: sha256:5b242fa85879b1573fcf86d0a1e236c880b487b5a73a9410d4c529bbc9d23147
Deleted: sha256:19cc91328169252a6082d0df24d0576dd9b14ddfea4a6b5dd07fd1e1094071c3
Deleted: sha256:42f9923cb5193875f905cb1308824f1cc4e8be32904ca65ca9c01f6565f58cbb
Deleted: sha256:d38d193c632b5a721aa92f987717f34d28f92bb528d703321f19c9d2b53f1d7d
Deleted: sha256:7117a5d251e1b6b9d9f420b32cea88bcea1b4afef2d0d512a0509cb85959e20d
Deleted: sha256:4c31946d89935a2ebf4eab964565013c6b973f9f376adabc3e9ecd4910a70436
Deleted: sha256:be25f7f709815c6591648a3b2d14b48a5164a3b2d501c6c0663461faabe67937
Deleted: sha256:b76a7789e7b59d82aeddb64153657a724ec264ad3243590fc0b4183d6c281fa7
Deleted: sha256:62808c6b26a89e613a1c9ce302031b40bf07df5103cd4af2b0cc08827360c399
Deleted: sha256:a4ab3a3d69234941a84744c899d9774596010f70f52b39ad62185fde6e305e03
Deleted: sha256:553f2f0128fec162745e53bac2fcf3cd8ad2279cd661cc6193e4e74a0032ad25
Deleted: sha256:ad5d43173e0ee0afdce9b3d56464a56b085e4f7ac0c3479e7e8a3f48e16a68d1
Deleted: sha256:45636eca5bb6599f5c0f5ed7109aeda1dc7128250cd58c94348e6ac48fc317b0
Deleted: sha256:abd8bc337cc2d0643a1c27ae838aa47d9e64671d0491a22e724d585e98753c76
Deleted: sha256:17f34dd1ab5ad29fdcb9c75ecdeb72633cbc8543f38be6eaa6ce8c1eccc47b37
Deleted: sha256:700ce9916859098a5005d71fa6a3695ef4f3b3c981ceefec37a3d1cc310123c8
Deleted: sha256:e566daa45f8faf3296b22a03379a1738d83f1da0ac4bf26fd3fba72fb7fd2180
Deleted: sha256:17328c15c06d944f87291bee4bc69b140cecb199bd42dba8b3b74eb53ff31aa1
Deleted: sha256:27411f494bd9e8305b979ca252419175753a2269e514a88e9b7c8ec677f1534c
Deleted: sha256:963fd8a3ef8c9bb44931c10396ab240bc91af02361b327abf0a5ed837233affa
Build step 'Execute shell' marked build as failure
Not sending mail to unregistered user neil.conway@gmail.com

Mime
View raw message