mesos-builds mailing list archives

Site index · List index
Message view « Date » · « Thread »
Top « Date » · « Thread »
From Apache Jenkins Server <jenk...@builds.apache.org>
Subject Build failed in Jenkins: Mesos-Buildbot » autotools,gcc,--verbose --enable-libevent --enable-ssl,GLOG_v=1 MESOS_VERBOSE=1,ubuntu:14.04,(docker||Hadoop)&&(!ubuntu-us1)&&(!ubuntu-eu2) #3689
Date Wed, 17 May 2017 18:59:17 GMT
See <https://builds.apache.org/job/Mesos-Buildbot/BUILDTOOL=autotools,COMPILER=gcc,CONFIGURATION=--verbose%20--enable-libevent%20--enable-ssl,ENVIRONMENT=GLOG_v=1%20MESOS_VERBOSE=1,OS=ubuntu%3A14.04,label_exp=(docker%7C%7CHadoop)&&(!ubuntu-us1)&&(!ubuntu-eu2)/3689/display/redirect?page=changes>

Changes:

[neil.conway] Introduced a filter for test cases that need thread-safety.

[neil.conway] Fixed use of 'GTEST_IS_THREADSAFE'.

[neil.conway] Updated GMock/GTest to version 1.8.0.

[neil.conway] Updated GMock/GTest in stout.

[neil.conway] Updated GMock/GTest in libprocess.

[neil.conway] Fixed Makefile.am variable syntax.

------------------------------------------
[...truncated 28.53 MB...]
[       OK ] Endpoint/SlaveEndpointTest.AuthorizedRequest/2 (27 ms)
[ RUN      ] Endpoint/SlaveEndpointTest.UnauthorizedRequest/0
I0517 18:59:12.959597  1325 containerizer.cpp:221] Using isolation: posix/cpu,posix/mem,filesystem/posix,network/cni
W0517 18:59:12.960103  1325 backend.cpp:76] Failed to create 'aufs' backend: AufsBackend requires
root privileges
W0517 18:59:12.960207  1325 backend.cpp:76] Failed to create 'bind' backend: BindBackend requires
root privileges
I0517 18:59:12.960248  1325 provisioner.cpp:249] Using default backend 'copy'
I0517 18:59:12.963155 21792 slave.cpp:225] Mesos agent started on (753)@172.17.0.2:45832
I0517 18:59:12.963179 21792 slave.cpp:226] Flags at startup: --acls="" --appc_simple_discovery_uri_prefix="http://"
--appc_store_dir="/tmp/mesos/store/appc" --authenticate_http_executors="true" --authenticate_http_readonly="true"
--authenticate_http_readwrite="true" --authenticatee="crammd5" --authentication_backoff_factor="1secs"
--authorizer="local" --cgroups_cpu_enable_pids_and_tids_count="false" --cgroups_enable_cfs="false"
--cgroups_hierarchy="/sys/fs/cgroup" --cgroups_limit_swap="false" --cgroups_root="mesos" --container_disk_watch_interval="15secs"
--containerizers="mesos" --credential="/tmp/Endpoint_SlaveEndpointTest_UnauthorizedRequest_0_fUqtXF/credential"
--default_role="*" --disk_watch_interval="1mins" --docker="docker" --docker_kill_orphans="true"
--docker_registry="https://registry-1.docker.io" --docker_remove_delay="6hrs" --docker_socket="/var/run/docker.sock"
--docker_stop_timeout="0ns" --docker_store_dir="/tmp/mesos/store/docker" --docker_volume_checkpoint_dir="/var/run/mesos/isolators/docker/volume"
--enforce_container_disk_quota="false" --executor_registration_timeout="1mins" --executor_secret_key="/tmp/Endpoint_SlaveEndpointTest_UnauthorizedRequest_0_fUqtXF/executor_secret_key"
--executor_shutdown_grace_period="5secs" --fetcher_cache_dir="/tmp/Endpoint_SlaveEndpointTest_UnauthorizedRequest_0_fUqtXF/fetch"
--fetcher_cache_size="2GB" --frameworks_home="" --gc_delay="1weeks" --gc_disk_headroom="0.1"
--hadoop_home="" --help="false" --hostname_lookup="true" --http_command_executor="false" --http_credentials="/tmp/Endpoint_SlaveEndpointTest_UnauthorizedRequest_0_fUqtXF/http_credentials"
--http_heartbeat_interval="30secs" --initialize_driver_logging="true" --isolation="posix/cpu,posix/mem"
--launcher="posix" --launcher_dir="/mesos/mesos-1.4.0/_build/src" --logbufsecs="0" --logging_level="INFO"
--max_completed_executors_per_framework="150" --oversubscribed_resources_interval="15secs"
--perf_duration="10secs" --perf_interval="1mins" --port="5051" --qos_correction_interval_min="0ns"
--quiet="false" --recover="reconnect" --recovery_timeout="15mins" --registration_backoff_factor="10ms"
--resources="cpus:2;gpus:0;mem:1024;disk:1024;ports:[31000-32000]" --revocable_cpu_low_priority="true"
--runtime_dir="/tmp/Endpoint_SlaveEndpointTest_UnauthorizedRequest_0_fUqtXF" --sandbox_directory="/mnt/mesos/sandbox"
--strict="true" --switch_user="true" --systemd_enable_support="true" --systemd_runtime_directory="/run/systemd/system"
--version="false" --work_dir="/tmp/Endpoint_SlaveEndpointTest_UnauthorizedRequest_0_cuSirn"
I0517 18:59:12.963536 21792 credentials.hpp:86] Loading credential for authentication from
'/tmp/Endpoint_SlaveEndpointTest_UnauthorizedRequest_0_fUqtXF/credential'
I0517 18:59:12.963668 21792 slave.cpp:258] Agent using credential for: test-principal
I0517 18:59:12.963688 21792 credentials.hpp:37] Loading credentials for authentication from
'/tmp/Endpoint_SlaveEndpointTest_UnauthorizedRequest_0_fUqtXF/http_credentials'
I0517 18:59:12.963938 21792 http.cpp:975] Creating default 'basic' HTTP authenticator for
realm 'mesos-agent-executor'
I0517 18:59:12.964043 21792 http.cpp:996] Creating default 'jwt' HTTP authenticator for realm
'mesos-agent-executor'
I0517 18:59:12.964342 21792 http.cpp:975] Creating default 'basic' HTTP authenticator for
realm 'mesos-agent-readonly'
I0517 18:59:12.964448 21792 http.cpp:996] Creating default 'jwt' HTTP authenticator for realm
'mesos-agent-readonly'
I0517 18:59:12.964643 21792 http.cpp:975] Creating default 'basic' HTTP authenticator for
realm 'mesos-agent-readwrite'
I0517 18:59:12.964743 21792 http.cpp:996] Creating default 'jwt' HTTP authenticator for realm
'mesos-agent-readwrite'
I0517 18:59:12.966166 21792 slave.cpp:529] Agent resources: cpus(*):2; mem(*):1024; disk(*):1024;
ports(*):[31000-32000]
I0517 18:59:12.966243 21792 slave.cpp:537] Agent attributes: [  ]
I0517 18:59:12.966255 21792 slave.cpp:542] Agent hostname: 770ca1180a14
I0517 18:59:12.966392 21801 status_update_manager.cpp:177] Pausing sending status updates
I0517 18:59:12.967617 21805 state.cpp:62] Recovering state from '/tmp/Endpoint_SlaveEndpointTest_UnauthorizedRequest_0_cuSirn/meta'
I0517 18:59:12.967855 21803 status_update_manager.cpp:203] Recovering status update manager
I0517 18:59:12.968111 21788 containerizer.cpp:608] Recovering containerizer
I0517 18:59:12.969624 21787 provisioner.cpp:410] Provisioner recovery complete
I0517 18:59:12.969992 21805 slave.cpp:5974] Finished recovery
I0517 18:59:12.970455 21805 slave.cpp:6156] Querying resource estimator for oversubscribable
resources
I0517 18:59:12.970801 21789 slave.cpp:6170] Received oversubscribable resources {} from the
resource estimator
I0517 18:59:12.972671 21792 process.cpp:3730] Handling HTTP event for process 'slave(753)'
with path: '/slave(753)/monitor/statistics'
I0517 18:59:12.974236 21795 http.cpp:1115] HTTP GET for /slave(753)/monitor/statistics from
172.17.0.2:39256
I0517 18:59:12.974303 21795 http.cpp:936] Authorizing principal 'test-principal' to GET the
'/monitor/statistics' endpoint
I0517 18:59:12.976223 21800 slave.cpp:794] Agent terminating
[       OK ] Endpoint/SlaveEndpointTest.UnauthorizedRequest/0 (26 ms)
[ RUN      ] Endpoint/SlaveEndpointTest.UnauthorizedRequest/1
I0517 18:59:12.985920  1325 containerizer.cpp:221] Using isolation: posix/cpu,posix/mem,filesystem/posix,network/cni
W0517 18:59:12.986397  1325 backend.cpp:76] Failed to create 'aufs' backend: AufsBackend requires
root privileges
W0517 18:59:12.986490  1325 backend.cpp:76] Failed to create 'bind' backend: BindBackend requires
root privileges
I0517 18:59:12.986533  1325 provisioner.cpp:249] Using default backend 'copy'
I0517 18:59:12.989461 21792 slave.cpp:225] Mesos agent started on (754)@172.17.0.2:45832
I0517 18:59:12.989490 21792 slave.cpp:226] Flags at startup: --acls="" --appc_simple_discovery_uri_prefix="http://"
--appc_store_dir="/tmp/mesos/store/appc" --authenticate_http_executors="true" --authenticate_http_readonly="true"
--authenticate_http_readwrite="true" --authenticatee="crammd5" --authentication_backoff_factor="1secs"
--authorizer="local" --cgroups_cpu_enable_pids_and_tids_count="false" --cgroups_enable_cfs="false"
--cgroups_hierarchy="/sys/fs/cgroup" --cgroups_limit_swap="false" --cgroups_root="mesos" --container_disk_watch_interval="15secs"
--containerizers="mesos" --credential="/tmp/Endpoint_SlaveEndpointTest_UnauthorizedRequest_1_14QzfS/credential"
--default_role="*" --disk_watch_interval="1mins" --docker="docker" --docker_kill_orphans="true"
--docker_registry="https://registry-1.docker.io" --docker_remove_delay="6hrs" --docker_socket="/var/run/docker.sock"
--docker_stop_timeout="0ns" --docker_store_dir="/tmp/mesos/store/docker" --docker_volume_checkpoint_dir="/var/run/mesos/isolators/docker/volume"
--enforce_container_disk_quota="false" --executor_registration_timeout="1mins" --executor_secret_key="/tmp/Endpoint_SlaveEndpointTest_UnauthorizedRequest_1_14QzfS/executor_secret_key"
--executor_shutdown_grace_period="5secs" --fetcher_cache_dir="/tmp/Endpoint_SlaveEndpointTest_UnauthorizedRequest_1_14QzfS/fetch"
--fetcher_cache_size="2GB" --frameworks_home="" --gc_delay="1weeks" --gc_disk_headroom="0.1"
--hadoop_home="" --help="false" --hostname_lookup="true" --http_command_executor="false" --http_credentials="/tmp/Endpoint_SlaveEndpointTest_UnauthorizedRequest_1_14QzfS/http_credentials"
--http_heartbeat_interval="30secs" --initialize_driver_logging="true" --isolation="posix/cpu,posix/mem"
--launcher="posix" --launcher_dir="/mesos/mesos-1.4.0/_build/src" --logbufsecs="0" --logging_level="INFO"
--max_completed_executors_per_framework="150" --oversubscribed_resources_interval="15secs"
--perf_duration="10secs" --perf_interval="1mins" --port="5051" --qos_correction_interval_min="0ns"
--quiet="false" --recover="reconnect" --recovery_timeout="15mins" --registration_backoff_factor="10ms"
--resources="cpus:2;gpus:0;mem:1024;disk:1024;ports:[31000-32000]" --revocable_cpu_low_priority="true"
--runtime_dir="/tmp/Endpoint_SlaveEndpointTest_UnauthorizedRequest_1_14QzfS" --sandbox_directory="/mnt/mesos/sandbox"
--strict="true" --switch_user="true" --systemd_enable_support="true" --systemd_runtime_directory="/run/systemd/system"
--version="false" --work_dir="/tmp/Endpoint_SlaveEndpointTest_UnauthorizedRequest_1_qjQtFz"
I0517 18:59:12.989859 21792 credentials.hpp:86] Loading credential for authentication from
'/tmp/Endpoint_SlaveEndpointTest_UnauthorizedRequest_1_14QzfS/credential'
I0517 18:59:12.990000 21792 slave.cpp:258] Agent using credential for: test-principal
I0517 18:59:12.990023 21792 credentials.hpp:37] Loading credentials for authentication from
'/tmp/Endpoint_SlaveEndpointTest_UnauthorizedRequest_1_14QzfS/http_credentials'
I0517 18:59:12.990283 21792 http.cpp:975] Creating default 'basic' HTTP authenticator for
realm 'mesos-agent-executor'
I0517 18:59:12.990391 21792 http.cpp:996] Creating default 'jwt' HTTP authenticator for realm
'mesos-agent-executor'
I0517 18:59:12.990692 21792 http.cpp:975] Creating default 'basic' HTTP authenticator for
realm 'mesos-agent-readonly'
I0517 18:59:12.990838 21792 http.cpp:996] Creating default 'jwt' HTTP authenticator for realm
'mesos-agent-readonly'
I0517 18:59:12.991161 21792 http.cpp:975] Creating default 'basic' HTTP authenticator for
realm 'mesos-agent-readwrite'
I0517 18:59:12.991268 21792 http.cpp:996] Creating default 'jwt' HTTP authenticator for realm
'mesos-agent-readwrite'
I0517 18:59:12.992688 21792 slave.cpp:529] Agent resources: cpus(*):2; mem(*):1024; disk(*):1024;
ports(*):[31000-32000]
I0517 18:59:12.992764 21792 slave.cpp:537] Agent attributes: [  ]
I0517 18:59:12.992776 21792 slave.cpp:542] Agent hostname: 770ca1180a14
I0517 18:59:12.992895 21803 status_update_manager.cpp:177] Pausing sending status updates
I0517 18:59:12.994108 21786 state.cpp:62] Recovering state from '/tmp/Endpoint_SlaveEndpointTest_UnauthorizedRequest_1_qjQtFz/meta'
I0517 18:59:12.994367 21785 status_update_manager.cpp:203] Recovering status update manager
I0517 18:59:12.994648 21797 containerizer.cpp:608] Recovering containerizer
I0517 18:59:12.995977 21790 provisioner.cpp:410] Provisioner recovery complete
I0517 18:59:12.996342 21797 slave.cpp:5974] Finished recovery
I0517 18:59:12.996760 21797 slave.cpp:6156] Querying resource estimator for oversubscribable
resources
I0517 18:59:12.997054 21798 slave.cpp:6170] Received oversubscribable resources {} from the
resource estimator
I0517 18:59:12.998860 21804 process.cpp:3730] Handling HTTP event for process 'slave(754)'
with path: '/slave(754)/monitor/statistics.json'
I0517 18:59:13.000432 21805 http.cpp:1115] HTTP GET for /slave(754)/monitor/statistics.json
from 172.17.0.2:39258
I0517 18:59:13.000497 21805 http.cpp:936] Authorizing principal 'test-principal' to GET the
'/monitor/statistics.json' endpoint
I0517 18:59:13.002365 21782 slave.cpp:794] Agent terminating
[       OK ] Endpoint/SlaveEndpointTest.UnauthorizedRequest/1 (26 ms)
[ RUN      ] Endpoint/SlaveEndpointTest.UnauthorizedRequest/2
I0517 18:59:13.012008  1325 containerizer.cpp:221] Using isolation: posix/cpu,posix/mem,filesystem/posix,network/cni
W0517 18:59:13.012523  1325 backend.cpp:76] Failed to create 'aufs' backend: AufsBackend requires
root privileges
W0517 18:59:13.012632  1325 backend.cpp:76] Failed to create 'bind' backend: BindBackend requires
root privileges
I0517 18:59:13.012665  1325 provisioner.cpp:249] Using default backend 'copy'
I0517 18:59:13.015614 21784 slave.cpp:225] Mesos agent started on (755)@172.17.0.2:45832
I0517 18:59:13.015640 21784 slave.cpp:226] Flags at startup: --acls="" --appc_simple_discovery_uri_prefix="http://"
--appc_store_dir="/tmp/mesos/store/appc" --authenticate_http_executors="true" --authenticate_http_readonly="true"
--authenticate_http_readwrite="true" --authenticatee="crammd5" --authentication_backoff_factor="1secs"
--authorizer="local" --cgroups_cpu_enable_pids_and_tids_count="false" --cgroups_enable_cfs="false"
--cgroups_hierarchy="/sys/fs/cgroup" --cgroups_limit_swap="false" --cgroups_root="mesos" --container_disk_watch_interval="15secs"
--containerizers="mesos" --credential="/tmp/Endpoint_SlaveEndpointTest_UnauthorizedRequest_2_jWYcN4/credential"
--default_role="*" --disk_watch_interval="1mins" --docker="docker" --docker_kill_orphans="true"
--docker_registry="https://registry-1.docker.io" --docker_remove_delay="6hrs" --docker_socket="/var/run/docker.sock"
--docker_stop_timeout="0ns" --docker_store_dir="/tmp/mesos/store/docker" --docker_volume_checkpoint_dir="/var/run/mesos/isolators/docker/volume"
--enforce_container_disk_quota="false" --executor_registration_timeout="1mins" --executor_secret_key="/tmp/Endpoint_SlaveEndpointTest_UnauthorizedRequest_2_jWYcN4/executor_secret_key"
--executor_shutdown_grace_period="5secs" --fetcher_cache_dir="/tmp/Endpoint_SlaveEndpointTest_UnauthorizedRequest_2_jWYcN4/fetch"
--fetcher_cache_size="2GB" --frameworks_home="" --gc_delay="1weeks" --gc_disk_headroom="0.1"
--hadoop_home="" --help="false" --hostname_lookup="true" --http_command_executor="false" --http_credentials="/tmp/Endpoint_SlaveEndpointTest_UnauthorizedRequest_2_jWYcN4/http_credentials"
--http_heartbeat_interval="30secs" --initialize_driver_logging="true" --isolation="posix/cpu,posix/mem"
--launcher="posix" --launcher_dir="/mesos/mesos-1.4.0/_build/src" --logbufsecs="0" --logging_level="INFO"
--max_completed_executors_per_framework="150" --oversubscribed_resources_interval="15secs"
--perf_duration="10secs" --perf_interval="1mins" --port="5051" --qos_correction_interval_min="0ns"
--quiet="false" --recover="reconnect" --recovery_timeout="15mins" --registration_backoff_factor="10ms"
--resources="cpus:2;gpus:0;mem:1024;disk:1024;ports:[31000-32000]" --revocable_cpu_low_priority="true"
--runtime_dir="/tmp/Endpoint_SlaveEndpointTest_UnauthorizedRequest_2_jWYcN4" --sandbox_directory="/mnt/mesos/sandbox"
--strict="true" --switch_user="true" --systemd_enable_support="true" --systemd_runtime_directory="/run/systemd/system"
--version="false" --work_dir="/tmp/Endpoint_SlaveEndpointTest_UnauthorizedRequest_2_qv1e9L"
I0517 18:59:13.016052 21784 credentials.hpp:86] Loading credential for authentication from
'/tmp/Endpoint_SlaveEndpointTest_UnauthorizedRequest_2_jWYcN4/credential'
I0517 18:59:13.016180 21784 slave.cpp:258] Agent using credential for: test-principal
I0517 18:59:13.016199 21784 credentials.hpp:37] Loading credentials for authentication from
'/tmp/Endpoint_SlaveEndpointTest_UnauthorizedRequest_2_jWYcN4/http_credentials'
I0517 18:59:13.016446 21784 http.cpp:975] Creating default 'basic' HTTP authenticator for
realm 'mesos-agent-executor'
I0517 18:59:13.016546 21784 http.cpp:996] Creating default 'jwt' HTTP authenticator for realm
'mesos-agent-executor'
I0517 18:59:13.016746 21784 http.cpp:975] Creating default 'basic' HTTP authenticator for
realm 'mesos-agent-readonly'
I0517 18:59:13.016842 21784 http.cpp:996] Creating default 'jwt' HTTP authenticator for realm
'mesos-agent-readonly'
I0517 18:59:13.017096 21784 http.cpp:975] Creating default 'basic' HTTP authenticator for
realm 'mesos-agent-readwrite'
I0517 18:59:13.017196 21784 http.cpp:996] Creating default 'jwt' HTTP authenticator for realm
'mesos-agent-readwrite'
I0517 18:59:13.018712 21784 slave.cpp:529] Agent resources: cpus(*):2; mem(*):1024; disk(*):1024;
ports(*):[31000-32000]
I0517 18:59:13.018790 21784 slave.cpp:537] Agent attributes: [  ]
I0517 18:59:13.018801 21784 slave.cpp:542] Agent hostname: 770ca1180a14
I0517 18:59:13.018954 21794 status_update_manager.cpp:177] Pausing sending status updates
I0517 18:59:13.020107 21796 state.cpp:62] Recovering state from '/tmp/Endpoint_SlaveEndpointTest_UnauthorizedRequest_2_qv1e9L/meta'
I0517 18:59:13.020377 21789 status_update_manager.cpp:203] Recovering status update manager
I0517 18:59:13.020639 21798 containerizer.cpp:608] Recovering containerizer
I0517 18:59:13.021996 21791 provisioner.cpp:410] Provisioner recovery complete
I0517 18:59:13.022419 21801 slave.cpp:5974] Finished recovery
I0517 18:59:13.022840 21801 slave.cpp:6156] Querying resource estimator for oversubscribable
resources
I0517 18:59:13.023092 21796 slave.cpp:6170] Received oversubscribable resources {} from the
resource estimator
I0517 18:59:13.025003 21794 process.cpp:3730] Handling HTTP event for process 'slave(755)'
with path: '/slave(755)/containers'
I0517 18:59:13.026624 21799 http.cpp:1115] HTTP GET for /slave(755)/containers from 172.17.0.2:39260
I0517 18:59:13.026700 21799 http.cpp:936] Authorizing principal 'test-principal' to GET the
'/containers' endpoint
I0517 18:59:13.028842 21788 slave.cpp:794] Agent terminating
[       OK ] Endpoint/SlaveEndpointTest.UnauthorizedRequest/2 (26 ms)
[ RUN      ] Endpoint/SlaveEndpointTest.NoAuthorizer/0
I0517 18:59:13.038923  1325 containerizer.cpp:221] Using isolation: posix/cpu,posix/mem,filesystem/posix,network/cni
W0517 18:59:13.039440  1325 backend.cpp:76] Failed to create 'aufs' backend: AufsBackend requires
root privileges
W0517 18:59:13.039548  1325 backend.cpp:76] Failed to create 'bind' backend: BindBackend requires
root privileges
I0517 18:59:13.039587  1325 provisioner.cpp:249] Using default backend 'copy'
I0517 18:59:13.041043  1325 cluster.cpp:448] Creating default 'local' authorizer
I0517 18:59:13.042671 21783 slave.cpp:225] Mesos agent started on (756)@172.17.0.2:45832
I0517 18:59:13.042690 21783 slave.cpp:226] Flags at startup: --acls="" --appc_simple_discovery_uri_prefix="http://"
--appc_store_dir="/tmp/mesos/store/appc" --authenticate_http_executors="true" --authenticate_http_readonly="true"
--authenticate_http_readwrite="true" --authenticatee="crammd5" --authentication_backoff_factor="1secs"
--authorizer="local" --cgroups_cpu_enable_pids_and_tids_count="false" --cgroups_enable_cfs="false"
--cgroups_hierarchy="/sys/fs/cgroup" --cgroups_limit_swap="false" --cgroups_root="mesos" --container_disk_watch_interval="15secs"
--containerizers="mesos" --credential="/tmp/Endpoint_SlaveEndpointTest_NoAuthorizer_0_JWfDAh/credential"
--default_role="*" --disk_watch_interval="1mins" --docker="docker" --docker_kill_orphans="true"
--docker_registry="https://registry-1.docker.io" --docker_remove_delay="6hrs" --docker_socket="/var/run/docker.sock"
--docker_stop_timeout="0ns" --docker_store_dir="/tmp/mesos/store/docker" --docker_volume_checkpoint_dir="/var/run/mesos/isolators/docker/volume"
--enforce_container_disk_quota="false" --executor_registration_timeout="1mins" --executor_secret_key="/tmp/Endpoint_SlaveEndpointTest_NoAuthorizer_0_JWfDAh/executor_secret_key"
--executor_shutdown_grace_period="5secs" --fetcher_cache_dir="/tmp/Endpoint_SlaveEndpointTest_NoAuthorizer_0_JWfDAh/fetch"
--fetcher_cache_size="2GB" --frameworks_home="" --gc_delay="1weeks" --gc_disk_headroom="0.1"
--hadoop_home="" --help="false" --hostname_lookup="true" --http_command_executor="false" --http_credentials="/tmp/Endpoint_SlaveEndpointTest_NoAuthorizer_0_JWfDAh/http_credentials"
--http_heartbeat_interval="30secs" --initialize_driver_logging="true" --isolation="posix/cpu,posix/mem"
--launcher="posix" --launcher_dir="/mesos/mesos-1.4.0/_build/src" --logbufsecs="0" --logging_level="INFO"
--max_completed_executors_per_framework="150" --oversubscribed_resources_interval="15secs"
--perf_duration="10secs" --perf_interval="1mins" --port="5051" --qos_correction_interval_min="0ns"
--quiet="false" --recover="reconnect" --recovery_timeout="15mins" --registration_backoff_factor="10ms"
--resources="cpus:2;gpus:0;mem:1024;disk:1024;ports:[31000-32000]" --revocable_cpu_low_priority="true"
--runtime_dir="/tmp/Endpoint_SlaveEndpointTest_NoAuthorizer_0_JWfDAh" --sandbox_directory="/mnt/mesos/sandbox"
--strict="true" --switch_user="true" --systemd_enable_support="true" --systemd_runtime_directory="/run/systemd/system"
--version="false" --work_dir="/tmp/Endpoint_SlaveEndpointTest_NoAuthorizer_0_KSfHSY"
I0517 18:59:13.043072 21783 credentials.hpp:86] Loading credential for authentication from
'/tmp/Endpoint_SlaveEndpointTest_NoAuthorizer_0_JWfDAh/credential'
I0517 18:59:13.043233 21783 slave.cpp:258] Agent using credential for: test-principal
I0517 18:59:13.043254 21783 credentials.hpp:37] Loading credentials for authentication from
'/tmp/Endpoint_SlaveEndpointTest_NoAuthorizer_0_JWfDAh/http_credentials'
I0517 18:59:13.043529 21783 http.cpp:975] Creating default 'basic' HTTP authenticator for
realm 'mesos-agent-executor'
I0517 18:59:13.043642 21783 http.cpp:996] Creating default 'jwt' HTTP authenticator for realm
'mesos-agent-executor'
I0517 18:59:13.043854 21783 http.cpp:975] Creating default 'basic' HTTP authenticator for
realm 'mesos-agent-readonly'
I0517 18:59:13.043982 21783 http.cpp:996] Creating default 'jwt' HTTP authenticator for realm
'mesos-agent-readonly'
I0517 18:59:13.044167 21783 http.cpp:975] Creating default 'basic' HTTP authenticator for
realm 'mesos-agent-readwrite'
I0517 18:59:13.044267 21783 http.cpp:996] Creating default 'jwt' HTTP authenticator for realm
'mesos-agent-readwrite'
I0517 18:59:13.045646 21783 slave.cpp:529] Agent resources: cpus(*):2; mem(*):1024; disk(*):1024;
ports(*):[31000-32000]
I0517 18:59:13.045724 21783 slave.cpp:537] Agent attributes: [  ]
I0517 18:59:13.045737 21783 slave.cpp:542] Agent hostname: 770ca1180a14
I0517 18:59:13.045846 21789 status_update_manager.cpp:177] Pausing sending status updates
I0517 18:59:13.047086 21789 state.cpp:62] Recovering state from '/tmp/Endpoint_SlaveEndpointTest_NoAuthorizer_0_KSfHSY/meta'
I0517 18:59:13.047364 21794 status_update_manager.cpp:203] Recovering status update manager
I0517 18:59:13.047583 21805 containerizer.cpp:608] Recovering containerizer
I0517 18:59:13.048858 21798 provisioner.cpp:410] Provisioner recovery complete
I0517 18:59:13.049322 21786 slave.cpp:5974] Finished recovery
I0517 18:59:13.049784 21786 slave.cpp:6156] Querying resource estimator for oversubscribable
resources
I0517 18:59:13.050016 21796 slave.cpp:6170] Received oversubscribable resources {} from the
resource estimator
I0517 18:59:13.051863 21782 process.cpp:3730] Handling HTTP event for process 'slave(756)'
with path: '/slave(756)/monitor/statistics'
I0517 18:59:13.053547 21788 http.cpp:1115] HTTP GET for /slave(756)/monitor/statistics from
172.17.0.2:39262
I0517 18:59:13.053618 21788 http.cpp:936] Authorizing principal 'test-principal' to GET the
'/monitor/statistics' endpoint
I0517 18:59:13.057420 21801 slave.cpp:794] Agent terminating
[       OK ] Endpoint/SlaveEndpointTest.NoAuthorizer/0 (27 ms)
[ RUN      ] Endpoint/SlaveEndpointTest.NoAuthorizer/1
I0517 18:59:13.066795  1325 containerizer.cpp:221] Using isolation: posix/cpu,posix/mem,filesystem/posix,network/cni
W0517 18:59:13.067291  1325 backend.cpp:76] Failed to create 'aufs' backend: AufsBackend requires
root privileges
W0517 18:59:13.067384  1325 backend.cpp:76] Failed to create 'bind' backend: BindBackend requires
root privileges
I0517 18:59:13.067412  1325 provisioner.cpp:249] Using default backend 'copy'
I0517 18:59:13.068765  1325 cluster.cpp:448] Creating default 'local' authorizer
I0517 18:59:13.070250 21785 slave.cpp:225] Mesos agent started on (757)@172.17.0.2:45832
I0517 18:59:13.070276 21785 slave.cpp:226] Flags at startup: --acls="" --appc_simple_discovery_uri_prefix="http://"
--appc_store_dir="/tmp/mesos/store/appc" --authenticate_http_executors="true" --authenticate_http_readonly="true"
--authenticate_http_readwrite="true" --authenticatee="crammd5" --authentication_backoff_factor="1secs"
--authorizer="local" --cgroups_cpu_enable_pids_and_tids_count="false" --cgroups_enable_cfs="false"
--cgroups_hierarchy="/sys/fs/cgroup" --cgroups_limit_swap="false" --cgroups_root="mesos" --container_disk_watch_interval="15secs"
--containerizers="mesos" --credential="/tmp/Endpoint_SlaveEndpointTest_NoAuthorizer_1_rs6xEu/credential"
--default_role="*" --disk_watch_interval="1mins" --docker="docker" --docker_kill_orphans="true"
--docker_registry="https://registry-1.docker.io" --docker_remove_delay="6hrs" --docker_socket="/var/run/docker.sock"
--docker_stop_timeout="0ns" --docker_store_dir="/tmp/mesos/store/docker" --docker_volume_checkpoint_dir="/var/run/mesos/isolators/docker/volume"
--enforce_container_disk_quota="false" --executor_registration_timeout="1mins" --executor_secret_key="/tmp/Endpoint_SlaveEndpointTest_NoAuthorizer_1_rs6xEu/executor_secret_key"
--executor_shutdown_grace_period="5secs" --fetcher_cache_dir="/tmp/Endpoint_SlaveEndpointTest_NoAuthorizer_1_rs6xEu/fetch"
--fetcher_cache_size="2GB" --frameworks_home="" --gc_delay="1weeks" --gc_disk_headroom="0.1"
--hadoop_home="" --help="false" --hostname_lookup="true" --http_command_executor="false" --http_credentials="/tmp/Endpoint_SlaveEndpointTest_NoAuthorizer_1_rs6xEu/http_credentials"
--http_heartbeat_interval="30secs" --initialize_driver_logging="true" --isolation="posix/cpu,posix/mem"
--launcher="posix" --launcher_dir="/mesos/mesos-1.4.0/_build/src" --logbufsecs="0" --logging_level="INFO"
--max_completed_executors_per_framework="150" --oversubscribed_resources_interval="15secs"
--perf_duration="10secs" --perf_interval="1mins" --port="5051" --qos_correction_interval_min="0ns"
--quiet="false" --recover="reconnect" --recovery_timeout="15mins" --registration_backoff_factor="10ms"
--resources="cpus:2;gpus:0;mem:1024;disk:1024;ports:[31000-32000]" --revocable_cpu_low_priority="true"
--runtime_dir="/tmp/Endpoint_SlaveEndpointTest_NoAuthorizer_1_rs6xEu" --sandbox_directory="/mnt/mesos/sandbox"
--strict="true" --switch_user="true" --systemd_enable_support="true" --systemd_runtime_directory="/run/systemd/system"
--version="false" --work_dir="/tmp/Endpoint_SlaveEndpointTest_NoAuthorizer_1_SResSb"
I0517 18:59:13.070821 21785 credentials.hpp:86] Loading credential for authentication from
'/tmp/Endpoint_SlaveEndpointTest_NoAuthorizer_1_rs6xEu/credential'
I0517 18:59:13.071033 21785 slave.cpp:258] Agent using credential for: test-principal
I0517 18:59:13.071063 21785 credentials.hpp:37] Loading credentials for authentication from
'/tmp/Endpoint_SlaveEndpointTest_NoAuthorizer_1_rs6xEu/http_credentials'
I0517 18:59:13.071430 21785 http.cpp:975] Creating default 'basic' HTTP authenticator for
realm 'mesos-agent-executor'
I0517 18:59:13.071552 21785 http.cpp:996] Creating default 'jwt' HTTP authenticator for realm
'mesos-agent-executor'
I0517 18:59:13.071756 21785 http.cpp:975] Creating default 'basic' HTTP authenticator for
realm 'mesos-agent-readonly'
I0517 18:59:13.071857 21785 http.cpp:996] Creating default 'jwt' HTTP authenticator for realm
'mesos-agent-readonly'
I0517 18:59:13.072119 21785 http.cpp:975] Creating default 'basic' HTTP authenticator for
realm 'mesos-agent-readwrite'
I0517 18:59:13.072281 21785 http.cpp:996] Creating default 'jwt' HTTP authenticator for realm
'mesos-agent-readwrite'
I0517 18:59:13.073726 21785 slave.cpp:529] Agent resources: cpus(*):2; mem(*):1024; disk(*):1024;
ports(*):[31000-32000]
I0517 18:59:13.073804 21785 slave.cpp:537] Agent attributes: [  ]
I0517 18:59:13.073817 21785 slave.cpp:542] Agent hostname: 770ca1180a14
I0517 18:59:13.073938 21798 status_update_manager.cpp:177] Pausing sending status updates
I0517 18:59:13.075268 21792 state.cpp:62] Recovering state from '/tmp/Endpoint_SlaveEndpointTest_NoAuthorizer_1_SResSb/meta'
I0517 18:59:13.075656 21788 status_update_manager.cpp:203] Recovering status update manager
I0517 18:59:13.076020 21789 containerizer.cpp:608] Recovering containerizer
I0517 18:59:13.077345 21795 provisioner.cpp:410] Provisioner recovery complete
I0517 18:59:13.077706 21802 slave.cpp:5974] Finished recovery
I0517 18:59:13.078133 21802 slave.cpp:6156] Querying resource estimator for oversubscribable
resources
I0517 18:59:13.078518 21787 slave.cpp:6170] Received oversubscribable resources {} from the
resource estimator
I0517 18:59:13.080278 21800 process.cpp:3730] Handling HTTP event for process 'slave(757)'
with path: '/slave(757)/monitor/statistics.json'
I0517 18:59:13.081912 21788 http.cpp:1115] HTTP GET for /slave(757)/monitor/statistics.json
from 172.17.0.2:39264
I0517 18:59:13.081979 21788 http.cpp:936] Authorizing principal 'test-principal' to GET the
'/monitor/statistics.json' endpoint
I0517 18:59:13.085264 21783 slave.cpp:794] Agent terminating
[       OK ] Endpoint/SlaveEndpointTest.NoAuthorizer/1 (28 ms)
[ RUN      ] Endpoint/SlaveEndpointTest.NoAuthorizer/2
I0517 18:59:13.095268  1325 containerizer.cpp:221] Using isolation: posix/cpu,posix/mem,filesystem/posix,network/cni
W0517 18:59:13.095759  1325 backend.cpp:76] Failed to create 'aufs' backend: AufsBackend requires
root privileges
W0517 18:59:13.095852  1325 backend.cpp:76] Failed to create 'bind' backend: BindBackend requires
root privileges
I0517 18:59:13.095882  1325 provisioner.cpp:249] Using default backend 'copy'
I0517 18:59:13.097303  1325 cluster.cpp:448] Creating default 'local' authorizer
I0517 18:59:13.098841 21797 slave.cpp:225] Mesos agent started on (758)@172.17.0.2:45832
I0517 18:59:13.098862 21797 slave.cpp:226] Flags at startup: --acls="" --appc_simple_discovery_uri_prefix="http://"
--appc_store_dir="/tmp/mesos/store/appc" --authenticate_http_executors="true" --authenticate_http_readonly="true"
--authenticate_http_readwrite="true" --authenticatee="crammd5" --authentication_backoff_factor="1secs"
--authorizer="local" --cgroups_cpu_enable_pids_and_tids_count="false" --cgroups_enable_cfs="false"
--cgroups_hierarchy="/sys/fs/cgroup" --cgroups_limit_swap="false" --cgroups_root="mesos" --container_disk_watch_interval="15secs"
--containerizers="mesos" --credential="/tmp/Endpoint_SlaveEndpointTest_NoAuthorizer_2_PRAmZH/credential"
--default_role="*" --disk_watch_interval="1mins" --docker="docker" --docker_kill_orphans="true"
--docker_registry="https://registry-1.docker.io" --docker_remove_delay="6hrs" --docker_socket="/var/run/docker.sock"
--docker_stop_timeout="0ns" --docker_store_dir="/tmp/mesos/store/docker" --docker_volume_checkpoint_dir="/var/run/mesos/isolators/docker/volume"
--enforce_container_disk_quota="false" --executor_registration_timeout="1mins" --executor_secret_key="/tmp/Endpoint_SlaveEndpointTest_NoAuthorizer_2_PRAmZH/executor_secret_key"
--executor_shutdown_grace_period="5secs" --fetcher_cache_dir="/tmp/Endpoint_SlaveEndpointTest_NoAuthorizer_2_PRAmZH/fetch"
--fetcher_cache_size="2GB" --frameworks_home="" --gc_delay="1weeks" --gc_disk_headroom="0.1"
--hadoop_home="" --help="false" --hostname_lookup="true" --http_command_executor="false" --http_credentials="/tmp/Endpoint_SlaveEndpointTest_NoAuthorizer_2_PRAmZH/http_credentials"
--http_heartbeat_interval="30secs" --initialize_driver_logging="true" --isolation="posix/cpu,posix/mem"
--launcher="posix" --launcher_dir="/mesos/mesos-1.4.0/_build/src" --logbufsecs="0" --logging_level="INFO"
--max_completed_executors_per_framework="150" --oversubscribed_resources_interval="15secs"
--perf_duration="10secs" --perf_interval="1mins" --port="5051" --qos_correction_interval_min="0ns"
--quiet="false" --recover="reconnect" --recovery_timeout="15mins" --registration_backoff_factor="10ms"
--resources="cpus:2;gpus:0;mem:1024;disk:1024;ports:[31000-32000]" --revocable_cpu_low_priority="true"
--runtime_dir="/tmp/Endpoint_SlaveEndpointTest_NoAuthorizer_2_PRAmZH" --sandbox_directory="/mnt/mesos/sandbox"
--strict="true" --switch_user="true" --systemd_enable_support="true" --systemd_runtime_directory="/run/systemd/system"
--version="false" --work_dir="/tmp/Endpoint_SlaveEndpointTest_NoAuthorizer_2_aCH28o"
I0517 18:59:13.099225 21797 credentials.hpp:86] Loading credential for authentication from
'/tmp/Endpoint_SlaveEndpointTest_NoAuthorizer_2_PRAmZH/credential'
I0517 18:59:13.099365 21797 slave.cpp:258] Agent using credential for: test-principal
I0517 18:59:13.099386 21797 credentials.hpp:37] Loading credentials for authentication from
'/tmp/Endpoint_SlaveEndpointTest_NoAuthorizer_2_PRAmZH/http_credentials'
I0517 18:59:13.099635 21797 http.cpp:975] Creating default 'basic' HTTP authenticator for
realm 'mesos-agent-executor'
I0517 18:59:13.099735 21797 http.cpp:996] Creating default 'jwt' HTTP authenticator for realm
'mesos-agent-executor'
I0517 18:59:13.099927 21797 http.cpp:975] Creating default 'basic' HTTP authenticator for
realm 'mesos-agent-readonly'
I0517 18:59:13.100025 21797 http.cpp:996] Creating default 'jwt' HTTP authenticator for realm
'mesos-agent-readonly'
I0517 18:59:13.100271 21797 http.cpp:975] Creating default 'basic' HTTP authenticator for
realm 'mesos-agent-readwrite'
I0517 18:59:13.100373 21797 http.cpp:996] Creating default 'jwt' HTTP authenticator for realm
'mesos-agent-readwrite'
I0517 18:59:13.101670 21797 slave.cpp:529] Agent resources: cpus(*):2; mem(*):1024; disk(*):1024;
ports(*):[31000-32000]
I0517 18:59:13.101747 21797 slave.cpp:537] Agent attributes: [  ]
I0517 18:59:13.101758 21797 slave.cpp:542] Agent hostname: 770ca1180a14
I0517 18:59:13.101871 21787 status_update_manager.cpp:177] Pausing sending status updates
I0517 18:59:13.103101 21805 state.cpp:62] Recovering state from '/tmp/Endpoint_SlaveEndpointTest_NoAuthorizer_2_aCH28o/meta'
I0517 18:59:13.103471 21789 status_update_manager.cpp:203] Recovering status update manager
I0517 18:59:13.103652 21798 containerizer.cpp:608] Recovering containerizer
I0517 18:59:13.104934 21791 provisioner.cpp:410] Provisioner recovery complete
I0517 18:59:13.105285 21805 slave.cpp:5974] Finished recovery
I0517 18:59:13.105732 21805 slave.cpp:6156] Querying resource estimator for oversubscribable
resources
I0517 18:59:13.105974 21787 slave.cpp:6170] Received oversubscribable resources {} from the
resource estimator
I0517 18:59:13.107820 21783 process.cpp:3730] Handling HTTP event for process 'slave(758)'
with path: '/slave(758)/containers'
I0517 18:59:13.109377 21791 http.cpp:1115] HTTP GET for /slave(758)/containers from 172.17.0.2:39266
I0517 18:59:13.109457 21791 http.cpp:936] Authorizing principal 'test-principal' to GET the
'/containers' endpoint
I0517 18:59:13.112709 21782 slave.cpp:794] Agent terminating
[       OK ] Endpoint/SlaveEndpointTest.NoAuthorizer/2 (28 ms)
[----------] 9 tests from Endpoint/SlaveEndpointTest (249 ms total)

[----------] Global test environment tear-down
[==========] 1583 tests from 177 test cases ran. (587839 ms total)
[  PASSED  ] 1579 tests.
[  FAILED  ] 4 tests, listed below:
[  FAILED  ] DefaultExecutorCheckTest.CommandCheckDeliveredAndReconciled
[  FAILED  ] DefaultExecutorCheckTest.CommandCheckStatusChange
[  FAILED  ] DefaultExecutorCheckTest.CommandCheckSeesParentsEnv
[  FAILED  ] DefaultExecutorCheckTest.CommandCheckSharesWorkDirWithTask

 4 FAILED TESTS
  YOU HAVE 22 DISABLED TESTS

E0517 18:59:13.177794 21806 process.cpp:950] Failed to accept socket: future discarded
make[4]: *** [check-local] Error 1
make[4]: Leaving directory `/mesos/mesos-1.4.0/_build/src'
make[3]: *** [check-am] Error 2
make[3]: Leaving directory `/mesos/mesos-1.4.0/_build/src'
make[2]: *** [check] Error 2
make[2]: Leaving directory `/mesos/mesos-1.4.0/_build/src'
make[1]: *** [check-recursive] Error 1
make[1]: Leaving directory `/mesos/mesos-1.4.0/_build'
make: *** [distcheck] Error 1
+ docker rmi mesos-1495044587-32575
Untagged: mesos-1495044587-32575:latest
Deleted: sha256:ce84a4b0a74d337e974aefde152b1bc0cabdb9156cd2ca7bda9dce43b7af69b4
Deleted: sha256:fea04ba442bffabb9246ae55714bdc7052c23b77be15f2977b0216e0a3396564
Deleted: sha256:d037ca847dc2385f93f59e44810907aa955037f472cf45176d2839249ba43e67
Deleted: sha256:2c649d9d21c108d2d4a3819bd7030405e9417bd54745583d6ffcea9504914eb9
Deleted: sha256:b7ad1fdc4b298685fb62c61a680597a3c00f08cee20cc4e6c0e17766a18ef818
Deleted: sha256:b8d0afa9ad1ceed0a2f5c34813868a86d0e01ff30bc7cad5e48058cead3ebef1
Deleted: sha256:0678609b99506db5da55b6c42b61793a654591cd3248257b76440ba0291c61ad
Deleted: sha256:152bf56f5389b95a0f1cc8d21760383ff0b2101b97853617f980d99b64a95ab7
Deleted: sha256:f456bd6d6f34dfa135b5f905389d6848477302a1e6181ee5cd05fdae3205eb21
Deleted: sha256:5b436dead6e011dd4198ea96551e03c15fb4cb5da81e23870a3462eedd986c68
Deleted: sha256:ca084f5db1caf77147c7525ff68b821ce706db17ddd749adad606a2702b002bb
Deleted: sha256:6831d25360677ea793045ce17ec6415efae23701a9993a12327aa4bf3669a741
Deleted: sha256:9548efa567f8a474ce1c78538a3edc8799bcf0556925eaaa22c10b65e0851c13
Deleted: sha256:ae1cef9d0b3040cf2db11915f7162942682de4ac51114ac396c75572245c004c
Deleted: sha256:c996ab1a0565ae50d2e619e7912c26e7e17657d2b51acffbc8a054475389d477
Deleted: sha256:b50ace42061f45d9476759cae56980a0691527f8a4353a2fdc9592d6a188cf6b
Deleted: sha256:997f95ae196dee1a714d3f7f99110e1fa21785417de1e5e6b3595112c5d391ea
Deleted: sha256:c677e3b3c9421ffe7505725da86f0819f95455766fdfe9ed3e8f90c11bcd41aa
Deleted: sha256:03bcfc6ade121e8db768695bbbde503cf765599f7783c9d33db21ac24b5976b2
Deleted: sha256:ea91c6e637d9ef0322a8e346bff1e544b940f5eefb71ff2bb6596432bc691f9a
Deleted: sha256:be0e77976490f3c568b5e724e872a909498a3a27b79c9afd5ecef289db8b3ea3
Deleted: sha256:8be1fe740d30580ff0286c4016230056c3a25883ee1ddb93c179402880320e95
Deleted: sha256:f69fad266a7eacc012ddca624add12fdb3c1af8d1f346634b809ee8ec93c648d
Deleted: sha256:0dc59c22d5b75ccc972e412c17212ac86dfc34dcbba261f373dc7f6f713eb54f
Build step 'Execute shell' marked build as failure
Not sending mail to unregistered user xujyan@apple.com
Not sending mail to unregistered user neil.conway@gmail.com

Mime
View raw message