mesos-builds mailing list archives

Site index · List index
Message view « Date » · « Thread »
Top « Date » · « Thread »
From Apache Jenkins Server <jenk...@builds.apache.org>
Subject Build failed in Jenkins: Mesos-Reviewbot #18129
Date Fri, 19 May 2017 23:45:29 GMT
See <https://builds.apache.org/job/Mesos-Reviewbot/18129/display/redirect>

------------------------------------------
[...truncated 26.98 MB...]
I0519 23:45:23.744913 30905 slave.cpp:794] Agent terminating
[       OK ] Endpoint/SlaveEndpointTest.AuthorizedRequest/1 (28 ms)
[ RUN      ] Endpoint/SlaveEndpointTest.AuthorizedRequest/2
I0519 23:45:23.754075 30885 containerizer.cpp:221] Using isolation: posix/cpu,posix/mem,filesystem/posix,network/cni
W0519 23:45:23.754571 30885 backend.cpp:76] Failed to create 'aufs' backend: AufsBackend requires
root privileges
W0519 23:45:23.754673 30885 backend.cpp:76] Failed to create 'bind' backend: BindBackend requires
root privileges
I0519 23:45:23.754703 30885 provisioner.cpp:249] Using default backend 'copy'
I0519 23:45:23.757483 30926 slave.cpp:225] Mesos agent started on (746)@172.17.0.2:39432
I0519 23:45:23.757503 30926 slave.cpp:226] Flags at startup: --acls="" --appc_simple_discovery_uri_prefix="http://"
--appc_store_dir="/tmp/mesos/store/appc" --authenticate_http_readonly="true" --authenticate_http_readwrite="true"
--authenticatee="crammd5" --authentication_backoff_factor="1secs" --authorizer="local" --cgroups_cpu_enable_pids_and_tids_count="false"
--cgroups_enable_cfs="false" --cgroups_hierarchy="/sys/fs/cgroup" --cgroups_limit_swap="false"
--cgroups_root="mesos" --container_disk_watch_interval="15secs" --containerizers="mesos" --credential="/tmp/Endpoint_SlaveEndpointTest_AuthorizedRequest_2_7ITGBC/credential"
--default_role="*" --disk_watch_interval="1mins" --docker="docker" --docker_kill_orphans="true"
--docker_registry="https://registry-1.docker.io" --docker_remove_delay="6hrs" --docker_socket="/var/run/docker.sock"
--docker_stop_timeout="0ns" --docker_store_dir="/tmp/mesos/store/docker" --docker_volume_checkpoint_dir="/var/run/mesos/isolators/docker/volume"
--enforce_container_disk_quota="false" --executor_registration_timeout="1mins" --executor_shutdown_grace_period="5secs"
--fetcher_cache_dir="/tmp/Endpoint_SlaveEndpointTest_AuthorizedRequest_2_7ITGBC/fetch" --fetcher_cache_size="2GB"
--frameworks_home="" --gc_delay="1weeks" --gc_disk_headroom="0.1" --hadoop_home="" --help="false"
--hostname_lookup="true" --http_command_executor="false" --http_credentials="/tmp/Endpoint_SlaveEndpointTest_AuthorizedRequest_2_7ITGBC/http_credentials"
--http_heartbeat_interval="30secs" --initialize_driver_logging="true" --isolation="posix/cpu,posix/mem"
--launcher="posix" --launcher_dir="/mesos/mesos-1.4.0/_build/src" --logbufsecs="0" --logging_level="INFO"
--max_completed_executors_per_framework="150" --oversubscribed_resources_interval="15secs"
--perf_duration="10secs" --perf_interval="1mins" --port="5051" --qos_correction_interval_min="0ns"
--quiet="false" --recover="reconnect" --recovery_timeout="15mins" --registration_backoff_factor="10ms"
--resources="cpus:2;gpus:0;mem:1024;disk:1024;ports:[31000-32000]" --revocable_cpu_low_priority="true"
--runtime_dir="/tmp/Endpoint_SlaveEndpointTest_AuthorizedRequest_2_7ITGBC" --sandbox_directory="/mnt/mesos/sandbox"
--strict="true" --switch_user="true" --systemd_enable_support="true" --systemd_runtime_directory="/run/systemd/system"
--version="false" --work_dir="/tmp/Endpoint_SlaveEndpointTest_AuthorizedRequest_2_N4xywz"
I0519 23:45:23.757848 30926 credentials.hpp:86] Loading credential for authentication from
'/tmp/Endpoint_SlaveEndpointTest_AuthorizedRequest_2_7ITGBC/credential'
I0519 23:45:23.758008 30926 slave.cpp:258] Agent using credential for: test-principal
I0519 23:45:23.758036 30926 credentials.hpp:37] Loading credentials for authentication from
'/tmp/Endpoint_SlaveEndpointTest_AuthorizedRequest_2_7ITGBC/http_credentials'
I0519 23:45:23.758311 30926 http.cpp:975] Creating default 'basic' HTTP authenticator for
realm 'mesos-agent-readonly'
I0519 23:45:23.758502 30926 http.cpp:975] Creating default 'basic' HTTP authenticator for
realm 'mesos-agent-readwrite'
I0519 23:45:23.759868 30926 slave.cpp:529] Agent resources: cpus(*):2; mem(*):1024; disk(*):1024;
ports(*):[31000-32000]
I0519 23:45:23.759945 30926 slave.cpp:537] Agent attributes: [  ]
I0519 23:45:23.759958 30926 slave.cpp:542] Agent hostname: 4f9de521e2ee
I0519 23:45:23.760140 30915 status_update_manager.cpp:177] Pausing sending status updates
I0519 23:45:23.761700 30927 state.cpp:62] Recovering state from '/tmp/Endpoint_SlaveEndpointTest_AuthorizedRequest_2_N4xywz/meta'
I0519 23:45:23.762153 30914 status_update_manager.cpp:203] Recovering status update manager
I0519 23:45:23.762444 30913 containerizer.cpp:608] Recovering containerizer
I0519 23:45:23.764202 30909 provisioner.cpp:410] Provisioner recovery complete
I0519 23:45:23.764662 30914 slave.cpp:5974] Finished recovery
I0519 23:45:23.765120 30914 slave.cpp:6156] Querying resource estimator for oversubscribable
resources
I0519 23:45:23.765502 30913 slave.cpp:6170] Received oversubscribable resources {} from the
resource estimator
I0519 23:45:23.768573 30916 process.cpp:3730] Handling HTTP event for process 'slave(746)'
with path: '/slave(746)/containers'
I0519 23:45:23.770236 30926 http.cpp:1115] HTTP GET for /slave(746)/containers from 172.17.0.2:46282
I0519 23:45:23.770319 30926 http.cpp:936] Authorizing principal 'test-principal' to GET the
'/containers' endpoint
I0519 23:45:23.774281 30921 slave.cpp:794] Agent terminating
[       OK ] Endpoint/SlaveEndpointTest.AuthorizedRequest/2 (30 ms)
[ RUN      ] Endpoint/SlaveEndpointTest.UnauthorizedRequest/0
I0519 23:45:23.784219 30885 containerizer.cpp:221] Using isolation: posix/cpu,posix/mem,filesystem/posix,network/cni
W0519 23:45:23.784729 30885 backend.cpp:76] Failed to create 'aufs' backend: AufsBackend requires
root privileges
W0519 23:45:23.784837 30885 backend.cpp:76] Failed to create 'bind' backend: BindBackend requires
root privileges
I0519 23:45:23.784876 30885 provisioner.cpp:249] Using default backend 'copy'
I0519 23:45:23.788190 30907 slave.cpp:225] Mesos agent started on (747)@172.17.0.2:39432
I0519 23:45:23.788298 30907 slave.cpp:226] Flags at startup: --acls="" --appc_simple_discovery_uri_prefix="http://"
--appc_store_dir="/tmp/mesos/store/appc" --authenticate_http_readonly="true" --authenticate_http_readwrite="true"
--authenticatee="crammd5" --authentication_backoff_factor="1secs" --authorizer="local" --cgroups_cpu_enable_pids_and_tids_count="false"
--cgroups_enable_cfs="false" --cgroups_hierarchy="/sys/fs/cgroup" --cgroups_limit_swap="false"
--cgroups_root="mesos" --container_disk_watch_interval="15secs" --containerizers="mesos" --credential="/tmp/Endpoint_SlaveEndpointTest_UnauthorizedRequest_0_SFxhbP/credential"
--default_role="*" --disk_watch_interval="1mins" --docker="docker" --docker_kill_orphans="true"
--docker_registry="https://registry-1.docker.io" --docker_remove_delay="6hrs" --docker_socket="/var/run/docker.sock"
--docker_stop_timeout="0ns" --docker_store_dir="/tmp/mesos/store/docker" --docker_volume_checkpoint_dir="/var/run/mesos/isolators/docker/volume"
--enforce_container_disk_quota="false" --executor_registration_timeout="1mins" --executor_shutdown_grace_period="5secs"
--fetcher_cache_dir="/tmp/Endpoint_SlaveEndpointTest_UnauthorizedRequest_0_SFxhbP/fetch" --fetcher_cache_size="2GB"
--frameworks_home="" --gc_delay="1weeks" --gc_disk_headroom="0.1" --hadoop_home="" --help="false"
--hostname_lookup="true" --http_command_executor="false" --http_credentials="/tmp/Endpoint_SlaveEndpointTest_UnauthorizedRequest_0_SFxhbP/http_credentials"
--http_heartbeat_interval="30secs" --initialize_driver_logging="true" --isolation="posix/cpu,posix/mem"
--launcher="posix" --launcher_dir="/mesos/mesos-1.4.0/_build/src" --logbufsecs="0" --logging_level="INFO"
--max_completed_executors_per_framework="150" --oversubscribed_resources_interval="15secs"
--perf_duration="10secs" --perf_interval="1mins" --port="5051" --qos_correction_interval_min="0ns"
--quiet="false" --recover="reconnect" --recovery_timeout="15mins" --registration_backoff_factor="10ms"
--resources="cpus:2;gpus:0;mem:1024;disk:1024;ports:[31000-32000]" --revocable_cpu_low_priority="true"
--runtime_dir="/tmp/Endpoint_SlaveEndpointTest_UnauthorizedRequest_0_SFxhbP" --sandbox_directory="/mnt/mesos/sandbox"
--strict="true" --switch_user="true" --systemd_enable_support="true" --systemd_runtime_directory="/run/systemd/system"
--version="false" --work_dir="/tmp/Endpoint_SlaveEndpointTest_UnauthorizedRequest_0_u8qF1L"
I0519 23:45:23.788681 30907 credentials.hpp:86] Loading credential for authentication from
'/tmp/Endpoint_SlaveEndpointTest_UnauthorizedRequest_0_SFxhbP/credential'
I0519 23:45:23.788868 30907 slave.cpp:258] Agent using credential for: test-principal
I0519 23:45:23.788892 30907 credentials.hpp:37] Loading credentials for authentication from
'/tmp/Endpoint_SlaveEndpointTest_UnauthorizedRequest_0_SFxhbP/http_credentials'
I0519 23:45:23.789153 30907 http.cpp:975] Creating default 'basic' HTTP authenticator for
realm 'mesos-agent-readonly'
I0519 23:45:23.789327 30907 http.cpp:975] Creating default 'basic' HTTP authenticator for
realm 'mesos-agent-readwrite'
I0519 23:45:23.790689 30907 slave.cpp:529] Agent resources: cpus(*):2; mem(*):1024; disk(*):1024;
ports(*):[31000-32000]
I0519 23:45:23.790763 30907 slave.cpp:537] Agent attributes: [  ]
I0519 23:45:23.790779 30907 slave.cpp:542] Agent hostname: 4f9de521e2ee
I0519 23:45:23.790948 30922 status_update_manager.cpp:177] Pausing sending status updates
I0519 23:45:23.792507 30926 state.cpp:62] Recovering state from '/tmp/Endpoint_SlaveEndpointTest_UnauthorizedRequest_0_u8qF1L/meta'
I0519 23:45:23.793035 30904 status_update_manager.cpp:203] Recovering status update manager
I0519 23:45:23.793239 30909 containerizer.cpp:608] Recovering containerizer
I0519 23:45:23.794718 30914 provisioner.cpp:410] Provisioner recovery complete
I0519 23:45:23.795109 30912 slave.cpp:5974] Finished recovery
I0519 23:45:23.795698 30912 slave.cpp:6156] Querying resource estimator for oversubscribable
resources
I0519 23:45:23.795981 30923 slave.cpp:6170] Received oversubscribable resources {} from the
resource estimator
I0519 23:45:23.798879 30910 process.cpp:3730] Handling HTTP event for process 'slave(747)'
with path: '/slave(747)/monitor/statistics'
I0519 23:45:23.800395 30910 http.cpp:1115] HTTP GET for /slave(747)/monitor/statistics from
172.17.0.2:46284
I0519 23:45:23.800475 30910 http.cpp:936] Authorizing principal 'test-principal' to GET the
'/monitor/statistics' endpoint
I0519 23:45:23.803079 30924 slave.cpp:794] Agent terminating
[       OK ] Endpoint/SlaveEndpointTest.UnauthorizedRequest/0 (29 ms)
[ RUN      ] Endpoint/SlaveEndpointTest.UnauthorizedRequest/1
I0519 23:45:23.812989 30885 containerizer.cpp:221] Using isolation: posix/cpu,posix/mem,filesystem/posix,network/cni
W0519 23:45:23.813550 30885 backend.cpp:76] Failed to create 'aufs' backend: AufsBackend requires
root privileges
W0519 23:45:23.813668 30885 backend.cpp:76] Failed to create 'bind' backend: BindBackend requires
root privileges
I0519 23:45:23.813701 30885 provisioner.cpp:249] Using default backend 'copy'
I0519 23:45:23.816759 30908 slave.cpp:225] Mesos agent started on (748)@172.17.0.2:39432
I0519 23:45:23.816792 30908 slave.cpp:226] Flags at startup: --acls="" --appc_simple_discovery_uri_prefix="http://"
--appc_store_dir="/tmp/mesos/store/appc" --authenticate_http_readonly="true" --authenticate_http_readwrite="true"
--authenticatee="crammd5" --authentication_backoff_factor="1secs" --authorizer="local" --cgroups_cpu_enable_pids_and_tids_count="false"
--cgroups_enable_cfs="false" --cgroups_hierarchy="/sys/fs/cgroup" --cgroups_limit_swap="false"
--cgroups_root="mesos" --container_disk_watch_interval="15secs" --containerizers="mesos" --credential="/tmp/Endpoint_SlaveEndpointTest_UnauthorizedRequest_1_pXTe21/credential"
--default_role="*" --disk_watch_interval="1mins" --docker="docker" --docker_kill_orphans="true"
--docker_registry="https://registry-1.docker.io" --docker_remove_delay="6hrs" --docker_socket="/var/run/docker.sock"
--docker_stop_timeout="0ns" --docker_store_dir="/tmp/mesos/store/docker" --docker_volume_checkpoint_dir="/var/run/mesos/isolators/docker/volume"
--enforce_container_disk_quota="false" --executor_registration_timeout="1mins" --executor_shutdown_grace_period="5secs"
--fetcher_cache_dir="/tmp/Endpoint_SlaveEndpointTest_UnauthorizedRequest_1_pXTe21/fetch" --fetcher_cache_size="2GB"
--frameworks_home="" --gc_delay="1weeks" --gc_disk_headroom="0.1" --hadoop_home="" --help="false"
--hostname_lookup="true" --http_command_executor="false" --http_credentials="/tmp/Endpoint_SlaveEndpointTest_UnauthorizedRequest_1_pXTe21/http_credentials"
--http_heartbeat_interval="30secs" --initialize_driver_logging="true" --isolation="posix/cpu,posix/mem"
--launcher="posix" --launcher_dir="/mesos/mesos-1.4.0/_build/src" --logbufsecs="0" --logging_level="INFO"
--max_completed_executors_per_framework="150" --oversubscribed_resources_interval="15secs"
--perf_duration="10secs" --perf_interval="1mins" --port="5051" --qos_correction_interval_min="0ns"
--quiet="false" --recover="reconnect" --recovery_timeout="15mins" --registration_backoff_factor="10ms"
--resources="cpus:2;gpus:0;mem:1024;disk:1024;ports:[31000-32000]" --revocable_cpu_low_priority="true"
--runtime_dir="/tmp/Endpoint_SlaveEndpointTest_UnauthorizedRequest_1_pXTe21" --sandbox_directory="/mnt/mesos/sandbox"
--strict="true" --switch_user="true" --systemd_enable_support="true" --systemd_runtime_directory="/run/systemd/system"
--version="false" --work_dir="/tmp/Endpoint_SlaveEndpointTest_UnauthorizedRequest_1_RJQlOY"
I0519 23:45:23.817196 30908 credentials.hpp:86] Loading credential for authentication from
'/tmp/Endpoint_SlaveEndpointTest_UnauthorizedRequest_1_pXTe21/credential'
I0519 23:45:23.817463 30908 slave.cpp:258] Agent using credential for: test-principal
I0519 23:45:23.817488 30908 credentials.hpp:37] Loading credentials for authentication from
'/tmp/Endpoint_SlaveEndpointTest_UnauthorizedRequest_1_pXTe21/http_credentials'
I0519 23:45:23.817737 30908 http.cpp:975] Creating default 'basic' HTTP authenticator for
realm 'mesos-agent-readonly'
I0519 23:45:23.817920 30908 http.cpp:975] Creating default 'basic' HTTP authenticator for
realm 'mesos-agent-readwrite'
I0519 23:45:23.819245 30908 slave.cpp:529] Agent resources: cpus(*):2; mem(*):1024; disk(*):1024;
ports(*):[31000-32000]
I0519 23:45:23.819327 30908 slave.cpp:537] Agent attributes: [  ]
I0519 23:45:23.819349 30908 slave.cpp:542] Agent hostname: 4f9de521e2ee
I0519 23:45:23.819504 30923 status_update_manager.cpp:177] Pausing sending status updates
I0519 23:45:23.820950 30905 state.cpp:62] Recovering state from '/tmp/Endpoint_SlaveEndpointTest_UnauthorizedRequest_1_RJQlOY/meta'
I0519 23:45:23.821377 30917 status_update_manager.cpp:203] Recovering status update manager
I0519 23:45:23.821576 30923 containerizer.cpp:608] Recovering containerizer
I0519 23:45:23.823077 30904 provisioner.cpp:410] Provisioner recovery complete
I0519 23:45:23.823496 30910 slave.cpp:5974] Finished recovery
I0519 23:45:23.824040 30910 slave.cpp:6156] Querying resource estimator for oversubscribable
resources
I0519 23:45:23.824329 30917 slave.cpp:6170] Received oversubscribable resources {} from the
resource estimator
I0519 23:45:23.827253 30919 process.cpp:3730] Handling HTTP event for process 'slave(748)'
with path: '/slave(748)/monitor/statistics.json'
I0519 23:45:23.828552 30916 http.cpp:1115] HTTP GET for /slave(748)/monitor/statistics.json
from 172.17.0.2:46286
I0519 23:45:23.828630 30916 http.cpp:936] Authorizing principal 'test-principal' to GET the
'/monitor/statistics.json' endpoint
I0519 23:45:23.831063 30911 slave.cpp:794] Agent terminating
[       OK ] Endpoint/SlaveEndpointTest.UnauthorizedRequest/1 (28 ms)
[ RUN      ] Endpoint/SlaveEndpointTest.UnauthorizedRequest/2
I0519 23:45:23.840973 30885 containerizer.cpp:221] Using isolation: posix/cpu,posix/mem,filesystem/posix,network/cni
W0519 23:45:23.841486 30885 backend.cpp:76] Failed to create 'aufs' backend: AufsBackend requires
root privileges
W0519 23:45:23.841598 30885 backend.cpp:76] Failed to create 'bind' backend: BindBackend requires
root privileges
I0519 23:45:23.841636 30885 provisioner.cpp:249] Using default backend 'copy'
I0519 23:45:23.844714 30923 slave.cpp:225] Mesos agent started on (749)@172.17.0.2:39432
I0519 23:45:23.844743 30923 slave.cpp:226] Flags at startup: --acls="" --appc_simple_discovery_uri_prefix="http://"
--appc_store_dir="/tmp/mesos/store/appc" --authenticate_http_readonly="true" --authenticate_http_readwrite="true"
--authenticatee="crammd5" --authentication_backoff_factor="1secs" --authorizer="local" --cgroups_cpu_enable_pids_and_tids_count="false"
--cgroups_enable_cfs="false" --cgroups_hierarchy="/sys/fs/cgroup" --cgroups_limit_swap="false"
--cgroups_root="mesos" --container_disk_watch_interval="15secs" --containerizers="mesos" --credential="/tmp/Endpoint_SlaveEndpointTest_UnauthorizedRequest_2_1uuU9e/credential"
--default_role="*" --disk_watch_interval="1mins" --docker="docker" --docker_kill_orphans="true"
--docker_registry="https://registry-1.docker.io" --docker_remove_delay="6hrs" --docker_socket="/var/run/docker.sock"
--docker_stop_timeout="0ns" --docker_store_dir="/tmp/mesos/store/docker" --docker_volume_checkpoint_dir="/var/run/mesos/isolators/docker/volume"
--enforce_container_disk_quota="false" --executor_registration_timeout="1mins" --executor_shutdown_grace_period="5secs"
--fetcher_cache_dir="/tmp/Endpoint_SlaveEndpointTest_UnauthorizedRequest_2_1uuU9e/fetch" --fetcher_cache_size="2GB"
--frameworks_home="" --gc_delay="1weeks" --gc_disk_headroom="0.1" --hadoop_home="" --help="false"
--hostname_lookup="true" --http_command_executor="false" --http_credentials="/tmp/Endpoint_SlaveEndpointTest_UnauthorizedRequest_2_1uuU9e/http_credentials"
--http_heartbeat_interval="30secs" --initialize_driver_logging="true" --isolation="posix/cpu,posix/mem"
--launcher="posix" --launcher_dir="/mesos/mesos-1.4.0/_build/src" --logbufsecs="0" --logging_level="INFO"
--max_completed_executors_per_framework="150" --oversubscribed_resources_interval="15secs"
--perf_duration="10secs" --perf_interval="1mins" --port="5051" --qos_correction_interval_min="0ns"
--quiet="false" --recover="reconnect" --recovery_timeout="15mins" --registration_backoff_factor="10ms"
--resources="cpus:2;gpus:0;mem:1024;disk:1024;ports:[31000-32000]" --revocable_cpu_low_priority="true"
--runtime_dir="/tmp/Endpoint_SlaveEndpointTest_UnauthorizedRequest_2_1uuU9e" --sandbox_directory="/mnt/mesos/sandbox"
--strict="true" --switch_user="true" --systemd_enable_support="true" --systemd_runtime_directory="/run/systemd/system"
--version="false" --work_dir="/tmp/Endpoint_SlaveEndpointTest_UnauthorizedRequest_2_y1zRRb"
I0519 23:45:23.845122 30923 credentials.hpp:86] Loading credential for authentication from
'/tmp/Endpoint_SlaveEndpointTest_UnauthorizedRequest_2_1uuU9e/credential'
I0519 23:45:23.845299 30923 slave.cpp:258] Agent using credential for: test-principal
I0519 23:45:23.845322 30923 credentials.hpp:37] Loading credentials for authentication from
'/tmp/Endpoint_SlaveEndpointTest_UnauthorizedRequest_2_1uuU9e/http_credentials'
I0519 23:45:23.845572 30923 http.cpp:975] Creating default 'basic' HTTP authenticator for
realm 'mesos-agent-readonly'
I0519 23:45:23.845734 30923 http.cpp:975] Creating default 'basic' HTTP authenticator for
realm 'mesos-agent-readwrite'
I0519 23:45:23.847009 30923 slave.cpp:529] Agent resources: cpus(*):2; mem(*):1024; disk(*):1024;
ports(*):[31000-32000]
I0519 23:45:23.847084 30923 slave.cpp:537] Agent attributes: [  ]
I0519 23:45:23.847101 30923 slave.cpp:542] Agent hostname: 4f9de521e2ee
I0519 23:45:23.847259 30914 status_update_manager.cpp:177] Pausing sending status updates
I0519 23:45:23.848752 30906 state.cpp:62] Recovering state from '/tmp/Endpoint_SlaveEndpointTest_UnauthorizedRequest_2_y1zRRb/meta'
I0519 23:45:23.849261 30914 status_update_manager.cpp:203] Recovering status update manager
I0519 23:45:23.849581 30927 containerizer.cpp:608] Recovering containerizer
I0519 23:45:23.851464 30908 provisioner.cpp:410] Provisioner recovery complete
I0519 23:45:23.852011 30909 slave.cpp:5974] Finished recovery
I0519 23:45:23.852630 30909 slave.cpp:6156] Querying resource estimator for oversubscribable
resources
I0519 23:45:23.852952 30923 slave.cpp:6170] Received oversubscribable resources {} from the
resource estimator
I0519 23:45:23.855664 30907 process.cpp:3730] Handling HTTP event for process 'slave(749)'
with path: '/slave(749)/containers'
I0519 23:45:23.857054 30919 http.cpp:1115] HTTP GET for /slave(749)/containers from 172.17.0.2:46288
I0519 23:45:23.857151 30919 http.cpp:936] Authorizing principal 'test-principal' to GET the
'/containers' endpoint
I0519 23:45:23.860121 30920 slave.cpp:794] Agent terminating
[       OK ] Endpoint/SlaveEndpointTest.UnauthorizedRequest/2 (29 ms)
[ RUN      ] Endpoint/SlaveEndpointTest.NoAuthorizer/0
I0519 23:45:23.873343 30885 containerizer.cpp:221] Using isolation: posix/cpu,posix/mem,filesystem/posix,network/cni
W0519 23:45:23.874172 30885 backend.cpp:76] Failed to create 'aufs' backend: AufsBackend requires
root privileges
W0519 23:45:23.874311 30885 backend.cpp:76] Failed to create 'bind' backend: BindBackend requires
root privileges
I0519 23:45:23.874361 30885 provisioner.cpp:249] Using default backend 'copy'
I0519 23:45:23.876492 30885 cluster.cpp:448] Creating default 'local' authorizer
I0519 23:45:23.878980 30921 slave.cpp:225] Mesos agent started on (750)@172.17.0.2:39432
I0519 23:45:23.879004 30921 slave.cpp:226] Flags at startup: --acls="" --appc_simple_discovery_uri_prefix="http://"
--appc_store_dir="/tmp/mesos/store/appc" --authenticate_http_readonly="true" --authenticate_http_readwrite="true"
--authenticatee="crammd5" --authentication_backoff_factor="1secs" --authorizer="local" --cgroups_cpu_enable_pids_and_tids_count="false"
--cgroups_enable_cfs="false" --cgroups_hierarchy="/sys/fs/cgroup" --cgroups_limit_swap="false"
--cgroups_root="mesos" --container_disk_watch_interval="15secs" --containerizers="mesos" --credential="/tmp/Endpoint_SlaveEndpointTest_NoAuthorizer_0_lMBozs/credential"
--default_role="*" --disk_watch_interval="1mins" --docker="docker" --docker_kill_orphans="true"
--docker_registry="https://registry-1.docker.io" --docker_remove_delay="6hrs" --docker_socket="/var/run/docker.sock"
--docker_stop_timeout="0ns" --docker_store_dir="/tmp/mesos/store/docker" --docker_volume_checkpoint_dir="/var/run/mesos/isolators/docker/volume"
--enforce_container_disk_quota="false" --executor_registration_timeout="1mins" --executor_shutdown_grace_period="5secs"
--fetcher_cache_dir="/tmp/Endpoint_SlaveEndpointTest_NoAuthorizer_0_lMBozs/fetch" --fetcher_cache_size="2GB"
--frameworks_home="" --gc_delay="1weeks" --gc_disk_headroom="0.1" --hadoop_home="" --help="false"
--hostname_lookup="true" --http_command_executor="false" --http_credentials="/tmp/Endpoint_SlaveEndpointTest_NoAuthorizer_0_lMBozs/http_credentials"
--http_heartbeat_interval="30secs" --initialize_driver_logging="true" --isolation="posix/cpu,posix/mem"
--launcher="posix" --launcher_dir="/mesos/mesos-1.4.0/_build/src" --logbufsecs="0" --logging_level="INFO"
--max_completed_executors_per_framework="150" --oversubscribed_resources_interval="15secs"
--perf_duration="10secs" --perf_interval="1mins" --port="5051" --qos_correction_interval_min="0ns"
--quiet="false" --recover="reconnect" --recovery_timeout="15mins" --registration_backoff_factor="10ms"
--resources="cpus:2;gpus:0;mem:1024;disk:1024;ports:[31000-32000]" --revocable_cpu_low_priority="true"
--runtime_dir="/tmp/Endpoint_SlaveEndpointTest_NoAuthorizer_0_lMBozs" --sandbox_directory="/mnt/mesos/sandbox"
--strict="true" --switch_user="true" --systemd_enable_support="true" --systemd_runtime_directory="/run/systemd/system"
--version="false" --work_dir="/tmp/Endpoint_SlaveEndpointTest_NoAuthorizer_0_qeCLcp"
I0519 23:45:23.879353 30921 credentials.hpp:86] Loading credential for authentication from
'/tmp/Endpoint_SlaveEndpointTest_NoAuthorizer_0_lMBozs/credential'
I0519 23:45:23.879530 30921 slave.cpp:258] Agent using credential for: test-principal
I0519 23:45:23.879554 30921 credentials.hpp:37] Loading credentials for authentication from
'/tmp/Endpoint_SlaveEndpointTest_NoAuthorizer_0_lMBozs/http_credentials'
I0519 23:45:23.879796 30921 http.cpp:975] Creating default 'basic' HTTP authenticator for
realm 'mesos-agent-readonly'
I0519 23:45:23.880065 30921 http.cpp:975] Creating default 'basic' HTTP authenticator for
realm 'mesos-agent-readwrite'
I0519 23:45:23.881261 30921 slave.cpp:529] Agent resources: cpus(*):2; mem(*):1024; disk(*):1024;
ports(*):[31000-32000]
I0519 23:45:23.881335 30921 slave.cpp:537] Agent attributes: [  ]
I0519 23:45:23.881353 30921 slave.cpp:542] Agent hostname: 4f9de521e2ee
I0519 23:45:23.881503 30923 status_update_manager.cpp:177] Pausing sending status updates
I0519 23:45:23.882892 30912 state.cpp:62] Recovering state from '/tmp/Endpoint_SlaveEndpointTest_NoAuthorizer_0_qeCLcp/meta'
I0519 23:45:23.883352 30917 status_update_manager.cpp:203] Recovering status update manager
I0519 23:45:23.883613 30926 containerizer.cpp:608] Recovering containerizer
I0519 23:45:23.885298 30918 provisioner.cpp:410] Provisioner recovery complete
I0519 23:45:23.885859 30907 slave.cpp:5974] Finished recovery
I0519 23:45:23.886497 30907 slave.cpp:6156] Querying resource estimator for oversubscribable
resources
I0519 23:45:23.886893 30905 slave.cpp:6170] Received oversubscribable resources {} from the
resource estimator
I0519 23:45:23.889760 30921 process.cpp:3730] Handling HTTP event for process 'slave(750)'
with path: '/slave(750)/monitor/statistics'
I0519 23:45:23.891289 30919 http.cpp:1115] HTTP GET for /slave(750)/monitor/statistics from
172.17.0.2:46290
I0519 23:45:23.891360 30919 http.cpp:936] Authorizing principal 'test-principal' to GET the
'/monitor/statistics' endpoint
I0519 23:45:23.895627 30923 slave.cpp:794] Agent terminating
[       OK ] Endpoint/SlaveEndpointTest.NoAuthorizer/0 (34 ms)
[ RUN      ] Endpoint/SlaveEndpointTest.NoAuthorizer/1
I0519 23:45:23.905444 30885 containerizer.cpp:221] Using isolation: posix/cpu,posix/mem,filesystem/posix,network/cni
W0519 23:45:23.905926 30885 backend.cpp:76] Failed to create 'aufs' backend: AufsBackend requires
root privileges
W0519 23:45:23.906035 30885 backend.cpp:76] Failed to create 'bind' backend: BindBackend requires
root privileges
I0519 23:45:23.906075 30885 provisioner.cpp:249] Using default backend 'copy'
I0519 23:45:23.907521 30885 cluster.cpp:448] Creating default 'local' authorizer
I0519 23:45:23.909034 30906 slave.cpp:225] Mesos agent started on (751)@172.17.0.2:39432
I0519 23:45:23.909055 30906 slave.cpp:226] Flags at startup: --acls="" --appc_simple_discovery_uri_prefix="http://"
--appc_store_dir="/tmp/mesos/store/appc" --authenticate_http_readonly="true" --authenticate_http_readwrite="true"
--authenticatee="crammd5" --authentication_backoff_factor="1secs" --authorizer="local" --cgroups_cpu_enable_pids_and_tids_count="false"
--cgroups_enable_cfs="false" --cgroups_hierarchy="/sys/fs/cgroup" --cgroups_limit_swap="false"
--cgroups_root="mesos" --container_disk_watch_interval="15secs" --containerizers="mesos" --credential="/tmp/Endpoint_SlaveEndpointTest_NoAuthorizer_1_hRO8iG/credential"
--default_role="*" --disk_watch_interval="1mins" --docker="docker" --docker_kill_orphans="true"
--docker_registry="https://registry-1.docker.io" --docker_remove_delay="6hrs" --docker_socket="/var/run/docker.sock"
--docker_stop_timeout="0ns" --docker_store_dir="/tmp/mesos/store/docker" --docker_volume_checkpoint_dir="/var/run/mesos/isolators/docker/volume"
--enforce_container_disk_quota="false" --executor_registration_timeout="1mins" --executor_shutdown_grace_period="5secs"
--fetcher_cache_dir="/tmp/Endpoint_SlaveEndpointTest_NoAuthorizer_1_hRO8iG/fetch" --fetcher_cache_size="2GB"
--frameworks_home="" --gc_delay="1weeks" --gc_disk_headroom="0.1" --hadoop_home="" --help="false"
--hostname_lookup="true" --http_command_executor="false" --http_credentials="/tmp/Endpoint_SlaveEndpointTest_NoAuthorizer_1_hRO8iG/http_credentials"
--http_heartbeat_interval="30secs" --initialize_driver_logging="true" --isolation="posix/cpu,posix/mem"
--launcher="posix" --launcher_dir="/mesos/mesos-1.4.0/_build/src" --logbufsecs="0" --logging_level="INFO"
--max_completed_executors_per_framework="150" --oversubscribed_resources_interval="15secs"
--perf_duration="10secs" --perf_interval="1mins" --port="5051" --qos_correction_interval_min="0ns"
--quiet="false" --recover="reconnect" --recovery_timeout="15mins" --registration_backoff_factor="10ms"
--resources="cpus:2;gpus:0;mem:1024;disk:1024;ports:[31000-32000]" --revocable_cpu_low_priority="true"
--runtime_dir="/tmp/Endpoint_SlaveEndpointTest_NoAuthorizer_1_hRO8iG" --sandbox_directory="/mnt/mesos/sandbox"
--strict="true" --switch_user="true" --systemd_enable_support="true" --systemd_runtime_directory="/run/systemd/system"
--version="false" --work_dir="/tmp/Endpoint_SlaveEndpointTest_NoAuthorizer_1_Ca8uRC"
I0519 23:45:23.909484 30906 credentials.hpp:86] Loading credential for authentication from
'/tmp/Endpoint_SlaveEndpointTest_NoAuthorizer_1_hRO8iG/credential'
I0519 23:45:23.909660 30906 slave.cpp:258] Agent using credential for: test-principal
I0519 23:45:23.909684 30906 credentials.hpp:37] Loading credentials for authentication from
'/tmp/Endpoint_SlaveEndpointTest_NoAuthorizer_1_hRO8iG/http_credentials'
I0519 23:45:23.909906 30906 http.cpp:975] Creating default 'basic' HTTP authenticator for
realm 'mesos-agent-readonly'
I0519 23:45:23.910068 30906 http.cpp:975] Creating default 'basic' HTTP authenticator for
realm 'mesos-agent-readwrite'
I0519 23:45:23.911372 30906 slave.cpp:529] Agent resources: cpus(*):2; mem(*):1024; disk(*):1024;
ports(*):[31000-32000]
I0519 23:45:23.911447 30906 slave.cpp:537] Agent attributes: [  ]
I0519 23:45:23.911465 30906 slave.cpp:542] Agent hostname: 4f9de521e2ee
I0519 23:45:23.911677 30915 status_update_manager.cpp:177] Pausing sending status updates
I0519 23:45:23.913085 30922 state.cpp:62] Recovering state from '/tmp/Endpoint_SlaveEndpointTest_NoAuthorizer_1_Ca8uRC/meta'
I0519 23:45:23.913414 30915 status_update_manager.cpp:203] Recovering status update manager
I0519 23:45:23.913705 30907 containerizer.cpp:608] Recovering containerizer
I0519 23:45:23.915092 30910 provisioner.cpp:410] Provisioner recovery complete
I0519 23:45:23.915480 30922 slave.cpp:5974] Finished recovery
I0519 23:45:23.916002 30922 slave.cpp:6156] Querying resource estimator for oversubscribable
resources
I0519 23:45:23.916291 30919 slave.cpp:6170] Received oversubscribable resources {} from the
resource estimator
I0519 23:45:23.919080 30906 process.cpp:3730] Handling HTTP event for process 'slave(751)'
with path: '/slave(751)/monitor/statistics.json'
I0519 23:45:23.920466 30919 http.cpp:1115] HTTP GET for /slave(751)/monitor/statistics.json
from 172.17.0.2:46292
I0519 23:45:23.920577 30919 http.cpp:936] Authorizing principal 'test-principal' to GET the
'/monitor/statistics.json' endpoint
I0519 23:45:23.923727 30919 slave.cpp:794] Agent terminating
[       OK ] Endpoint/SlaveEndpointTest.NoAuthorizer/1 (28 ms)
[ RUN      ] Endpoint/SlaveEndpointTest.NoAuthorizer/2
I0519 23:45:23.934056 30885 containerizer.cpp:221] Using isolation: posix/cpu,posix/mem,filesystem/posix,network/cni
W0519 23:45:23.934612 30885 backend.cpp:76] Failed to create 'aufs' backend: AufsBackend requires
root privileges
W0519 23:45:23.934741 30885 backend.cpp:76] Failed to create 'bind' backend: BindBackend requires
root privileges
I0519 23:45:23.934782 30885 provisioner.cpp:249] Using default backend 'copy'
I0519 23:45:23.936421 30885 cluster.cpp:448] Creating default 'local' authorizer
I0519 23:45:23.938026 30910 slave.cpp:225] Mesos agent started on (752)@172.17.0.2:39432
I0519 23:45:23.938060 30910 slave.cpp:226] Flags at startup: --acls="" --appc_simple_discovery_uri_prefix="http://"
--appc_store_dir="/tmp/mesos/store/appc" --authenticate_http_readonly="true" --authenticate_http_readwrite="true"
--authenticatee="crammd5" --authentication_backoff_factor="1secs" --authorizer="local" --cgroups_cpu_enable_pids_and_tids_count="false"
--cgroups_enable_cfs="false" --cgroups_hierarchy="/sys/fs/cgroup" --cgroups_limit_swap="false"
--cgroups_root="mesos" --container_disk_watch_interval="15secs" --containerizers="mesos" --credential="/tmp/Endpoint_SlaveEndpointTest_NoAuthorizer_2_8EH1jU/credential"
--default_role="*" --disk_watch_interval="1mins" --docker="docker" --docker_kill_orphans="true"
--docker_registry="https://registry-1.docker.io" --docker_remove_delay="6hrs" --docker_socket="/var/run/docker.sock"
--docker_stop_timeout="0ns" --docker_store_dir="/tmp/mesos/store/docker" --docker_volume_checkpoint_dir="/var/run/mesos/isolators/docker/volume"
--enforce_container_disk_quota="false" --executor_registration_timeout="1mins" --executor_shutdown_grace_period="5secs"
--fetcher_cache_dir="/tmp/Endpoint_SlaveEndpointTest_NoAuthorizer_2_8EH1jU/fetch" --fetcher_cache_size="2GB"
--frameworks_home="" --gc_delay="1weeks" --gc_disk_headroom="0.1" --hadoop_home="" --help="false"
--hostname_lookup="true" --http_command_executor="false" --http_credentials="/tmp/Endpoint_SlaveEndpointTest_NoAuthorizer_2_8EH1jU/http_credentials"
--http_heartbeat_interval="30secs" --initialize_driver_logging="true" --isolation="posix/cpu,posix/mem"
--launcher="posix" --launcher_dir="/mesos/mesos-1.4.0/_build/src" --logbufsecs="0" --logging_level="INFO"
--max_completed_executors_per_framework="150" --oversubscribed_resources_interval="15secs"
--perf_duration="10secs" --perf_interval="1mins" --port="5051" --qos_correction_interval_min="0ns"
--quiet="false" --recover="reconnect" --recovery_timeout="15mins" --registration_backoff_factor="10ms"
--resources="cpus:2;gpus:0;mem:1024;disk:1024;ports:[31000-32000]" --revocable_cpu_low_priority="true"
--runtime_dir="/tmp/Endpoint_SlaveEndpointTest_NoAuthorizer_2_8EH1jU" --sandbox_directory="/mnt/mesos/sandbox"
--strict="true" --switch_user="true" --systemd_enable_support="true" --systemd_runtime_directory="/run/systemd/system"
--version="false" --work_dir="/tmp/Endpoint_SlaveEndpointTest_NoAuthorizer_2_uBH8NQ"
I0519 23:45:23.938529 30910 credentials.hpp:86] Loading credential for authentication from
'/tmp/Endpoint_SlaveEndpointTest_NoAuthorizer_2_8EH1jU/credential'
I0519 23:45:23.938755 30910 slave.cpp:258] Agent using credential for: test-principal
I0519 23:45:23.938779 30910 credentials.hpp:37] Loading credentials for authentication from
'/tmp/Endpoint_SlaveEndpointTest_NoAuthorizer_2_8EH1jU/http_credentials'
I0519 23:45:23.939002 30910 http.cpp:975] Creating default 'basic' HTTP authenticator for
realm 'mesos-agent-readonly'
I0519 23:45:23.939224 30910 http.cpp:975] Creating default 'basic' HTTP authenticator for
realm 'mesos-agent-readwrite'
I0519 23:45:23.940424 30910 slave.cpp:529] Agent resources: cpus(*):2; mem(*):1024; disk(*):1024;
ports(*):[31000-32000]
I0519 23:45:23.940498 30910 slave.cpp:537] Agent attributes: [  ]
I0519 23:45:23.940516 30910 slave.cpp:542] Agent hostname: 4f9de521e2ee
I0519 23:45:23.940647 30922 status_update_manager.cpp:177] Pausing sending status updates
I0519 23:45:23.942009 30906 state.cpp:62] Recovering state from '/tmp/Endpoint_SlaveEndpointTest_NoAuthorizer_2_uBH8NQ/meta'
I0519 23:45:23.942406 30916 status_update_manager.cpp:203] Recovering status update manager
I0519 23:45:23.942646 30927 containerizer.cpp:608] Recovering containerizer
I0519 23:45:23.944294 30912 provisioner.cpp:410] Provisioner recovery complete
I0519 23:45:23.944716 30909 slave.cpp:5974] Finished recovery
I0519 23:45:23.945236 30909 slave.cpp:6156] Querying resource estimator for oversubscribable
resources
I0519 23:45:23.945595 30918 slave.cpp:6170] Received oversubscribable resources {} from the
resource estimator
I0519 23:45:23.948330 30907 process.cpp:3730] Handling HTTP event for process 'slave(752)'
with path: '/slave(752)/containers'
I0519 23:45:23.949662 30906 http.cpp:1115] HTTP GET for /slave(752)/containers from 172.17.0.2:46294
I0519 23:45:23.949738 30906 http.cpp:936] Authorizing principal 'test-principal' to GET the
'/containers' endpoint
I0519 23:45:23.953495 30907 slave.cpp:794] Agent terminating
[       OK ] Endpoint/SlaveEndpointTest.NoAuthorizer/2 (29 ms)
[----------] 9 tests from Endpoint/SlaveEndpointTest (269 ms total)

[----------] Global test environment tear-down
[==========] 1575 tests from 175 test cases ran. (472652 ms total)
[  PASSED  ] 1574 tests.
[  FAILED  ] 1 test, listed below:
[  FAILED  ] ExamplesTest.DynamicReservationFramework

 1 FAILED TEST
  YOU HAVE 22 DISABLED TESTS

E0519 23:45:24.007180 30928 process.cpp:950] Failed to accept socket: future discarded
make[4]: *** [check-local] Error 1
make[4]: Leaving directory `/mesos/mesos-1.4.0/_build/src'
make[3]: *** [check-am] Error 2
make[3]: Leaving directory `/mesos/mesos-1.4.0/_build/src'
make[2]: *** [check] Error 2
make[2]: Leaving directory `/mesos/mesos-1.4.0/_build/src'
make[1]: *** [check-recursive] Error 1
make[1]: Leaving directory `/mesos/mesos-1.4.0/_build'
make: *** [distcheck] Error 1
+ docker rmi mesos-1495234871-28384
Untagged: mesos-1495234871-28384:latest
Deleted: sha256:e2ca6552d19cb9a2529d1564a7494e926dc0b7920009b3f0775c40feef0e2afa
Deleted: sha256:97510cff692dfd6ae1f1e30bab119f50905448eed4d95de8747e9df61a6e79aa
Deleted: sha256:c98a18631ddd336922cf67e4864c35d6c8f7925c4df893037e73c2d7fbdbe3e2
Deleted: sha256:f57c8f4f65550fcc0a96047206a93f3b045e3681ecf43d7be3e8fa643d27ecf2
Deleted: sha256:d8168ff62b91df191deb2f307c765179e38190ad7080df6d9045d683282c5b4c
Deleted: sha256:c3da1f13d43d9d0afc9a9982d6b939550320a92bdab0149608da045f19f638ed
Deleted: sha256:a2ace655535048f034f33b8bbd5058bbacee020facef01ddbd8a8b9f91d45e7d
Deleted: sha256:38afb2c4219ada86c53961967a429f36671db771531abc19211b292b159ed5dc
Deleted: sha256:60d542e728760e6177c7eac61110c01bf4e105a00db7bdbe05948f87c2e153aa
Deleted: sha256:461cce8d9321b31504f9e57fa280177416a2d6a3d8f0fbb84620fe7d0572ba22
Deleted: sha256:3de1c80ec6eade5f914877a01b4b8985d07d4d31f505d8d4a1d1fcac1adf3acc
Deleted: sha256:d77e411e75dfd65500ed7b5148133be7936090788069940a888c74a21a09e183
Deleted: sha256:d9c52e9df2bc2b3974fdfbd117678f6410f1152cda85a48a7d3667ed69b61c52
Deleted: sha256:4ea088da4a47a1a5ce453db09804dbfa6918544e2fa8444d137ccb8a29adb829
Deleted: sha256:8719c7088801fd58be302df99bf3c1ae61fe4c6b1ff17161e678f3b327fc0a01
Deleted: sha256:36a19161cd747d2abec4c996aed235f0ba9be7bcf8f9dd9dd8caf16e4b358a71
Deleted: sha256:61aa5e705a6db350431acdd6a4064ed61da36d499c85590363fe64c359573da3
Deleted: sha256:91b7d40a3862cc5c7c9a96423f96564f1cf24fa1ea8c74bebaa252ad9162def7
Deleted: sha256:72327f6d13d4cbfc53f8163312dc1bb2481d879679de57706fa1041519628f42
Deleted: sha256:dcf1b841c6fd69bcd8ef36227ecfb9d98bbbdfdaf61d99d7bd479d22cd078262
Deleted: sha256:f0b4757182cb5c26404aa4068ae039ec739076805d1bef66c8bc668509986176
Deleted: sha256:19db42badca7ce80e31fca295acaf63c8732afdc031eebe9f986575b1f84e6e2
Deleted: sha256:e28354d47cbe0dd81db65ba12525bb99111292f21f3abe8c1c9830b9eb0cc584
Deleted: sha256:17220f239c718a4aedbe7e7de04ba1586964f45033b3bc2fd2e1ea87c3de7d77
Build step 'Execute shell' marked build as failure

Mime
View raw message