mesos-builds mailing list archives

Site index · List index
Message view « Date » · « Thread »
Top « Date » · « Thread »
From Apache Jenkins Server <jenk...@builds.apache.org>
Subject Build failed in Jenkins: Mesos-Buildbot » cmake,gcc,--verbose --enable-libevent --enable-ssl,GLOG_v=1 MESOS_VERBOSE=1,centos:7,(docker||Hadoop)&&(!ubuntu-us1)&&(!ubuntu-eu2) #3690
Date Wed, 17 May 2017 23:25:44 GMT
See <https://builds.apache.org/job/Mesos-Buildbot/BUILDTOOL=cmake,COMPILER=gcc,CONFIGURATION=--verbose%20--enable-libevent%20--enable-ssl,ENVIRONMENT=GLOG_v=1%20MESOS_VERBOSE=1,OS=centos%3A7,label_exp=(docker%7C%7CHadoop)&&(!ubuntu-us1)&&(!ubuntu-eu2)/3690/display/redirect?page=changes>

Changes:

[neil.conway] Copy-edited versioning doc.

------------------------------------------
[...truncated 26.41 MB...]
I0517 23:25:38.932111 32195 slave.cpp:6170] Received oversubscribable resources {} from the
resource estimator
I0517 23:25:38.932940 32200 process.cpp:3730] Handling HTTP event for process 'slave(746)'
with path: '/slave(746)/containers'
I0517 23:25:38.933557 32185 http.cpp:1115] HTTP GET for /slave(746)/containers from 172.17.0.3:59537
I0517 23:25:38.933658 32185 http.cpp:936] Authorizing principal 'test-principal' to GET the
'/containers' endpoint
I0517 23:25:38.935446 26711 slave.cpp:794] Agent terminating
[       OK ] Endpoint/SlaveEndpointTest.AuthorizedRequest/2 (13 ms)
[ RUN      ] Endpoint/SlaveEndpointTest.UnauthorizedRequest/0
I0517 23:25:38.940960 26711 containerizer.cpp:221] Using isolation: posix/cpu,posix/mem,filesystem/posix,network/cni
W0517 23:25:38.941328 26711 backend.cpp:76] Failed to create 'aufs' backend: AufsBackend requires
root privileges
W0517 23:25:38.941378 26711 backend.cpp:76] Failed to create 'bind' backend: BindBackend requires
root privileges
I0517 23:25:38.941402 26711 provisioner.cpp:249] Using default backend 'copy'
I0517 23:25:38.942709 32194 slave.cpp:225] Mesos agent started on (747)@172.17.0.3:56895
I0517 23:25:38.942729 32194 slave.cpp:226] Flags at startup: --acls="" --appc_simple_discovery_uri_prefix="http://"
--appc_store_dir="/tmp/mesos/store/appc" --authenticate_http_executors="true" --authenticate_http_readonly="true"
--authenticate_http_readwrite="true" --authenticatee="crammd5" --authentication_backoff_factor="1secs"
--authorizer="local" --cgroups_cpu_enable_pids_and_tids_count="false" --cgroups_enable_cfs="false"
--cgroups_hierarchy="/sys/fs/cgroup" --cgroups_limit_swap="false" --cgroups_root="mesos" --container_disk_watch_interval="15secs"
--containerizers="mesos" --credential="/tmp/Endpoint_SlaveEndpointTest_UnauthorizedRequest_0_BfgnpN/credential"
--default_role="*" --disk_watch_interval="1mins" --docker="docker" --docker_kill_orphans="true"
--docker_registry="https://registry-1.docker.io" --docker_remove_delay="6hrs" --docker_socket="/var/run/docker.sock"
--docker_stop_timeout="0ns" --docker_store_dir="/tmp/mesos/store/docker" --docker_volume_checkpoint_dir="/var/run/mesos/isolators/docker/volume"
--enforce_container_disk_quota="false" --executor_registration_timeout="1mins" --executor_secret_key="/tmp/Endpoint_SlaveEndpointTest_UnauthorizedRequest_0_BfgnpN/executor_secret_key"
--executor_shutdown_grace_period="5secs" --fetcher_cache_dir="/tmp/Endpoint_SlaveEndpointTest_UnauthorizedRequest_0_BfgnpN/fetch"
--fetcher_cache_size="2GB" --frameworks_home="" --gc_delay="1weeks" --gc_disk_headroom="0.1"
--hadoop_home="" --help="false" --hostname_lookup="true" --http_command_executor="false" --http_credentials="/tmp/Endpoint_SlaveEndpointTest_UnauthorizedRequest_0_BfgnpN/http_credentials"
--http_heartbeat_interval="30secs" --initialize_driver_logging="true" --isolation="posix/cpu,posix/mem"
--launcher="posix" --launcher_dir="/mesos/build/src" --logbufsecs="0" --logging_level="INFO"
--max_completed_executors_per_framework="150" --oversubscribed_resources_interval="15secs"
--perf_duration="10secs" --perf_interval="1mins" --port="5051" --qos_correction_interval_min="0ns"
--quiet="false" --recover="reconnect" --recovery_timeout="15mins" --registration_backoff_factor="10ms"
--resources="cpus:2;gpus:0;mem:1024;disk:1024;ports:[31000-32000]" --revocable_cpu_low_priority="true"
--runtime_dir="/tmp/Endpoint_SlaveEndpointTest_UnauthorizedRequest_0_BfgnpN" --sandbox_directory="/mnt/mesos/sandbox"
--strict="true" --switch_user="true" --systemd_enable_support="true" --systemd_runtime_directory="/run/systemd/system"
--version="false" --work_dir="/tmp/Endpoint_SlaveEndpointTest_UnauthorizedRequest_0_Ln80pS"
I0517 23:25:38.942960 32194 credentials.hpp:86] Loading credential for authentication from
'/tmp/Endpoint_SlaveEndpointTest_UnauthorizedRequest_0_BfgnpN/credential'
I0517 23:25:38.943068 32194 slave.cpp:258] Agent using credential for: test-principal
I0517 23:25:38.943081 32194 credentials.hpp:37] Loading credentials for authentication from
'/tmp/Endpoint_SlaveEndpointTest_UnauthorizedRequest_0_BfgnpN/http_credentials'
I0517 23:25:38.943214 32194 http.cpp:975] Creating default 'basic' HTTP authenticator for
realm 'mesos-agent-executor'
I0517 23:25:38.943259 32194 http.cpp:996] Creating default 'jwt' HTTP authenticator for realm
'mesos-agent-executor'
I0517 23:25:38.943338 32194 http.cpp:975] Creating default 'basic' HTTP authenticator for
realm 'mesos-agent-readonly'
I0517 23:25:38.943377 32194 http.cpp:996] Creating default 'jwt' HTTP authenticator for realm
'mesos-agent-readonly'
I0517 23:25:38.943471 32194 http.cpp:975] Creating default 'basic' HTTP authenticator for
realm 'mesos-agent-readwrite'
I0517 23:25:38.943527 32194 http.cpp:996] Creating default 'jwt' HTTP authenticator for realm
'mesos-agent-readwrite'
I0517 23:25:38.943923 32194 slave.cpp:529] Agent resources: cpus(*):2; mem(*):1024; disk(*):1024;
ports(*):[31000-32000]
I0517 23:25:38.943953 32194 slave.cpp:537] Agent attributes: [  ]
I0517 23:25:38.943958 32194 slave.cpp:542] Agent hostname: cadb80e8ee89
I0517 23:25:38.944026 32199 status_update_manager.cpp:177] Pausing sending status updates
I0517 23:25:38.944458 32185 state.cpp:62] Recovering state from '/tmp/Endpoint_SlaveEndpointTest_UnauthorizedRequest_0_Ln80pS/meta'
I0517 23:25:38.944676 32193 status_update_manager.cpp:203] Recovering status update manager
I0517 23:25:38.944754 32193 containerizer.cpp:608] Recovering containerizer
I0517 23:25:38.945348 32188 provisioner.cpp:410] Provisioner recovery complete
I0517 23:25:38.945672 32186 slave.cpp:5974] Finished recovery
I0517 23:25:38.946074 32186 slave.cpp:6156] Querying resource estimator for oversubscribable
resources
I0517 23:25:38.946177 32185 slave.cpp:6170] Received oversubscribable resources {} from the
resource estimator
I0517 23:25:38.946964 32196 process.cpp:3730] Handling HTTP event for process 'slave(747)'
with path: '/slave(747)/monitor/statistics'
I0517 23:25:38.947510 32186 http.cpp:1115] HTTP GET for /slave(747)/monitor/statistics from
172.17.0.3:59538
I0517 23:25:38.947542 32186 http.cpp:936] Authorizing principal 'test-principal' to GET the
'/monitor/statistics' endpoint
I0517 23:25:38.957857 32197 slave.cpp:794] Agent terminating
[       OK ] Endpoint/SlaveEndpointTest.UnauthorizedRequest/0 (30 ms)
[ RUN      ] Endpoint/SlaveEndpointTest.UnauthorizedRequest/1
I0517 23:25:38.970232 26711 containerizer.cpp:221] Using isolation: posix/cpu,posix/mem,filesystem/posix,network/cni
W0517 23:25:38.970541 26711 backend.cpp:76] Failed to create 'aufs' backend: AufsBackend requires
root privileges
W0517 23:25:38.970577 26711 backend.cpp:76] Failed to create 'bind' backend: BindBackend requires
root privileges
I0517 23:25:38.970597 26711 provisioner.cpp:249] Using default backend 'copy'
I0517 23:25:38.971551 32187 slave.cpp:225] Mesos agent started on (748)@172.17.0.3:56895
I0517 23:25:38.971576 32187 slave.cpp:226] Flags at startup: --acls="" --appc_simple_discovery_uri_prefix="http://"
--appc_store_dir="/tmp/mesos/store/appc" --authenticate_http_executors="true" --authenticate_http_readonly="true"
--authenticate_http_readwrite="true" --authenticatee="crammd5" --authentication_backoff_factor="1secs"
--authorizer="local" --cgroups_cpu_enable_pids_and_tids_count="false" --cgroups_enable_cfs="false"
--cgroups_hierarchy="/sys/fs/cgroup" --cgroups_limit_swap="false" --cgroups_root="mesos" --container_disk_watch_interval="15secs"
--containerizers="mesos" --credential="/tmp/Endpoint_SlaveEndpointTest_UnauthorizedRequest_1_h7gdCt/credential"
--default_role="*" --disk_watch_interval="1mins" --docker="docker" --docker_kill_orphans="true"
--docker_registry="https://registry-1.docker.io" --docker_remove_delay="6hrs" --docker_socket="/var/run/docker.sock"
--docker_stop_timeout="0ns" --docker_store_dir="/tmp/mesos/store/docker" --docker_volume_checkpoint_dir="/var/run/mesos/isolators/docker/volume"
--enforce_container_disk_quota="false" --executor_registration_timeout="1mins" --executor_secret_key="/tmp/Endpoint_SlaveEndpointTest_UnauthorizedRequest_1_h7gdCt/executor_secret_key"
--executor_shutdown_grace_period="5secs" --fetcher_cache_dir="/tmp/Endpoint_SlaveEndpointTest_UnauthorizedRequest_1_h7gdCt/fetch"
--fetcher_cache_size="2GB" --frameworks_home="" --gc_delay="1weeks" --gc_disk_headroom="0.1"
--hadoop_home="" --help="false" --hostname_lookup="true" --http_command_executor="false" --http_credentials="/tmp/Endpoint_SlaveEndpointTest_UnauthorizedRequest_1_h7gdCt/http_credentials"
--http_heartbeat_interval="30secs" --initialize_driver_logging="true" --isolation="posix/cpu,posix/mem"
--launcher="posix" --launcher_dir="/mesos/build/src" --logbufsecs="0" --logging_level="INFO"
--max_completed_executors_per_framework="150" --oversubscribed_resources_interval="15secs"
--perf_duration="10secs" --perf_interval="1mins" --port="5051" --qos_correction_interval_min="0ns"
--quiet="false" --recover="reconnect" --recovery_timeout="15mins" --registration_backoff_factor="10ms"
--resources="cpus:2;gpus:0;mem:1024;disk:1024;ports:[31000-32000]" --revocable_cpu_low_priority="true"
--runtime_dir="/tmp/Endpoint_SlaveEndpointTest_UnauthorizedRequest_1_h7gdCt" --sandbox_directory="/mnt/mesos/sandbox"
--strict="true" --switch_user="true" --systemd_enable_support="true" --systemd_runtime_directory="/run/systemd/system"
--version="false" --work_dir="/tmp/Endpoint_SlaveEndpointTest_UnauthorizedRequest_1_DjB1xy"
I0517 23:25:38.971850 32187 credentials.hpp:86] Loading credential for authentication from
'/tmp/Endpoint_SlaveEndpointTest_UnauthorizedRequest_1_h7gdCt/credential'
I0517 23:25:38.971968 32187 slave.cpp:258] Agent using credential for: test-principal
I0517 23:25:38.971978 32187 credentials.hpp:37] Loading credentials for authentication from
'/tmp/Endpoint_SlaveEndpointTest_UnauthorizedRequest_1_h7gdCt/http_credentials'
I0517 23:25:38.972106 32187 http.cpp:975] Creating default 'basic' HTTP authenticator for
realm 'mesos-agent-executor'
I0517 23:25:38.972146 32187 http.cpp:996] Creating default 'jwt' HTTP authenticator for realm
'mesos-agent-executor'
I0517 23:25:38.972223 32187 http.cpp:975] Creating default 'basic' HTTP authenticator for
realm 'mesos-agent-readonly'
I0517 23:25:38.972249 32187 http.cpp:996] Creating default 'jwt' HTTP authenticator for realm
'mesos-agent-readonly'
I0517 23:25:38.972378 32187 http.cpp:975] Creating default 'basic' HTTP authenticator for
realm 'mesos-agent-readwrite'
I0517 23:25:38.972412 32187 http.cpp:996] Creating default 'jwt' HTTP authenticator for realm
'mesos-agent-readwrite'
I0517 23:25:38.972873 32187 slave.cpp:529] Agent resources: cpus(*):2; mem(*):1024; disk(*):1024;
ports(*):[31000-32000]
I0517 23:25:38.972903 32187 slave.cpp:537] Agent attributes: [  ]
I0517 23:25:38.972908 32187 slave.cpp:542] Agent hostname: cadb80e8ee89
I0517 23:25:38.972971 32185 status_update_manager.cpp:177] Pausing sending status updates
I0517 23:25:38.973361 32194 state.cpp:62] Recovering state from '/tmp/Endpoint_SlaveEndpointTest_UnauthorizedRequest_1_DjB1xy/meta'
I0517 23:25:38.973518 32199 status_update_manager.cpp:203] Recovering status update manager
I0517 23:25:38.973664 32185 containerizer.cpp:608] Recovering containerizer
I0517 23:25:38.974179 32197 provisioner.cpp:410] Provisioner recovery complete
I0517 23:25:38.974349 32187 slave.cpp:5974] Finished recovery
I0517 23:25:38.974732 32187 slave.cpp:6156] Querying resource estimator for oversubscribable
resources
I0517 23:25:38.974891 32200 slave.cpp:6170] Received oversubscribable resources {} from the
resource estimator
I0517 23:25:38.975811 32199 process.cpp:3730] Handling HTTP event for process 'slave(748)'
with path: '/slave(748)/monitor/statistics.json'
I0517 23:25:38.976614 32189 http.cpp:1115] HTTP GET for /slave(748)/monitor/statistics.json
from 172.17.0.3:59542
I0517 23:25:38.976656 32189 http.cpp:936] Authorizing principal 'test-principal' to GET the
'/monitor/statistics.json' endpoint
I0517 23:25:38.977890 32187 slave.cpp:794] Agent terminating
[       OK ] Endpoint/SlaveEndpointTest.UnauthorizedRequest/1 (13 ms)
[ RUN      ] Endpoint/SlaveEndpointTest.UnauthorizedRequest/2
I0517 23:25:38.982755 26711 containerizer.cpp:221] Using isolation: posix/cpu,posix/mem,filesystem/posix,network/cni
W0517 23:25:38.983048 26711 backend.cpp:76] Failed to create 'aufs' backend: AufsBackend requires
root privileges
W0517 23:25:38.983093 26711 backend.cpp:76] Failed to create 'bind' backend: BindBackend requires
root privileges
I0517 23:25:38.983115 26711 provisioner.cpp:249] Using default backend 'copy'
I0517 23:25:38.983938 32197 slave.cpp:225] Mesos agent started on (749)@172.17.0.3:56895
I0517 23:25:38.983958 32197 slave.cpp:226] Flags at startup: --acls="" --appc_simple_discovery_uri_prefix="http://"
--appc_store_dir="/tmp/mesos/store/appc" --authenticate_http_executors="true" --authenticate_http_readonly="true"
--authenticate_http_readwrite="true" --authenticatee="crammd5" --authentication_backoff_factor="1secs"
--authorizer="local" --cgroups_cpu_enable_pids_and_tids_count="false" --cgroups_enable_cfs="false"
--cgroups_hierarchy="/sys/fs/cgroup" --cgroups_limit_swap="false" --cgroups_root="mesos" --container_disk_watch_interval="15secs"
--containerizers="mesos" --credential="/tmp/Endpoint_SlaveEndpointTest_UnauthorizedRequest_2_e9wTZ9/credential"
--default_role="*" --disk_watch_interval="1mins" --docker="docker" --docker_kill_orphans="true"
--docker_registry="https://registry-1.docker.io" --docker_remove_delay="6hrs" --docker_socket="/var/run/docker.sock"
--docker_stop_timeout="0ns" --docker_store_dir="/tmp/mesos/store/docker" --docker_volume_checkpoint_dir="/var/run/mesos/isolators/docker/volume"
--enforce_container_disk_quota="false" --executor_registration_timeout="1mins" --executor_secret_key="/tmp/Endpoint_SlaveEndpointTest_UnauthorizedRequest_2_e9wTZ9/executor_secret_key"
--executor_shutdown_grace_period="5secs" --fetcher_cache_dir="/tmp/Endpoint_SlaveEndpointTest_UnauthorizedRequest_2_e9wTZ9/fetch"
--fetcher_cache_size="2GB" --frameworks_home="" --gc_delay="1weeks" --gc_disk_headroom="0.1"
--hadoop_home="" --help="false" --hostname_lookup="true" --http_command_executor="false" --http_credentials="/tmp/Endpoint_SlaveEndpointTest_UnauthorizedRequest_2_e9wTZ9/http_credentials"
--http_heartbeat_interval="30secs" --initialize_driver_logging="true" --isolation="posix/cpu,posix/mem"
--launcher="posix" --launcher_dir="/mesos/build/src" --logbufsecs="0" --logging_level="INFO"
--max_completed_executors_per_framework="150" --oversubscribed_resources_interval="15secs"
--perf_duration="10secs" --perf_interval="1mins" --port="5051" --qos_correction_interval_min="0ns"
--quiet="false" --recover="reconnect" --recovery_timeout="15mins" --registration_backoff_factor="10ms"
--resources="cpus:2;gpus:0;mem:1024;disk:1024;ports:[31000-32000]" --revocable_cpu_low_priority="true"
--runtime_dir="/tmp/Endpoint_SlaveEndpointTest_UnauthorizedRequest_2_e9wTZ9" --sandbox_directory="/mnt/mesos/sandbox"
--strict="true" --switch_user="true" --systemd_enable_support="true" --systemd_runtime_directory="/run/systemd/system"
--version="false" --work_dir="/tmp/Endpoint_SlaveEndpointTest_UnauthorizedRequest_2_gzdETe"
I0517 23:25:38.984249 32197 credentials.hpp:86] Loading credential for authentication from
'/tmp/Endpoint_SlaveEndpointTest_UnauthorizedRequest_2_e9wTZ9/credential'
I0517 23:25:38.984381 32197 slave.cpp:258] Agent using credential for: test-principal
I0517 23:25:38.984393 32197 credentials.hpp:37] Loading credentials for authentication from
'/tmp/Endpoint_SlaveEndpointTest_UnauthorizedRequest_2_e9wTZ9/http_credentials'
I0517 23:25:38.984534 32197 http.cpp:975] Creating default 'basic' HTTP authenticator for
realm 'mesos-agent-executor'
I0517 23:25:38.984578 32197 http.cpp:996] Creating default 'jwt' HTTP authenticator for realm
'mesos-agent-executor'
I0517 23:25:38.984689 32197 http.cpp:975] Creating default 'basic' HTTP authenticator for
realm 'mesos-agent-readonly'
I0517 23:25:38.984733 32197 http.cpp:996] Creating default 'jwt' HTTP authenticator for realm
'mesos-agent-readonly'
I0517 23:25:38.984833 32197 http.cpp:975] Creating default 'basic' HTTP authenticator for
realm 'mesos-agent-readwrite'
I0517 23:25:38.984866 32197 http.cpp:996] Creating default 'jwt' HTTP authenticator for realm
'mesos-agent-readwrite'
I0517 23:25:38.985323 32197 slave.cpp:529] Agent resources: cpus(*):2; mem(*):1024; disk(*):1024;
ports(*):[31000-32000]
I0517 23:25:38.985353 32197 slave.cpp:537] Agent attributes: [  ]
I0517 23:25:38.985358 32197 slave.cpp:542] Agent hostname: cadb80e8ee89
I0517 23:25:38.985412 32200 status_update_manager.cpp:177] Pausing sending status updates
I0517 23:25:38.985903 32189 state.cpp:62] Recovering state from '/tmp/Endpoint_SlaveEndpointTest_UnauthorizedRequest_2_gzdETe/meta'
I0517 23:25:38.986088 32185 status_update_manager.cpp:203] Recovering status update manager
I0517 23:25:38.986271 32200 containerizer.cpp:608] Recovering containerizer
I0517 23:25:38.986819 32193 provisioner.cpp:410] Provisioner recovery complete
I0517 23:25:38.987011 32191 slave.cpp:5974] Finished recovery
I0517 23:25:38.987375 32191 slave.cpp:6156] Querying resource estimator for oversubscribable
resources
I0517 23:25:38.987529 32195 slave.cpp:6170] Received oversubscribable resources {} from the
resource estimator
I0517 23:25:38.988219 32190 process.cpp:3730] Handling HTTP event for process 'slave(749)'
with path: '/slave(749)/containers'
I0517 23:25:38.988807 32186 http.cpp:1115] HTTP GET for /slave(749)/containers from 172.17.0.3:59543
I0517 23:25:38.988867 32186 http.cpp:936] Authorizing principal 'test-principal' to GET the
'/containers' endpoint
I0517 23:25:38.990021 26711 slave.cpp:794] Agent terminating
[       OK ] Endpoint/SlaveEndpointTest.UnauthorizedRequest/2 (11 ms)
[ RUN      ] Endpoint/SlaveEndpointTest.NoAuthorizer/0
I0517 23:25:38.994037 26711 containerizer.cpp:221] Using isolation: posix/cpu,posix/mem,filesystem/posix,network/cni
W0517 23:25:38.994346 26711 backend.cpp:76] Failed to create 'aufs' backend: AufsBackend requires
root privileges
W0517 23:25:38.994397 26711 backend.cpp:76] Failed to create 'bind' backend: BindBackend requires
root privileges
I0517 23:25:38.994421 26711 provisioner.cpp:249] Using default backend 'copy'
I0517 23:25:38.994935 26711 cluster.cpp:448] Creating default 'local' authorizer
I0517 23:25:38.995507 32190 slave.cpp:225] Mesos agent started on (750)@172.17.0.3:56895
I0517 23:25:38.995674 32190 slave.cpp:226] Flags at startup: --acls="" --appc_simple_discovery_uri_prefix="http://"
--appc_store_dir="/tmp/mesos/store/appc" --authenticate_http_executors="true" --authenticate_http_readonly="true"
--authenticate_http_readwrite="true" --authenticatee="crammd5" --authentication_backoff_factor="1secs"
--authorizer="local" --cgroups_cpu_enable_pids_and_tids_count="false" --cgroups_enable_cfs="false"
--cgroups_hierarchy="/sys/fs/cgroup" --cgroups_limit_swap="false" --cgroups_root="mesos" --container_disk_watch_interval="15secs"
--containerizers="mesos" --credential="/tmp/Endpoint_SlaveEndpointTest_NoAuthorizer_0_tpS8uQ/credential"
--default_role="*" --disk_watch_interval="1mins" --docker="docker" --docker_kill_orphans="true"
--docker_registry="https://registry-1.docker.io" --docker_remove_delay="6hrs" --docker_socket="/var/run/docker.sock"
--docker_stop_timeout="0ns" --docker_store_dir="/tmp/mesos/store/docker" --docker_volume_checkpoint_dir="/var/run/mesos/isolators/docker/volume"
--enforce_container_disk_quota="false" --executor_registration_timeout="1mins" --executor_secret_key="/tmp/Endpoint_SlaveEndpointTest_NoAuthorizer_0_tpS8uQ/executor_secret_key"
--executor_shutdown_grace_period="5secs" --fetcher_cache_dir="/tmp/Endpoint_SlaveEndpointTest_NoAuthorizer_0_tpS8uQ/fetch"
--fetcher_cache_size="2GB" --frameworks_home="" --gc_delay="1weeks" --gc_disk_headroom="0.1"
--hadoop_home="" --help="false" --hostname_lookup="true" --http_command_executor="false" --http_credentials="/tmp/Endpoint_SlaveEndpointTest_NoAuthorizer_0_tpS8uQ/http_credentials"
--http_heartbeat_interval="30secs" --initialize_driver_logging="true" --isolation="posix/cpu,posix/mem"
--launcher="posix" --launcher_dir="/mesos/build/src" --logbufsecs="0" --logging_level="INFO"
--max_completed_executors_per_framework="150" --oversubscribed_resources_interval="15secs"
--perf_duration="10secs" --perf_interval="1mins" --port="5051" --qos_correction_interval_min="0ns"
--quiet="false" --recover="reconnect" --recovery_timeout="15mins" --registration_backoff_factor="10ms"
--resources="cpus:2;gpus:0;mem:1024;disk:1024;ports:[31000-32000]" --revocable_cpu_low_priority="true"
--runtime_dir="/tmp/Endpoint_SlaveEndpointTest_NoAuthorizer_0_tpS8uQ" --sandbox_directory="/mnt/mesos/sandbox"
--strict="true" --switch_user="true" --systemd_enable_support="true" --systemd_runtime_directory="/run/systemd/system"
--version="false" --work_dir="/tmp/Endpoint_SlaveEndpointTest_NoAuthorizer_0_hF23mV"
I0517 23:25:38.996121 32190 credentials.hpp:86] Loading credential for authentication from
'/tmp/Endpoint_SlaveEndpointTest_NoAuthorizer_0_tpS8uQ/credential'
I0517 23:25:38.996230 32190 slave.cpp:258] Agent using credential for: test-principal
I0517 23:25:38.996249 32190 credentials.hpp:37] Loading credentials for authentication from
'/tmp/Endpoint_SlaveEndpointTest_NoAuthorizer_0_tpS8uQ/http_credentials'
I0517 23:25:38.996448 32190 http.cpp:975] Creating default 'basic' HTTP authenticator for
realm 'mesos-agent-executor'
I0517 23:25:38.996556 32190 http.cpp:996] Creating default 'jwt' HTTP authenticator for realm
'mesos-agent-executor'
I0517 23:25:38.996665 32190 http.cpp:975] Creating default 'basic' HTTP authenticator for
realm 'mesos-agent-readonly'
I0517 23:25:38.996698 32190 http.cpp:996] Creating default 'jwt' HTTP authenticator for realm
'mesos-agent-readonly'
I0517 23:25:38.996767 32190 http.cpp:975] Creating default 'basic' HTTP authenticator for
realm 'mesos-agent-readwrite'
I0517 23:25:38.996943 32190 http.cpp:996] Creating default 'jwt' HTTP authenticator for realm
'mesos-agent-readwrite'
I0517 23:25:38.997542 32190 slave.cpp:529] Agent resources: cpus(*):2; mem(*):1024; disk(*):1024;
ports(*):[31000-32000]
I0517 23:25:38.997589 32190 slave.cpp:537] Agent attributes: [  ]
I0517 23:25:38.997601 32190 slave.cpp:542] Agent hostname: cadb80e8ee89
I0517 23:25:38.998097 32190 status_update_manager.cpp:177] Pausing sending status updates
I0517 23:25:38.998433 32190 state.cpp:62] Recovering state from '/tmp/Endpoint_SlaveEndpointTest_NoAuthorizer_0_hF23mV/meta'
I0517 23:25:38.998595 32190 status_update_manager.cpp:203] Recovering status update manager
I0517 23:25:38.998667 32190 containerizer.cpp:608] Recovering containerizer
I0517 23:25:38.999238 32190 provisioner.cpp:410] Provisioner recovery complete
I0517 23:25:38.999405 32190 slave.cpp:5974] Finished recovery
I0517 23:25:38.999822 32190 slave.cpp:6156] Querying resource estimator for oversubscribable
resources
I0517 23:25:39.000000 32190 slave.cpp:6170] Received oversubscribable resources {} from the
resource estimator
I0517 23:25:39.000793 32191 process.cpp:3730] Handling HTTP event for process 'slave(750)'
with path: '/slave(750)/monitor/statistics'
I0517 23:25:39.001343 32191 http.cpp:1115] HTTP GET for /slave(750)/monitor/statistics from
172.17.0.3:59544
I0517 23:25:39.001387 32191 http.cpp:936] Authorizing principal 'test-principal' to GET the
'/monitor/statistics' endpoint
I0517 23:25:39.002775 26711 slave.cpp:794] Agent terminating
[       OK ] Endpoint/SlaveEndpointTest.NoAuthorizer/0 (13 ms)
[ RUN      ] Endpoint/SlaveEndpointTest.NoAuthorizer/1
I0517 23:25:39.008576 26711 containerizer.cpp:221] Using isolation: posix/cpu,posix/mem,filesystem/posix,network/cni
W0517 23:25:39.008935 26711 backend.cpp:76] Failed to create 'aufs' backend: AufsBackend requires
root privileges
W0517 23:25:39.008985 26711 backend.cpp:76] Failed to create 'bind' backend: BindBackend requires
root privileges
I0517 23:25:39.009006 26711 provisioner.cpp:249] Using default backend 'copy'
I0517 23:25:39.009851 26711 cluster.cpp:448] Creating default 'local' authorizer
I0517 23:25:39.010581 32189 slave.cpp:225] Mesos agent started on (751)@172.17.0.3:56895
I0517 23:25:39.010615 32189 slave.cpp:226] Flags at startup: --acls="" --appc_simple_discovery_uri_prefix="http://"
--appc_store_dir="/tmp/mesos/store/appc" --authenticate_http_executors="true" --authenticate_http_readonly="true"
--authenticate_http_readwrite="true" --authenticatee="crammd5" --authentication_backoff_factor="1secs"
--authorizer="local" --cgroups_cpu_enable_pids_and_tids_count="false" --cgroups_enable_cfs="false"
--cgroups_hierarchy="/sys/fs/cgroup" --cgroups_limit_swap="false" --cgroups_root="mesos" --container_disk_watch_interval="15secs"
--containerizers="mesos" --credential="/tmp/Endpoint_SlaveEndpointTest_NoAuthorizer_1_xug48w/credential"
--default_role="*" --disk_watch_interval="1mins" --docker="docker" --docker_kill_orphans="true"
--docker_registry="https://registry-1.docker.io" --docker_remove_delay="6hrs" --docker_socket="/var/run/docker.sock"
--docker_stop_timeout="0ns" --docker_store_dir="/tmp/mesos/store/docker" --docker_volume_checkpoint_dir="/var/run/mesos/isolators/docker/volume"
--enforce_container_disk_quota="false" --executor_registration_timeout="1mins" --executor_secret_key="/tmp/Endpoint_SlaveEndpointTest_NoAuthorizer_1_xug48w/executor_secret_key"
--executor_shutdown_grace_period="5secs" --fetcher_cache_dir="/tmp/Endpoint_SlaveEndpointTest_NoAuthorizer_1_xug48w/fetch"
--fetcher_cache_size="2GB" --frameworks_home="" --gc_delay="1weeks" --gc_disk_headroom="0.1"
--hadoop_home="" --help="false" --hostname_lookup="true" --http_command_executor="false" --http_credentials="/tmp/Endpoint_SlaveEndpointTest_NoAuthorizer_1_xug48w/http_credentials"
--http_heartbeat_interval="30secs" --initialize_driver_logging="true" --isolation="posix/cpu,posix/mem"
--launcher="posix" --launcher_dir="/mesos/build/src" --logbufsecs="0" --logging_level="INFO"
--max_completed_executors_per_framework="150" --oversubscribed_resources_interval="15secs"
--perf_duration="10secs" --perf_interval="1mins" --port="5051" --qos_correction_interval_min="0ns"
--quiet="false" --recover="reconnect" --recovery_timeout="15mins" --registration_backoff_factor="10ms"
--resources="cpus:2;gpus:0;mem:1024;disk:1024;ports:[31000-32000]" --revocable_cpu_low_priority="true"
--runtime_dir="/tmp/Endpoint_SlaveEndpointTest_NoAuthorizer_1_xug48w" --sandbox_directory="/mnt/mesos/sandbox"
--strict="true" --switch_user="true" --systemd_enable_support="true" --systemd_runtime_directory="/run/systemd/system"
--version="false" --work_dir="/tmp/Endpoint_SlaveEndpointTest_NoAuthorizer_1_4K8JYB"
I0517 23:25:39.010923 32189 credentials.hpp:86] Loading credential for authentication from
'/tmp/Endpoint_SlaveEndpointTest_NoAuthorizer_1_xug48w/credential'
I0517 23:25:39.011085 32189 slave.cpp:258] Agent using credential for: test-principal
I0517 23:25:39.011101 32189 credentials.hpp:37] Loading credentials for authentication from
'/tmp/Endpoint_SlaveEndpointTest_NoAuthorizer_1_xug48w/http_credentials'
I0517 23:25:39.011291 32189 http.cpp:975] Creating default 'basic' HTTP authenticator for
realm 'mesos-agent-executor'
I0517 23:25:39.011333 32189 http.cpp:996] Creating default 'jwt' HTTP authenticator for realm
'mesos-agent-executor'
I0517 23:25:39.011397 32189 http.cpp:975] Creating default 'basic' HTTP authenticator for
realm 'mesos-agent-readonly'
I0517 23:25:39.011430 32189 http.cpp:996] Creating default 'jwt' HTTP authenticator for realm
'mesos-agent-readonly'
I0517 23:25:39.011565 32189 http.cpp:975] Creating default 'basic' HTTP authenticator for
realm 'mesos-agent-readwrite'
I0517 23:25:39.011685 32189 http.cpp:996] Creating default 'jwt' HTTP authenticator for realm
'mesos-agent-readwrite'
I0517 23:25:39.012189 32189 slave.cpp:529] Agent resources: cpus(*):2; mem(*):1024; disk(*):1024;
ports(*):[31000-32000]
I0517 23:25:39.012221 32189 slave.cpp:537] Agent attributes: [  ]
I0517 23:25:39.012229 32189 slave.cpp:542] Agent hostname: cadb80e8ee89
I0517 23:25:39.012596 32189 status_update_manager.cpp:177] Pausing sending status updates
I0517 23:25:39.012871 32189 state.cpp:62] Recovering state from '/tmp/Endpoint_SlaveEndpointTest_NoAuthorizer_1_4K8JYB/meta'
I0517 23:25:39.013016 32189 status_update_manager.cpp:203] Recovering status update manager
I0517 23:25:39.013072 32189 containerizer.cpp:608] Recovering containerizer
I0517 23:25:39.013454 32189 provisioner.cpp:410] Provisioner recovery complete
I0517 23:25:39.013577 32189 slave.cpp:5974] Finished recovery
I0517 23:25:39.013953 32189 slave.cpp:6156] Querying resource estimator for oversubscribable
resources
I0517 23:25:39.014271 32197 slave.cpp:6170] Received oversubscribable resources {} from the
resource estimator
I0517 23:25:39.015025 32199 process.cpp:3730] Handling HTTP event for process 'slave(751)'
with path: '/slave(751)/monitor/statistics.json'
I0517 23:25:39.015550 32194 http.cpp:1115] HTTP GET for /slave(751)/monitor/statistics.json
from 172.17.0.3:59545
I0517 23:25:39.015588 32194 http.cpp:936] Authorizing principal 'test-principal' to GET the
'/monitor/statistics.json' endpoint
I0517 23:25:39.016921 32198 slave.cpp:794] Agent terminating
[       OK ] Endpoint/SlaveEndpointTest.NoAuthorizer/1 (14 ms)
[ RUN      ] Endpoint/SlaveEndpointTest.NoAuthorizer/2
I0517 23:25:39.021662 26711 containerizer.cpp:221] Using isolation: posix/cpu,posix/mem,filesystem/posix,network/cni
W0517 23:25:39.021971 26711 backend.cpp:76] Failed to create 'aufs' backend: AufsBackend requires
root privileges
W0517 23:25:39.022017 26711 backend.cpp:76] Failed to create 'bind' backend: BindBackend requires
root privileges
I0517 23:25:39.022035 26711 provisioner.cpp:249] Using default backend 'copy'
I0517 23:25:39.022583 26711 cluster.cpp:448] Creating default 'local' authorizer
I0517 23:25:39.023196 32191 slave.cpp:225] Mesos agent started on (752)@172.17.0.3:56895
I0517 23:25:39.023332 32191 slave.cpp:226] Flags at startup: --acls="" --appc_simple_discovery_uri_prefix="http://"
--appc_store_dir="/tmp/mesos/store/appc" --authenticate_http_executors="true" --authenticate_http_readonly="true"
--authenticate_http_readwrite="true" --authenticatee="crammd5" --authentication_backoff_factor="1secs"
--authorizer="local" --cgroups_cpu_enable_pids_and_tids_count="false" --cgroups_enable_cfs="false"
--cgroups_hierarchy="/sys/fs/cgroup" --cgroups_limit_swap="false" --cgroups_root="mesos" --container_disk_watch_interval="15secs"
--containerizers="mesos" --credential="/tmp/Endpoint_SlaveEndpointTest_NoAuthorizer_2_5Az3Vd/credential"
--default_role="*" --disk_watch_interval="1mins" --docker="docker" --docker_kill_orphans="true"
--docker_registry="https://registry-1.docker.io" --docker_remove_delay="6hrs" --docker_socket="/var/run/docker.sock"
--docker_stop_timeout="0ns" --docker_store_dir="/tmp/mesos/store/docker" --docker_volume_checkpoint_dir="/var/run/mesos/isolators/docker/volume"
--enforce_container_disk_quota="false" --executor_registration_timeout="1mins" --executor_secret_key="/tmp/Endpoint_SlaveEndpointTest_NoAuthorizer_2_5Az3Vd/executor_secret_key"
--executor_shutdown_grace_period="5secs" --fetcher_cache_dir="/tmp/Endpoint_SlaveEndpointTest_NoAuthorizer_2_5Az3Vd/fetch"
--fetcher_cache_size="2GB" --frameworks_home="" --gc_delay="1weeks" --gc_disk_headroom="0.1"
--hadoop_home="" --help="false" --hostname_lookup="true" --http_command_executor="false" --http_credentials="/tmp/Endpoint_SlaveEndpointTest_NoAuthorizer_2_5Az3Vd/http_credentials"
--http_heartbeat_interval="30secs" --initialize_driver_logging="true" --isolation="posix/cpu,posix/mem"
--launcher="posix" --launcher_dir="/mesos/build/src" --logbufsecs="0" --logging_level="INFO"
--max_completed_executors_per_framework="150" --oversubscribed_resources_interval="15secs"
--perf_duration="10secs" --perf_interval="1mins" --port="5051" --qos_correction_interval_min="0ns"
--quiet="false" --recover="reconnect" --recovery_timeout="15mins" --registration_backoff_factor="10ms"
--resources="cpus:2;gpus:0;mem:1024;disk:1024;ports:[31000-32000]" --revocable_cpu_low_priority="true"
--runtime_dir="/tmp/Endpoint_SlaveEndpointTest_NoAuthorizer_2_5Az3Vd" --sandbox_directory="/mnt/mesos/sandbox"
--strict="true" --switch_user="true" --systemd_enable_support="true" --systemd_runtime_directory="/run/systemd/system"
--version="false" --work_dir="/tmp/Endpoint_SlaveEndpointTest_NoAuthorizer_2_wa7uJi"
I0517 23:25:39.023524 32191 credentials.hpp:86] Loading credential for authentication from
'/tmp/Endpoint_SlaveEndpointTest_NoAuthorizer_2_5Az3Vd/credential'
I0517 23:25:39.023633 32191 slave.cpp:258] Agent using credential for: test-principal
I0517 23:25:39.023663 32191 credentials.hpp:37] Loading credentials for authentication from
'/tmp/Endpoint_SlaveEndpointTest_NoAuthorizer_2_5Az3Vd/http_credentials'
I0517 23:25:39.023900 32191 http.cpp:975] Creating default 'basic' HTTP authenticator for
realm 'mesos-agent-executor'
I0517 23:25:39.023941 32191 http.cpp:996] Creating default 'jwt' HTTP authenticator for realm
'mesos-agent-executor'
I0517 23:25:39.024065 32191 http.cpp:975] Creating default 'basic' HTTP authenticator for
realm 'mesos-agent-readonly'
I0517 23:25:39.024102 32191 http.cpp:996] Creating default 'jwt' HTTP authenticator for realm
'mesos-agent-readonly'
I0517 23:25:39.024214 32191 http.cpp:975] Creating default 'basic' HTTP authenticator for
realm 'mesos-agent-readwrite'
I0517 23:25:39.024274 32191 http.cpp:996] Creating default 'jwt' HTTP authenticator for realm
'mesos-agent-readwrite'
I0517 23:25:39.024724 32191 slave.cpp:529] Agent resources: cpus(*):2; mem(*):1024; disk(*):1024;
ports(*):[31000-32000]
I0517 23:25:39.024755 32191 slave.cpp:537] Agent attributes: [  ]
I0517 23:25:39.024763 32191 slave.cpp:542] Agent hostname: cadb80e8ee89
I0517 23:25:39.024955 32200 status_update_manager.cpp:177] Pausing sending status updates
I0517 23:25:39.025245 32191 state.cpp:62] Recovering state from '/tmp/Endpoint_SlaveEndpointTest_NoAuthorizer_2_wa7uJi/meta'
I0517 23:25:39.025408 32194 status_update_manager.cpp:203] Recovering status update manager
I0517 23:25:39.025632 32194 containerizer.cpp:608] Recovering containerizer
I0517 23:25:39.026163 32185 provisioner.cpp:410] Provisioner recovery complete
I0517 23:25:39.026343 32198 slave.cpp:5974] Finished recovery
I0517 23:25:39.026772 32198 slave.cpp:6156] Querying resource estimator for oversubscribable
resources
I0517 23:25:39.026882 32187 slave.cpp:6170] Received oversubscribable resources {} from the
resource estimator
I0517 23:25:39.027648 32189 process.cpp:3730] Handling HTTP event for process 'slave(752)'
with path: '/slave(752)/containers'
I0517 23:25:39.028033 32189 http.cpp:1115] HTTP GET for /slave(752)/containers from 172.17.0.3:59546
I0517 23:25:39.028070 32189 http.cpp:936] Authorizing principal 'test-principal' to GET the
'/containers' endpoint
I0517 23:25:39.029422 26711 slave.cpp:794] Agent terminating
[       OK ] Endpoint/SlaveEndpointTest.NoAuthorizer/2 (12 ms)
[----------] 9 tests from Endpoint/SlaveEndpointTest (139 ms total)

[----------] Global test environment tear-down
[==========] 1526 tests from 168 test cases ran. (230021 ms total)
[  PASSED  ] 1525 tests.
[  FAILED  ] 1 test, listed below:
[  FAILED  ] ContentType/AgentAPITest.GetContainers/1, where GetParam() = application/json

 1 FAILED TEST
  YOU HAVE 22 DISABLED TESTS

E0517 23:25:39.079118 32201 process.cpp:950] Failed to accept socket: future discarded
make[3]: Leaving directory `/mesos/build'
make[3]: *** [CMakeFiles/check] Error 1
make[2]: *** [CMakeFiles/check.dir/all] Error 2
make[2]: Leaving directory `/mesos/build'
make[1]: *** [CMakeFiles/check.dir/rule] Error 2
make[1]: Leaving directory `/mesos/build'
make: *** [check] Error 2
+ docker rmi mesos-1495060604-10907
Untagged: mesos-1495060604-10907:latest
Deleted: sha256:1fce61456c59aedddd108154917c1c81bc874f9fe48b37371364bd2877fd1a29
Deleted: sha256:b18428933078d01a0caa6021bd2ff9e8347d0802e4b2ee515aa252bc0c7fa0bc
Deleted: sha256:f7bf73977154f4c34c50fc42130f4eb06f9e1e77f2f8f5f44c79cf74a7974e31
Deleted: sha256:3d5827a2a2fa4349c246aa948964ab8ac3fdbe257710c43c47fdc450aeb9dcea
Deleted: sha256:54f115d89d6345e18c92235c1188417e97e1e706b7e08ef39809319c905e55f9
Deleted: sha256:9eb36c7e4d1695bd7cf11ac72cb7d7161d0a243887a268e2d352dd23db195820
Deleted: sha256:aaf4d6542c6e3553cebff55a4678f1124d90b2fb7610267875684a7139d60aee
Deleted: sha256:1e99759afa01258a7f49c05b3e1b03d67606e7aa3e390c9e408342660f17ea60
Deleted: sha256:7eddf5768cdf8da809fe172dbf22796ff5a81f773d155af44dd3b21d1db54120
Deleted: sha256:e6f5257ab5f234244029da17f049a7c40e0b1676736e842abf73464339bac3f5
Deleted: sha256:e1f58e80b60d642f9529ef916ff5b395e4d5bd26ac20cec759d8292d677904d8
Deleted: sha256:7b4364e5906beae326f057f3a19ed58a966166268a755c7781ffc229e93df999
Deleted: sha256:acbb5135932dfc0d5afdd78144f6f173a47499cd494fe982ba5255030b773c40
Deleted: sha256:e94f3ccd2deaafd78408b399017f500c55c2628313cd7c06e0b7da46b755e629
Deleted: sha256:d417819ee4876fe5c4844bf20b78f8fea724214af47837671ff25d088ec7b63a
Deleted: sha256:441c0243332d00810e4cc8f81daca95ced584e5618195c53e20fb03ed781fa78
Deleted: sha256:103f08603eef9b94405bfd723470feb147f36b62cdcf2f3158abcac2f43a85bb
Deleted: sha256:6cacefe5fc8e36645bbc7fdf1c99871d8c3149172ee560810718252504519293
Deleted: sha256:c6482035d4d61c691e244953e4af9df1d922c5fbebf9929c98c1474e5f4c23b2
Deleted: sha256:369c39c87e643d19b8878fbf3d0cb9639655bc1b8994209e4088bc336cae5111
Deleted: sha256:4c5425131238dcdd1dacc53909ccf96f53ef9468b990052348fa5cbab4f42d3d
Deleted: sha256:88c4fcd037840ac7b70ea6d36fd48c30d911411ac7a8cbfb1ee1b4ac3a233068
Deleted: sha256:2b41c5b097b1ca5e6a416f68e65730b2007298a7c848fb1d60d4f19b064da197
Deleted: sha256:e3750b6158ee4e4d13e95878cdeae6dac917061412fb17a63702a209b9033c85
Deleted: sha256:dc775b7f4955019be3b124dab60a91d03be93675d7c935003fa5ecbbe50f2d27
Build step 'Execute shell' marked build as failure
Not sending mail to unregistered user neil.conway@gmail.com

Mime
View raw message