mesos-builds mailing list archives

Site index · List index
Message view « Date » · « Thread »
Top « Date » · « Thread »
From Apache Jenkins Server <jenk...@builds.apache.org>
Subject Build failed in Jenkins: Mesos-Buildbot » autotools,clang,--verbose,GLOG_v=1 MESOS_VERBOSE=1,ubuntu:14.04,(docker||Hadoop)&&(!ubuntu-us1)&&(!ubuntu-eu2) #3741
Date Mon, 29 May 2017 15:42:10 GMT
See <https://builds.apache.org/job/Mesos-Buildbot/BUILDTOOL=autotools,COMPILER=clang,CONFIGURATION=--verbose,ENVIRONMENT=GLOG_v=1%20MESOS_VERBOSE=1,OS=ubuntu%3A14.04,label_exp=(docker%7C%7CHadoop)&&(!ubuntu-us1)&&(!ubuntu-eu2)/3741/display/redirect?page=changes>

Changes:

[klueska] Added HTTP utility functions to the new Mesos CLI.

------------------------------------------
[...truncated 27.50 MB...]
[       OK ] Endpoint/SlaveEndpointTest.AuthorizedRequest/1 (28 ms)
[ RUN      ] Endpoint/SlaveEndpointTest.AuthorizedRequest/2
I0529 15:42:00.483114  2949 containerizer.cpp:230] Using isolation: posix/cpu,posix/mem,filesystem/posix,network/cni,environment_secret
W0529 15:42:00.483521  2949 backend.cpp:76] Failed to create 'aufs' backend: AufsBackend requires
root privileges
W0529 15:42:00.483621  2949 backend.cpp:76] Failed to create 'bind' backend: BindBackend requires
root privileges
I0529 15:42:00.483662  2949 provisioner.cpp:255] Using default backend 'copy'
I0529 15:42:00.486569  2976 slave.cpp:232] Mesos agent started on (751)@172.17.0.3:49913
I0529 15:42:00.486605  2976 slave.cpp:233] Flags at startup: --acls="" --appc_simple_discovery_uri_prefix="http://"
--appc_store_dir="/tmp/mesos/store/appc" --authenticate_http_readonly="true" --authenticate_http_readwrite="true"
--authenticatee="crammd5" --authentication_backoff_factor="1secs" --authorizer="local" --cgroups_cpu_enable_pids_and_tids_count="false"
--cgroups_enable_cfs="false" --cgroups_hierarchy="/sys/fs/cgroup" --cgroups_limit_swap="false"
--cgroups_root="mesos" --container_disk_watch_interval="15secs" --containerizers="mesos" --credential="/tmp/Endpoint_SlaveEndpointTest_AuthorizedRequest_2_SYycgU/credential"
--default_role="*" --disk_watch_interval="1mins" --docker="docker" --docker_kill_orphans="true"
--docker_registry="https://registry-1.docker.io" --docker_remove_delay="6hrs" --docker_socket="/var/run/docker.sock"
--docker_stop_timeout="0ns" --docker_store_dir="/tmp/mesos/store/docker" --docker_volume_checkpoint_dir="/var/run/mesos/isolators/docker/volume"
--enforce_container_disk_quota="false" --executor_registration_timeout="1mins" --executor_reregistration_timeout="2secs"
--executor_shutdown_grace_period="5secs" --fetcher_cache_dir="/tmp/Endpoint_SlaveEndpointTest_AuthorizedRequest_2_SYycgU/fetch"
--fetcher_cache_size="2GB" --frameworks_home="" --gc_delay="1weeks" --gc_disk_headroom="0.1"
--hadoop_home="" --help="false" --hostname_lookup="true" --http_command_executor="false" --http_credentials="/tmp/Endpoint_SlaveEndpointTest_AuthorizedRequest_2_SYycgU/http_credentials"
--http_heartbeat_interval="30secs" --initialize_driver_logging="true" --isolation="posix/cpu,posix/mem"
--launcher="posix" --launcher_dir="/mesos/mesos-1.4.0/_build/src" --logbufsecs="0" --logging_level="INFO"
--max_completed_executors_per_framework="150" --oversubscribed_resources_interval="15secs"
--perf_duration="10secs" --perf_interval="1mins" --port="5051" --qos_correction_interval_min="0ns"
--quiet="false" --recover="reconnect" --recovery_timeout="15mins" --registration_backoff_factor="10ms"
--resources="cpus:2;gpus:0;mem:1024;disk:1024;ports:[31000-32000]" --revocable_cpu_low_priority="true"
--runtime_dir="/tmp/Endpoint_SlaveEndpointTest_AuthorizedRequest_2_SYycgU" --sandbox_directory="/mnt/mesos/sandbox"
--strict="true" --switch_user="true" --systemd_enable_support="true" --systemd_runtime_directory="/run/systemd/system"
--version="false" --work_dir="/tmp/Endpoint_SlaveEndpointTest_AuthorizedRequest_2_BBu0zk"
I0529 15:42:00.487104  2976 credentials.hpp:86] Loading credential for authentication from
'/tmp/Endpoint_SlaveEndpointTest_AuthorizedRequest_2_SYycgU/credential'
I0529 15:42:00.487259  2976 slave.cpp:265] Agent using credential for: test-principal
I0529 15:42:00.487284  2976 credentials.hpp:37] Loading credentials for authentication from
'/tmp/Endpoint_SlaveEndpointTest_AuthorizedRequest_2_SYycgU/http_credentials'
I0529 15:42:00.487557  2976 http.cpp:975] Creating default 'basic' HTTP authenticator for
realm 'mesos-agent-readonly'
I0529 15:42:00.487699  2976 http.cpp:975] Creating default 'basic' HTTP authenticator for
realm 'mesos-agent-readwrite'
I0529 15:42:00.488826  2976 slave.cpp:536] Agent resources: cpus(*):2; mem(*):1024; disk(*):1024;
ports(*):[31000-32000]
I0529 15:42:00.488893  2976 slave.cpp:544] Agent attributes: [  ]
I0529 15:42:00.488905  2976 slave.cpp:549] Agent hostname: 8cc18b9ff0ef
I0529 15:42:00.489047  2970 status_update_manager.cpp:177] Pausing sending status updates
I0529 15:42:00.490061  2978 state.cpp:62] Recovering state from '/tmp/Endpoint_SlaveEndpointTest_AuthorizedRequest_2_BBu0zk/meta'
I0529 15:42:00.490371  2975 status_update_manager.cpp:203] Recovering status update manager
I0529 15:42:00.490553  2970 containerizer.cpp:582] Recovering containerizer
I0529 15:42:00.491722  2974 provisioner.cpp:416] Provisioner recovery complete
I0529 15:42:00.492055  2969 slave.cpp:6083] Finished recovery
I0529 15:42:00.492553  2969 slave.cpp:6265] Querying resource estimator for oversubscribable
resources
I0529 15:42:00.492770  2969 slave.cpp:6279] Received oversubscribable resources {} from the
resource estimator
I0529 15:42:00.495303  2975 process.cpp:3730] Handling HTTP event for process 'slave(751)'
with path: '/slave(751)/containers'
I0529 15:42:00.496567  2975 http.cpp:1115] HTTP GET for /slave(751)/containers from 172.17.0.3:33793
I0529 15:42:00.496628  2975 http.cpp:936] Authorizing principal 'test-principal' to GET the
'/containers' endpoint
I0529 15:42:00.500383  2972 slave.cpp:801] Agent terminating
[       OK ] Endpoint/SlaveEndpointTest.AuthorizedRequest/2 (25 ms)
[ RUN      ] Endpoint/SlaveEndpointTest.UnauthorizedRequest/0
I0529 15:42:00.509337  2949 containerizer.cpp:230] Using isolation: posix/cpu,posix/mem,filesystem/posix,network/cni,environment_secret
W0529 15:42:00.509785  2949 backend.cpp:76] Failed to create 'aufs' backend: AufsBackend requires
root privileges
W0529 15:42:00.509881  2949 backend.cpp:76] Failed to create 'bind' backend: BindBackend requires
root privileges
I0529 15:42:00.509922  2949 provisioner.cpp:255] Using default backend 'copy'
I0529 15:42:00.512774  2973 slave.cpp:232] Mesos agent started on (752)@172.17.0.3:49913
I0529 15:42:00.512814  2973 slave.cpp:233] Flags at startup: --acls="" --appc_simple_discovery_uri_prefix="http://"
--appc_store_dir="/tmp/mesos/store/appc" --authenticate_http_readonly="true" --authenticate_http_readwrite="true"
--authenticatee="crammd5" --authentication_backoff_factor="1secs" --authorizer="local" --cgroups_cpu_enable_pids_and_tids_count="false"
--cgroups_enable_cfs="false" --cgroups_hierarchy="/sys/fs/cgroup" --cgroups_limit_swap="false"
--cgroups_root="mesos" --container_disk_watch_interval="15secs" --containerizers="mesos" --credential="/tmp/Endpoint_SlaveEndpointTest_UnauthorizedRequest_0_WJqkdd/credential"
--default_role="*" --disk_watch_interval="1mins" --docker="docker" --docker_kill_orphans="true"
--docker_registry="https://registry-1.docker.io" --docker_remove_delay="6hrs" --docker_socket="/var/run/docker.sock"
--docker_stop_timeout="0ns" --docker_store_dir="/tmp/mesos/store/docker" --docker_volume_checkpoint_dir="/var/run/mesos/isolators/docker/volume"
--enforce_container_disk_quota="false" --executor_registration_timeout="1mins" --executor_reregistration_timeout="2secs"
--executor_shutdown_grace_period="5secs" --fetcher_cache_dir="/tmp/Endpoint_SlaveEndpointTest_UnauthorizedRequest_0_WJqkdd/fetch"
--fetcher_cache_size="2GB" --frameworks_home="" --gc_delay="1weeks" --gc_disk_headroom="0.1"
--hadoop_home="" --help="false" --hostname_lookup="true" --http_command_executor="false" --http_credentials="/tmp/Endpoint_SlaveEndpointTest_UnauthorizedRequest_0_WJqkdd/http_credentials"
--http_heartbeat_interval="30secs" --initialize_driver_logging="true" --isolation="posix/cpu,posix/mem"
--launcher="posix" --launcher_dir="/mesos/mesos-1.4.0/_build/src" --logbufsecs="0" --logging_level="INFO"
--max_completed_executors_per_framework="150" --oversubscribed_resources_interval="15secs"
--perf_duration="10secs" --perf_interval="1mins" --port="5051" --qos_correction_interval_min="0ns"
--quiet="false" --recover="reconnect" --recovery_timeout="15mins" --registration_backoff_factor="10ms"
--resources="cpus:2;gpus:0;mem:1024;disk:1024;ports:[31000-32000]" --revocable_cpu_low_priority="true"
--runtime_dir="/tmp/Endpoint_SlaveEndpointTest_UnauthorizedRequest_0_WJqkdd" --sandbox_directory="/mnt/mesos/sandbox"
--strict="true" --switch_user="true" --systemd_enable_support="true" --systemd_runtime_directory="/run/systemd/system"
--version="false" --work_dir="/tmp/Endpoint_SlaveEndpointTest_UnauthorizedRequest_0_VNsSsD"
I0529 15:42:00.513183  2973 credentials.hpp:86] Loading credential for authentication from
'/tmp/Endpoint_SlaveEndpointTest_UnauthorizedRequest_0_WJqkdd/credential'
I0529 15:42:00.513316  2973 slave.cpp:265] Agent using credential for: test-principal
I0529 15:42:00.513341  2973 credentials.hpp:37] Loading credentials for authentication from
'/tmp/Endpoint_SlaveEndpointTest_UnauthorizedRequest_0_WJqkdd/http_credentials'
I0529 15:42:00.513552  2973 http.cpp:975] Creating default 'basic' HTTP authenticator for
realm 'mesos-agent-readonly'
I0529 15:42:00.513684  2973 http.cpp:975] Creating default 'basic' HTTP authenticator for
realm 'mesos-agent-readwrite'
I0529 15:42:00.514785  2973 slave.cpp:536] Agent resources: cpus(*):2; mem(*):1024; disk(*):1024;
ports(*):[31000-32000]
I0529 15:42:00.514854  2973 slave.cpp:544] Agent attributes: [  ]
I0529 15:42:00.514873  2973 slave.cpp:549] Agent hostname: 8cc18b9ff0ef
I0529 15:42:00.515044  2978 status_update_manager.cpp:177] Pausing sending status updates
I0529 15:42:00.516722  2970 state.cpp:62] Recovering state from '/tmp/Endpoint_SlaveEndpointTest_UnauthorizedRequest_0_VNsSsD/meta'
I0529 15:42:00.517050  2972 status_update_manager.cpp:203] Recovering status update manager
I0529 15:42:00.517302  2967 containerizer.cpp:582] Recovering containerizer
I0529 15:42:00.519255  2971 provisioner.cpp:416] Provisioner recovery complete
I0529 15:42:00.519733  2972 slave.cpp:6083] Finished recovery
I0529 15:42:00.520440  2972 slave.cpp:6265] Querying resource estimator for oversubscribable
resources
I0529 15:42:00.520738  2982 slave.cpp:6279] Received oversubscribable resources {} from the
resource estimator
I0529 15:42:00.523928  2968 process.cpp:3730] Handling HTTP event for process 'slave(752)'
with path: '/slave(752)/monitor/statistics'
I0529 15:42:00.525542  2970 http.cpp:1115] HTTP GET for /slave(752)/monitor/statistics from
172.17.0.3:33794
I0529 15:42:00.525665  2970 http.cpp:936] Authorizing principal 'test-principal' to GET the
'/monitor/statistics' endpoint
I0529 15:42:00.529166  2975 slave.cpp:801] Agent terminating
[       OK ] Endpoint/SlaveEndpointTest.UnauthorizedRequest/0 (30 ms)
[ RUN      ] Endpoint/SlaveEndpointTest.UnauthorizedRequest/1
I0529 15:42:00.540940  2949 containerizer.cpp:230] Using isolation: posix/cpu,posix/mem,filesystem/posix,network/cni,environment_secret
W0529 15:42:00.541610  2949 backend.cpp:76] Failed to create 'aufs' backend: AufsBackend requires
root privileges
W0529 15:42:00.541736  2949 backend.cpp:76] Failed to create 'bind' backend: BindBackend requires
root privileges
I0529 15:42:00.541779  2949 provisioner.cpp:255] Using default backend 'copy'
I0529 15:42:00.545811  2980 slave.cpp:232] Mesos agent started on (753)@172.17.0.3:49913
I0529 15:42:00.545845  2980 slave.cpp:233] Flags at startup: --acls="" --appc_simple_discovery_uri_prefix="http://"
--appc_store_dir="/tmp/mesos/store/appc" --authenticate_http_readonly="true" --authenticate_http_readwrite="true"
--authenticatee="crammd5" --authentication_backoff_factor="1secs" --authorizer="local" --cgroups_cpu_enable_pids_and_tids_count="false"
--cgroups_enable_cfs="false" --cgroups_hierarchy="/sys/fs/cgroup" --cgroups_limit_swap="false"
--cgroups_root="mesos" --container_disk_watch_interval="15secs" --containerizers="mesos" --credential="/tmp/Endpoint_SlaveEndpointTest_UnauthorizedRequest_1_kE6Ktw/credential"
--default_role="*" --disk_watch_interval="1mins" --docker="docker" --docker_kill_orphans="true"
--docker_registry="https://registry-1.docker.io" --docker_remove_delay="6hrs" --docker_socket="/var/run/docker.sock"
--docker_stop_timeout="0ns" --docker_store_dir="/tmp/mesos/store/docker" --docker_volume_checkpoint_dir="/var/run/mesos/isolators/docker/volume"
--enforce_container_disk_quota="false" --executor_registration_timeout="1mins" --executor_reregistration_timeout="2secs"
--executor_shutdown_grace_period="5secs" --fetcher_cache_dir="/tmp/Endpoint_SlaveEndpointTest_UnauthorizedRequest_1_kE6Ktw/fetch"
--fetcher_cache_size="2GB" --frameworks_home="" --gc_delay="1weeks" --gc_disk_headroom="0.1"
--hadoop_home="" --help="false" --hostname_lookup="true" --http_command_executor="false" --http_credentials="/tmp/Endpoint_SlaveEndpointTest_UnauthorizedRequest_1_kE6Ktw/http_credentials"
--http_heartbeat_interval="30secs" --initialize_driver_logging="true" --isolation="posix/cpu,posix/mem"
--launcher="posix" --launcher_dir="/mesos/mesos-1.4.0/_build/src" --logbufsecs="0" --logging_level="INFO"
--max_completed_executors_per_framework="150" --oversubscribed_resources_interval="15secs"
--perf_duration="10secs" --perf_interval="1mins" --port="5051" --qos_correction_interval_min="0ns"
--quiet="false" --recover="reconnect" --recovery_timeout="15mins" --registration_backoff_factor="10ms"
--resources="cpus:2;gpus:0;mem:1024;disk:1024;ports:[31000-32000]" --revocable_cpu_low_priority="true"
--runtime_dir="/tmp/Endpoint_SlaveEndpointTest_UnauthorizedRequest_1_kE6Ktw" --sandbox_directory="/mnt/mesos/sandbox"
--strict="true" --switch_user="true" --systemd_enable_support="true" --systemd_runtime_directory="/run/systemd/system"
--version="false" --work_dir="/tmp/Endpoint_SlaveEndpointTest_UnauthorizedRequest_1_NDDmEW"
I0529 15:42:00.546310  2980 credentials.hpp:86] Loading credential for authentication from
'/tmp/Endpoint_SlaveEndpointTest_UnauthorizedRequest_1_kE6Ktw/credential'
I0529 15:42:00.546469  2980 slave.cpp:265] Agent using credential for: test-principal
I0529 15:42:00.546492  2980 credentials.hpp:37] Loading credentials for authentication from
'/tmp/Endpoint_SlaveEndpointTest_UnauthorizedRequest_1_kE6Ktw/http_credentials'
I0529 15:42:00.546710  2980 http.cpp:975] Creating default 'basic' HTTP authenticator for
realm 'mesos-agent-readonly'
I0529 15:42:00.547117  2980 http.cpp:975] Creating default 'basic' HTTP authenticator for
realm 'mesos-agent-readwrite'
I0529 15:42:00.548466  2980 slave.cpp:536] Agent resources: cpus(*):2; mem(*):1024; disk(*):1024;
ports(*):[31000-32000]
I0529 15:42:00.548532  2980 slave.cpp:544] Agent attributes: [  ]
I0529 15:42:00.548543  2980 slave.cpp:549] Agent hostname: 8cc18b9ff0ef
I0529 15:42:00.548677  2968 status_update_manager.cpp:177] Pausing sending status updates
I0529 15:42:00.549909  2970 state.cpp:62] Recovering state from '/tmp/Endpoint_SlaveEndpointTest_UnauthorizedRequest_1_NDDmEW/meta'
I0529 15:42:00.550338  2976 status_update_manager.cpp:203] Recovering status update manager
I0529 15:42:00.550659  2981 containerizer.cpp:582] Recovering containerizer
I0529 15:42:00.552347  2980 provisioner.cpp:416] Provisioner recovery complete
I0529 15:42:00.552875  2967 slave.cpp:6083] Finished recovery
I0529 15:42:00.553467  2967 slave.cpp:6265] Querying resource estimator for oversubscribable
resources
I0529 15:42:00.553932  2967 slave.cpp:6279] Received oversubscribable resources {} from the
resource estimator
I0529 15:42:00.556397  2980 process.cpp:3730] Handling HTTP event for process 'slave(753)'
with path: '/slave(753)/monitor/statistics.json'
I0529 15:42:00.557754  2968 http.cpp:1115] HTTP GET for /slave(753)/monitor/statistics.json
from 172.17.0.3:33796
I0529 15:42:00.557817  2968 http.cpp:936] Authorizing principal 'test-principal' to GET the
'/monitor/statistics.json' endpoint
I0529 15:42:00.560302  2982 slave.cpp:801] Agent terminating
[       OK ] Endpoint/SlaveEndpointTest.UnauthorizedRequest/1 (31 ms)
[ RUN      ] Endpoint/SlaveEndpointTest.UnauthorizedRequest/2
I0529 15:42:00.573609  2949 containerizer.cpp:230] Using isolation: posix/cpu,posix/mem,filesystem/posix,network/cni,environment_secret
W0529 15:42:00.574162  2949 backend.cpp:76] Failed to create 'aufs' backend: AufsBackend requires
root privileges
W0529 15:42:00.574319  2949 backend.cpp:76] Failed to create 'bind' backend: BindBackend requires
root privileges
I0529 15:42:00.574363  2949 provisioner.cpp:255] Using default backend 'copy'
I0529 15:42:00.577882  2977 slave.cpp:232] Mesos agent started on (754)@172.17.0.3:49913
I0529 15:42:00.577950  2977 slave.cpp:233] Flags at startup: --acls="" --appc_simple_discovery_uri_prefix="http://"
--appc_store_dir="/tmp/mesos/store/appc" --authenticate_http_readonly="true" --authenticate_http_readwrite="true"
--authenticatee="crammd5" --authentication_backoff_factor="1secs" --authorizer="local" --cgroups_cpu_enable_pids_and_tids_count="false"
--cgroups_enable_cfs="false" --cgroups_hierarchy="/sys/fs/cgroup" --cgroups_limit_swap="false"
--cgroups_root="mesos" --container_disk_watch_interval="15secs" --containerizers="mesos" --credential="/tmp/Endpoint_SlaveEndpointTest_UnauthorizedRequest_2_qTSz5P/credential"
--default_role="*" --disk_watch_interval="1mins" --docker="docker" --docker_kill_orphans="true"
--docker_registry="https://registry-1.docker.io" --docker_remove_delay="6hrs" --docker_socket="/var/run/docker.sock"
--docker_stop_timeout="0ns" --docker_store_dir="/tmp/mesos/store/docker" --docker_volume_checkpoint_dir="/var/run/mesos/isolators/docker/volume"
--enforce_container_disk_quota="false" --executor_registration_timeout="1mins" --executor_reregistration_timeout="2secs"
--executor_shutdown_grace_period="5secs" --fetcher_cache_dir="/tmp/Endpoint_SlaveEndpointTest_UnauthorizedRequest_2_qTSz5P/fetch"
--fetcher_cache_size="2GB" --frameworks_home="" --gc_delay="1weeks" --gc_disk_headroom="0.1"
--hadoop_home="" --help="false" --hostname_lookup="true" --http_command_executor="false" --http_credentials="/tmp/Endpoint_SlaveEndpointTest_UnauthorizedRequest_2_qTSz5P/http_credentials"
--http_heartbeat_interval="30secs" --initialize_driver_logging="true" --isolation="posix/cpu,posix/mem"
--launcher="posix" --launcher_dir="/mesos/mesos-1.4.0/_build/src" --logbufsecs="0" --logging_level="INFO"
--max_completed_executors_per_framework="150" --oversubscribed_resources_interval="15secs"
--perf_duration="10secs" --perf_interval="1mins" --port="5051" --qos_correction_interval_min="0ns"
--quiet="false" --recover="reconnect" --recovery_timeout="15mins" --registration_backoff_factor="10ms"
--resources="cpus:2;gpus:0;mem:1024;disk:1024;ports:[31000-32000]" --revocable_cpu_low_priority="true"
--runtime_dir="/tmp/Endpoint_SlaveEndpointTest_UnauthorizedRequest_2_qTSz5P" --sandbox_directory="/mnt/mesos/sandbox"
--strict="true" --switch_user="true" --systemd_enable_support="true" --systemd_runtime_directory="/run/systemd/system"
--version="false" --work_dir="/tmp/Endpoint_SlaveEndpointTest_UnauthorizedRequest_2_5GVOag"
I0529 15:42:00.578614  2977 credentials.hpp:86] Loading credential for authentication from
'/tmp/Endpoint_SlaveEndpointTest_UnauthorizedRequest_2_qTSz5P/credential'
I0529 15:42:00.578794  2977 slave.cpp:265] Agent using credential for: test-principal
I0529 15:42:00.578825  2977 credentials.hpp:37] Loading credentials for authentication from
'/tmp/Endpoint_SlaveEndpointTest_UnauthorizedRequest_2_qTSz5P/http_credentials'
I0529 15:42:00.579102  2977 http.cpp:975] Creating default 'basic' HTTP authenticator for
realm 'mesos-agent-readonly'
I0529 15:42:00.579319  2977 http.cpp:975] Creating default 'basic' HTTP authenticator for
realm 'mesos-agent-readwrite'
I0529 15:42:00.581117  2977 slave.cpp:536] Agent resources: cpus(*):2; mem(*):1024; disk(*):1024;
ports(*):[31000-32000]
I0529 15:42:00.581207  2977 slave.cpp:544] Agent attributes: [  ]
I0529 15:42:00.581223  2977 slave.cpp:549] Agent hostname: 8cc18b9ff0ef
I0529 15:42:00.581398  2974 status_update_manager.cpp:177] Pausing sending status updates
I0529 15:42:00.583083  2976 state.cpp:62] Recovering state from '/tmp/Endpoint_SlaveEndpointTest_UnauthorizedRequest_2_5GVOag/meta'
I0529 15:42:00.583382  2970 status_update_manager.cpp:203] Recovering status update manager
I0529 15:42:00.583786  2974 containerizer.cpp:582] Recovering containerizer
I0529 15:42:00.585165  2973 provisioner.cpp:416] Provisioner recovery complete
I0529 15:42:00.585569  2975 slave.cpp:6083] Finished recovery
I0529 15:42:00.586098  2975 slave.cpp:6265] Querying resource estimator for oversubscribable
resources
I0529 15:42:00.586361  2980 slave.cpp:6279] Received oversubscribable resources {} from the
resource estimator
I0529 15:42:00.588181  2974 process.cpp:3730] Handling HTTP event for process 'slave(754)'
with path: '/slave(754)/containers'
I0529 15:42:00.589145  2967 http.cpp:1115] HTTP GET for /slave(754)/containers from 172.17.0.3:33797
I0529 15:42:00.589211  2967 http.cpp:936] Authorizing principal 'test-principal' to GET the
'/containers' endpoint
I0529 15:42:00.591413  2976 slave.cpp:801] Agent terminating
[       OK ] Endpoint/SlaveEndpointTest.UnauthorizedRequest/2 (29 ms)
[ RUN      ] Endpoint/SlaveEndpointTest.NoAuthorizer/0
I0529 15:42:00.603281  2949 containerizer.cpp:230] Using isolation: posix/cpu,posix/mem,filesystem/posix,network/cni,environment_secret
W0529 15:42:00.603842  2949 backend.cpp:76] Failed to create 'aufs' backend: AufsBackend requires
root privileges
W0529 15:42:00.603955  2949 backend.cpp:76] Failed to create 'bind' backend: BindBackend requires
root privileges
I0529 15:42:00.603991  2949 provisioner.cpp:255] Using default backend 'copy'
I0529 15:42:00.605866  2949 cluster.cpp:448] Creating default 'local' authorizer
I0529 15:42:00.607704  2975 slave.cpp:232] Mesos agent started on (755)@172.17.0.3:49913
I0529 15:42:00.607753  2975 slave.cpp:233] Flags at startup: --acls="" --appc_simple_discovery_uri_prefix="http://"
--appc_store_dir="/tmp/mesos/store/appc" --authenticate_http_readonly="true" --authenticate_http_readwrite="true"
--authenticatee="crammd5" --authentication_backoff_factor="1secs" --authorizer="local" --cgroups_cpu_enable_pids_and_tids_count="false"
--cgroups_enable_cfs="false" --cgroups_hierarchy="/sys/fs/cgroup" --cgroups_limit_swap="false"
--cgroups_root="mesos" --container_disk_watch_interval="15secs" --containerizers="mesos" --credential="/tmp/Endpoint_SlaveEndpointTest_NoAuthorizer_0_8B1209/credential"
--default_role="*" --disk_watch_interval="1mins" --docker="docker" --docker_kill_orphans="true"
--docker_registry="https://registry-1.docker.io" --docker_remove_delay="6hrs" --docker_socket="/var/run/docker.sock"
--docker_stop_timeout="0ns" --docker_store_dir="/tmp/mesos/store/docker" --docker_volume_checkpoint_dir="/var/run/mesos/isolators/docker/volume"
--enforce_container_disk_quota="false" --executor_registration_timeout="1mins" --executor_reregistration_timeout="2secs"
--executor_shutdown_grace_period="5secs" --fetcher_cache_dir="/tmp/Endpoint_SlaveEndpointTest_NoAuthorizer_0_8B1209/fetch"
--fetcher_cache_size="2GB" --frameworks_home="" --gc_delay="1weeks" --gc_disk_headroom="0.1"
--hadoop_home="" --help="false" --hostname_lookup="true" --http_command_executor="false" --http_credentials="/tmp/Endpoint_SlaveEndpointTest_NoAuthorizer_0_8B1209/http_credentials"
--http_heartbeat_interval="30secs" --initialize_driver_logging="true" --isolation="posix/cpu,posix/mem"
--launcher="posix" --launcher_dir="/mesos/mesos-1.4.0/_build/src" --logbufsecs="0" --logging_level="INFO"
--max_completed_executors_per_framework="150" --oversubscribed_resources_interval="15secs"
--perf_duration="10secs" --perf_interval="1mins" --port="5051" --qos_correction_interval_min="0ns"
--quiet="false" --recover="reconnect" --recovery_timeout="15mins" --registration_backoff_factor="10ms"
--resources="cpus:2;gpus:0;mem:1024;disk:1024;ports:[31000-32000]" --revocable_cpu_low_priority="true"
--runtime_dir="/tmp/Endpoint_SlaveEndpointTest_NoAuthorizer_0_8B1209" --sandbox_directory="/mnt/mesos/sandbox"
--strict="true" --switch_user="true" --systemd_enable_support="true" --systemd_runtime_directory="/run/systemd/system"
--version="false" --work_dir="/tmp/Endpoint_SlaveEndpointTest_NoAuthorizer_0_jUew1z"
I0529 15:42:00.608196  2975 credentials.hpp:86] Loading credential for authentication from
'/tmp/Endpoint_SlaveEndpointTest_NoAuthorizer_0_8B1209/credential'
I0529 15:42:00.608351  2975 slave.cpp:265] Agent using credential for: test-principal
I0529 15:42:00.608376  2975 credentials.hpp:37] Loading credentials for authentication from
'/tmp/Endpoint_SlaveEndpointTest_NoAuthorizer_0_8B1209/http_credentials'
I0529 15:42:00.608636  2975 http.cpp:975] Creating default 'basic' HTTP authenticator for
realm 'mesos-agent-readonly'
I0529 15:42:00.608798  2975 http.cpp:975] Creating default 'basic' HTTP authenticator for
realm 'mesos-agent-readwrite'
I0529 15:42:00.610332  2975 slave.cpp:536] Agent resources: cpus(*):2; mem(*):1024; disk(*):1024;
ports(*):[31000-32000]
I0529 15:42:00.610422  2975 slave.cpp:544] Agent attributes: [  ]
I0529 15:42:00.610438  2975 slave.cpp:549] Agent hostname: 8cc18b9ff0ef
I0529 15:42:00.610577  2968 status_update_manager.cpp:177] Pausing sending status updates
I0529 15:42:00.611963  2977 state.cpp:62] Recovering state from '/tmp/Endpoint_SlaveEndpointTest_NoAuthorizer_0_jUew1z/meta'
I0529 15:42:00.612448  2976 status_update_manager.cpp:203] Recovering status update manager
I0529 15:42:00.612643  2981 containerizer.cpp:582] Recovering containerizer
I0529 15:42:00.614243  2970 provisioner.cpp:416] Provisioner recovery complete
I0529 15:42:00.614629  2969 slave.cpp:6083] Finished recovery
I0529 15:42:00.615057  2969 slave.cpp:6265] Querying resource estimator for oversubscribable
resources
I0529 15:42:00.615316  2973 slave.cpp:6279] Received oversubscribable resources {} from the
resource estimator
I0529 15:42:00.617297  2969 process.cpp:3730] Handling HTTP event for process 'slave(755)'
with path: '/slave(755)/monitor/statistics'
I0529 15:42:00.618435  2973 http.cpp:1115] HTTP GET for /slave(755)/monitor/statistics from
172.17.0.3:33798
I0529 15:42:00.618511  2973 http.cpp:936] Authorizing principal 'test-principal' to GET the
'/monitor/statistics' endpoint
I0529 15:42:00.622207  2967 slave.cpp:801] Agent terminating
[       OK ] Endpoint/SlaveEndpointTest.NoAuthorizer/0 (30 ms)
[ RUN      ] Endpoint/SlaveEndpointTest.NoAuthorizer/1
I0529 15:42:00.634486  2949 containerizer.cpp:230] Using isolation: posix/cpu,posix/mem,filesystem/posix,network/cni,environment_secret
W0529 15:42:00.634977  2949 backend.cpp:76] Failed to create 'aufs' backend: AufsBackend requires
root privileges
W0529 15:42:00.635080  2949 backend.cpp:76] Failed to create 'bind' backend: BindBackend requires
root privileges
I0529 15:42:00.635115  2949 provisioner.cpp:255] Using default backend 'copy'
I0529 15:42:00.636847  2949 cluster.cpp:448] Creating default 'local' authorizer
I0529 15:42:00.638583  2968 slave.cpp:232] Mesos agent started on (756)@172.17.0.3:49913
I0529 15:42:00.638617  2968 slave.cpp:233] Flags at startup: --acls="" --appc_simple_discovery_uri_prefix="http://"
--appc_store_dir="/tmp/mesos/store/appc" --authenticate_http_readonly="true" --authenticate_http_readwrite="true"
--authenticatee="crammd5" --authentication_backoff_factor="1secs" --authorizer="local" --cgroups_cpu_enable_pids_and_tids_count="false"
--cgroups_enable_cfs="false" --cgroups_hierarchy="/sys/fs/cgroup" --cgroups_limit_swap="false"
--cgroups_root="mesos" --container_disk_watch_interval="15secs" --containerizers="mesos" --credential="/tmp/Endpoint_SlaveEndpointTest_NoAuthorizer_1_44Thgu/credential"
--default_role="*" --disk_watch_interval="1mins" --docker="docker" --docker_kill_orphans="true"
--docker_registry="https://registry-1.docker.io" --docker_remove_delay="6hrs" --docker_socket="/var/run/docker.sock"
--docker_stop_timeout="0ns" --docker_store_dir="/tmp/mesos/store/docker" --docker_volume_checkpoint_dir="/var/run/mesos/isolators/docker/volume"
--enforce_container_disk_quota="false" --executor_registration_timeout="1mins" --executor_reregistration_timeout="2secs"
--executor_shutdown_grace_period="5secs" --fetcher_cache_dir="/tmp/Endpoint_SlaveEndpointTest_NoAuthorizer_1_44Thgu/fetch"
--fetcher_cache_size="2GB" --frameworks_home="" --gc_delay="1weeks" --gc_disk_headroom="0.1"
--hadoop_home="" --help="false" --hostname_lookup="true" --http_command_executor="false" --http_credentials="/tmp/Endpoint_SlaveEndpointTest_NoAuthorizer_1_44Thgu/http_credentials"
--http_heartbeat_interval="30secs" --initialize_driver_logging="true" --isolation="posix/cpu,posix/mem"
--launcher="posix" --launcher_dir="/mesos/mesos-1.4.0/_build/src" --logbufsecs="0" --logging_level="INFO"
--max_completed_executors_per_framework="150" --oversubscribed_resources_interval="15secs"
--perf_duration="10secs" --perf_interval="1mins" --port="5051" --qos_correction_interval_min="0ns"
--quiet="false" --recover="reconnect" --recovery_timeout="15mins" --registration_backoff_factor="10ms"
--resources="cpus:2;gpus:0;mem:1024;disk:1024;ports:[31000-32000]" --revocable_cpu_low_priority="true"
--runtime_dir="/tmp/Endpoint_SlaveEndpointTest_NoAuthorizer_1_44Thgu" --sandbox_directory="/mnt/mesos/sandbox"
--strict="true" --switch_user="true" --systemd_enable_support="true" --systemd_runtime_directory="/run/systemd/system"
--version="false" --work_dir="/tmp/Endpoint_SlaveEndpointTest_NoAuthorizer_1_5wGJbU"
I0529 15:42:00.639153  2968 credentials.hpp:86] Loading credential for authentication from
'/tmp/Endpoint_SlaveEndpointTest_NoAuthorizer_1_44Thgu/credential'
I0529 15:42:00.639308  2968 slave.cpp:265] Agent using credential for: test-principal
I0529 15:42:00.639331  2968 credentials.hpp:37] Loading credentials for authentication from
'/tmp/Endpoint_SlaveEndpointTest_NoAuthorizer_1_44Thgu/http_credentials'
I0529 15:42:00.639554  2968 http.cpp:975] Creating default 'basic' HTTP authenticator for
realm 'mesos-agent-readonly'
I0529 15:42:00.639689  2968 http.cpp:975] Creating default 'basic' HTTP authenticator for
realm 'mesos-agent-readwrite'
I0529 15:42:00.640831  2968 slave.cpp:536] Agent resources: cpus(*):2; mem(*):1024; disk(*):1024;
ports(*):[31000-32000]
I0529 15:42:00.640898  2968 slave.cpp:544] Agent attributes: [  ]
I0529 15:42:00.640918  2968 slave.cpp:549] Agent hostname: 8cc18b9ff0ef
I0529 15:42:00.641036  2980 status_update_manager.cpp:177] Pausing sending status updates
I0529 15:42:00.642251  2981 state.cpp:62] Recovering state from '/tmp/Endpoint_SlaveEndpointTest_NoAuthorizer_1_5wGJbU/meta'
I0529 15:42:00.642519  2975 status_update_manager.cpp:203] Recovering status update manager
I0529 15:42:00.642693  2967 containerizer.cpp:582] Recovering containerizer
I0529 15:42:00.643875  2970 provisioner.cpp:416] Provisioner recovery complete
I0529 15:42:00.644330  2975 slave.cpp:6083] Finished recovery
I0529 15:42:00.644775  2975 slave.cpp:6265] Querying resource estimator for oversubscribable
resources
I0529 15:42:00.645109  2971 slave.cpp:6279] Received oversubscribable resources {} from the
resource estimator
I0529 15:42:00.647146  2974 process.cpp:3730] Handling HTTP event for process 'slave(756)'
with path: '/slave(756)/monitor/statistics.json'
I0529 15:42:00.648669  2974 http.cpp:1115] HTTP GET for /slave(756)/monitor/statistics.json
from 172.17.0.3:33800
I0529 15:42:00.648746  2974 http.cpp:936] Authorizing principal 'test-principal' to GET the
'/monitor/statistics.json' endpoint
I0529 15:42:00.652041  2978 slave.cpp:801] Agent terminating
[       OK ] Endpoint/SlaveEndpointTest.NoAuthorizer/1 (29 ms)
[ RUN      ] Endpoint/SlaveEndpointTest.NoAuthorizer/2
I0529 15:42:00.670266  2949 containerizer.cpp:230] Using isolation: posix/cpu,posix/mem,filesystem/posix,network/cni,environment_secret
W0529 15:42:00.670686  2949 backend.cpp:76] Failed to create 'aufs' backend: AufsBackend requires
root privileges
W0529 15:42:00.670786  2949 backend.cpp:76] Failed to create 'bind' backend: BindBackend requires
root privileges
I0529 15:42:00.670824  2949 provisioner.cpp:255] Using default backend 'copy'
I0529 15:42:00.673132  2949 cluster.cpp:448] Creating default 'local' authorizer
I0529 15:42:00.675092  2969 slave.cpp:232] Mesos agent started on (757)@172.17.0.3:49913
I0529 15:42:00.675134  2969 slave.cpp:233] Flags at startup: --acls="" --appc_simple_discovery_uri_prefix="http://"
--appc_store_dir="/tmp/mesos/store/appc" --authenticate_http_readonly="true" --authenticate_http_readwrite="true"
--authenticatee="crammd5" --authentication_backoff_factor="1secs" --authorizer="local" --cgroups_cpu_enable_pids_and_tids_count="false"
--cgroups_enable_cfs="false" --cgroups_hierarchy="/sys/fs/cgroup" --cgroups_limit_swap="false"
--cgroups_root="mesos" --container_disk_watch_interval="15secs" --containerizers="mesos" --credential="/tmp/Endpoint_SlaveEndpointTest_NoAuthorizer_2_iTHkSO/credential"
--default_role="*" --disk_watch_interval="1mins" --docker="docker" --docker_kill_orphans="true"
--docker_registry="https://registry-1.docker.io" --docker_remove_delay="6hrs" --docker_socket="/var/run/docker.sock"
--docker_stop_timeout="0ns" --docker_store_dir="/tmp/mesos/store/docker" --docker_volume_checkpoint_dir="/var/run/mesos/isolators/docker/volume"
--enforce_container_disk_quota="false" --executor_registration_timeout="1mins" --executor_reregistration_timeout="2secs"
--executor_shutdown_grace_period="5secs" --fetcher_cache_dir="/tmp/Endpoint_SlaveEndpointTest_NoAuthorizer_2_iTHkSO/fetch"
--fetcher_cache_size="2GB" --frameworks_home="" --gc_delay="1weeks" --gc_disk_headroom="0.1"
--hadoop_home="" --help="false" --hostname_lookup="true" --http_command_executor="false" --http_credentials="/tmp/Endpoint_SlaveEndpointTest_NoAuthorizer_2_iTHkSO/http_credentials"
--http_heartbeat_interval="30secs" --initialize_driver_logging="true" --isolation="posix/cpu,posix/mem"
--launcher="posix" --launcher_dir="/mesos/mesos-1.4.0/_build/src" --logbufsecs="0" --logging_level="INFO"
--max_completed_executors_per_framework="150" --oversubscribed_resources_interval="15secs"
--perf_duration="10secs" --perf_interval="1mins" --port="5051" --qos_correction_interval_min="0ns"
--quiet="false" --recover="reconnect" --recovery_timeout="15mins" --registration_backoff_factor="10ms"
--resources="cpus:2;gpus:0;mem:1024;disk:1024;ports:[31000-32000]" --revocable_cpu_low_priority="true"
--runtime_dir="/tmp/Endpoint_SlaveEndpointTest_NoAuthorizer_2_iTHkSO" --sandbox_directory="/mnt/mesos/sandbox"
--strict="true" --switch_user="true" --systemd_enable_support="true" --systemd_runtime_directory="/run/systemd/system"
--version="false" --work_dir="/tmp/Endpoint_SlaveEndpointTest_NoAuthorizer_2_RBEOHe"
I0529 15:42:00.675606  2969 credentials.hpp:86] Loading credential for authentication from
'/tmp/Endpoint_SlaveEndpointTest_NoAuthorizer_2_iTHkSO/credential'
I0529 15:42:00.675827  2969 slave.cpp:265] Agent using credential for: test-principal
I0529 15:42:00.675855  2969 credentials.hpp:37] Loading credentials for authentication from
'/tmp/Endpoint_SlaveEndpointTest_NoAuthorizer_2_iTHkSO/http_credentials'
I0529 15:42:00.676139  2969 http.cpp:975] Creating default 'basic' HTTP authenticator for
realm 'mesos-agent-readonly'
I0529 15:42:00.676311  2969 http.cpp:975] Creating default 'basic' HTTP authenticator for
realm 'mesos-agent-readwrite'
I0529 15:42:00.677949  2969 slave.cpp:536] Agent resources: cpus(*):2; mem(*):1024; disk(*):1024;
ports(*):[31000-32000]
I0529 15:42:00.678051  2969 slave.cpp:544] Agent attributes: [  ]
I0529 15:42:00.678066  2969 slave.cpp:549] Agent hostname: 8cc18b9ff0ef
I0529 15:42:00.678217  2970 status_update_manager.cpp:177] Pausing sending status updates
I0529 15:42:00.679750  2973 state.cpp:62] Recovering state from '/tmp/Endpoint_SlaveEndpointTest_NoAuthorizer_2_RBEOHe/meta'
I0529 15:42:00.680096  2975 status_update_manager.cpp:203] Recovering status update manager
I0529 15:42:00.680327  2980 containerizer.cpp:582] Recovering containerizer
I0529 15:42:00.682080  2972 provisioner.cpp:416] Provisioner recovery complete
I0529 15:42:00.682600  2980 slave.cpp:6083] Finished recovery
I0529 15:42:00.683236  2980 slave.cpp:6265] Querying resource estimator for oversubscribable
resources
I0529 15:42:00.683554  2971 slave.cpp:6279] Received oversubscribable resources {} from the
resource estimator
I0529 15:42:00.685711  2977 process.cpp:3730] Handling HTTP event for process 'slave(757)'
with path: '/slave(757)/containers'
I0529 15:42:00.686827  2979 http.cpp:1115] HTTP GET for /slave(757)/containers from 172.17.0.3:33801
I0529 15:42:00.686897  2979 http.cpp:936] Authorizing principal 'test-principal' to GET the
'/containers' endpoint
I0529 15:42:00.689988  2973 slave.cpp:801] Agent terminating
[       OK ] Endpoint/SlaveEndpointTest.NoAuthorizer/2 (30 ms)
[----------] 9 tests from Endpoint/SlaveEndpointTest (288 ms total)

[----------] Global test environment tear-down
[==========] 1583 tests from 176 test cases ran. (568675 ms total)
[  PASSED  ] 1582 tests.
[  FAILED  ] 1 test, listed below:
[  FAILED  ] ExamplesTest.PythonFramework

 1 FAILED TEST
  YOU HAVE 22 DISABLED TESTS

E0529 15:42:00.763541  2983 process.cpp:950] Failed to accept socket: future discarded
make[4]: *** [check-local] Error 1
make[4]: Leaving directory `/mesos/mesos-1.4.0/_build/src'
make[3]: *** [check-am] Error 2
make[3]: Leaving directory `/mesos/mesos-1.4.0/_build/src'
make[2]: *** [check] Error 2
make[2]: Leaving directory `/mesos/mesos-1.4.0/_build/src'
make[1]: *** [check-recursive] Error 1
make[1]: Leaving directory `/mesos/mesos-1.4.0/_build'
make: *** [distcheck] Error 1
+ docker rmi mesos-1496069310-10554
Untagged: mesos-1496069310-10554:latest
Deleted: sha256:5b536f30778e78be3a64ad6beb77de0f876762d95827ee1fa3507f71ee68d3cb
Deleted: sha256:2a28f5c0ed2830f95d80674b6423736eb4d9d143d0dca53b6a8eae2db52246fb
Deleted: sha256:344c4186f745dd85bac02f30ee64030c842ebee10d8a5dbe83d599a734ecd1df
Deleted: sha256:ca5522899d440f49c498fbdf3238f573ca7554197cbaeccd4ae09a3e80812c7d
Deleted: sha256:a4445c5cade5da49850cc28830d8a873dddf26081c67aeab7fc761e8ac6a5a7e
Deleted: sha256:b743a31f018213cf011a99d4494664f92be6a713faee1cd7c2d25ba78809b2bc
Deleted: sha256:505fb043855d487bfff6c508151f19d952542c871e16662be008b3ba03098f3a
Deleted: sha256:1e16a0f5c32b3d99a2117656c59d4b428f6091012dd5efce810bdf4da67568ef
Deleted: sha256:ace6ecb29fe99082fea0e8f64fb634724145eb1aa85959a05363c77098e50435
Deleted: sha256:4962c01555ccdea4b5f8d6df40c46fc3975341765502afd8a5e4346484fd9416
Deleted: sha256:ac364125ce187756e776981964b160d8e52f64f81a3926ffa0b3f8aceafdfc9b
Deleted: sha256:7a9e8c92899c2fab69e9328e7fcd5b62563db1618ea60cd04eec95172d9d0472
Deleted: sha256:35adf77ebefc3e863876fb78abf19a6787192cd28fd7b6437f71598658886af9
Deleted: sha256:2162dafcfb5578c6bf31a851a8f9dfcc1f21f3af06f0e6e0835a809efebd35c6
Deleted: sha256:82bcde704f7fbb93b94af172944983a65aed436d41aedbcc1008825d2b378a42
Deleted: sha256:59a9677b8e7d07fa012e33456ffe585a88a83d9ba99628b0f2d19afaabaf6531
Deleted: sha256:6e61bc974292ca568c3b62900301f1cb4e57d386ac48d7f25b0164d931a9d895
Deleted: sha256:d1be4571af3a87862f53a6d6559a58966002cb041b33f0bf5ad93644030f9200
Deleted: sha256:35ddbb7aa3b82be90671b578f10a9633c48864768dd44ffbeff5966e4b2ab637
Deleted: sha256:f1391316a5c4e61f76542436216a1a21cc0f44c076ff33a23d1e033bd2480743
Deleted: sha256:bbd8269c67369334d567c4f4f03df9134783a1548839dcf412594d7199f145ba
Deleted: sha256:33e40fc3f2b843d2ebff556cc81fab7903b1bde2b228e84e60c8e73d79626535
Deleted: sha256:1b56853229db89ba3f1a40f3f61a88a327ff10317ab1ba423aaf5f0218562100
Deleted: sha256:b6ad41ad5c2b335b4d0a338b176d80f97e2663e7a953d13435461befc49f4056
Build step 'Execute shell' marked build as failure
Not sending mail to unregistered user neil.conway@gmail.com

Mime
View raw message