mesos-builds mailing list archives

Site index · List index
Message view « Date » · « Thread »
Top « Date » · « Thread »
From Apache Jenkins Server <jenk...@builds.apache.org>
Subject Build failed in Jenkins: Mesos-Buildbot » cmake,clang,--verbose,GLOG_v=1 MESOS_VERBOSE=1,ubuntu:14.04,(docker||Hadoop)&&(!ubuntu-us1)&&(!ubuntu-eu2) #3719
Date Wed, 24 May 2017 18:54:52 GMT
See <https://builds.apache.org/job/Mesos-Buildbot/BUILDTOOL=cmake,COMPILER=clang,CONFIGURATION=--verbose,ENVIRONMENT=GLOG_v=1%20MESOS_VERBOSE=1,OS=ubuntu%3A14.04,label_exp=(docker%7C%7CHadoop)&&(!ubuntu-us1)&&(!ubuntu-eu2)/3719/display/redirect?page=changes>

Changes:

[neil.conway] Renamed RegisterAgent.agent to RegisterAgent.agents in acls.proto.

------------------------------------------
[...truncated 24.71 MB...]
I0524 18:54:47.083788 23973 http.cpp:936] Authorizing principal 'test-principal' to GET the
'/monitor/statistics.json' endpoint
I0524 18:54:47.085129 23975 slave.cpp:790] Agent terminating
[       OK ] Endpoint/SlaveEndpointTest.AuthorizedRequest/1 (13 ms)
[ RUN      ] Endpoint/SlaveEndpointTest.AuthorizedRequest/2
I0524 18:54:47.094462 23967 containerizer.cpp:221] Using isolation: posix/cpu,posix/mem,filesystem/posix,network/cni
W0524 18:54:47.094799 23967 backend.cpp:76] Failed to create 'aufs' backend: AufsBackend requires
root privileges
W0524 18:54:47.094841 23967 backend.cpp:76] Failed to create 'bind' backend: BindBackend requires
root privileges
I0524 18:54:47.094856 23967 provisioner.cpp:249] Using default backend 'copy'
I0524 18:54:47.096098 23973 slave.cpp:225] Mesos agent started on (737)@172.17.0.2:49070
I0524 18:54:47.096123 23973 slave.cpp:226] Flags at startup: --acls="" --appc_simple_discovery_uri_prefix="http://"
--appc_store_dir="/tmp/mesos/store/appc" --authenticate_http_readonly="true" --authenticate_http_readwrite="true"
--authenticatee="crammd5" --authentication_backoff_factor="1secs" --authorizer="local" --cgroups_cpu_enable_pids_and_tids_count="false"
--cgroups_enable_cfs="false" --cgroups_hierarchy="/sys/fs/cgroup" --cgroups_limit_swap="false"
--cgroups_root="mesos" --container_disk_watch_interval="15secs" --containerizers="mesos" --credential="/tmp/Endpoint_SlaveEndpointTest_AuthorizedRequest_2_VRKla3/credential"
--default_role="*" --disk_watch_interval="1mins" --docker="docker" --docker_kill_orphans="true"
--docker_registry="https://registry-1.docker.io" --docker_remove_delay="6hrs" --docker_socket="/var/run/docker.sock"
--docker_stop_timeout="0ns" --docker_store_dir="/tmp/mesos/store/docker" --docker_volume_checkpoint_dir="/var/run/mesos/isolators/docker/volume"
--enforce_container_disk_quota="false" --executor_registration_timeout="1mins" --executor_shutdown_grace_period="5secs"
--fetcher_cache_dir="/tmp/Endpoint_SlaveEndpointTest_AuthorizedRequest_2_VRKla3/fetch" --fetcher_cache_size="2GB"
--frameworks_home="" --gc_delay="1weeks" --gc_disk_headroom="0.1" --hadoop_home="" --help="false"
--hostname_lookup="true" --http_command_executor="false" --http_credentials="/tmp/Endpoint_SlaveEndpointTest_AuthorizedRequest_2_VRKla3/http_credentials"
--http_heartbeat_interval="30secs" --initialize_driver_logging="true" --isolation="posix/cpu,posix/mem"
--launcher="posix" --launcher_dir="/mesos/build/src" --logbufsecs="0" --logging_level="INFO"
--max_completed_executors_per_framework="150" --oversubscribed_resources_interval="15secs"
--perf_duration="10secs" --perf_interval="1mins" --port="5051" --qos_correction_interval_min="0ns"
--quiet="false" --recover="reconnect" --recovery_timeout="15mins" --registration_backoff_factor="10ms"
--resources="cpus:2;gpus:0;mem:1024;disk:1024;ports:[31000-32000]" --revocable_cpu_low_priority="true"
--runtime_dir="/tmp/Endpoint_SlaveEndpointTest_AuthorizedRequest_2_VRKla3" --sandbox_directory="/mnt/mesos/sandbox"
--strict="true" --switch_user="true" --systemd_enable_support="true" --systemd_runtime_directory="/run/systemd/system"
--version="false" --work_dir="/tmp/Endpoint_SlaveEndpointTest_AuthorizedRequest_2_ScqTBF"
I0524 18:54:47.096379 23973 credentials.hpp:86] Loading credential for authentication from
'/tmp/Endpoint_SlaveEndpointTest_AuthorizedRequest_2_VRKla3/credential'
I0524 18:54:47.096489 23973 slave.cpp:258] Agent using credential for: test-principal
I0524 18:54:47.096509 23973 credentials.hpp:37] Loading credentials for authentication from
'/tmp/Endpoint_SlaveEndpointTest_AuthorizedRequest_2_VRKla3/http_credentials'
I0524 18:54:47.096660 23973 http.cpp:975] Creating default 'basic' HTTP authenticator for
realm 'mesos-agent-readonly'
I0524 18:54:47.096729 23973 http.cpp:975] Creating default 'basic' HTTP authenticator for
realm 'mesos-agent-readwrite'
I0524 18:54:47.097323 23973 slave.cpp:525] Agent resources: cpus(*):2; mem(*):1024; disk(*):1024;
ports(*):[31000-32000]
I0524 18:54:47.097368 23973 slave.cpp:533] Agent attributes: [  ]
I0524 18:54:47.097378 23973 slave.cpp:538] Agent hostname: 8468ccc58d1d
I0524 18:54:47.097482 23982 status_update_manager.cpp:177] Pausing sending status updates
I0524 18:54:47.097807 23982 state.cpp:62] Recovering state from '/tmp/Endpoint_SlaveEndpointTest_AuthorizedRequest_2_ScqTBF/meta'
I0524 18:54:47.097959 23973 status_update_manager.cpp:203] Recovering status update manager
I0524 18:54:47.098142 23975 containerizer.cpp:608] Recovering containerizer
I0524 18:54:47.098773 23980 provisioner.cpp:410] Provisioner recovery complete
I0524 18:54:47.099041 23979 slave.cpp:5970] Finished recovery
I0524 18:54:47.099416 23979 slave.cpp:6152] Querying resource estimator for oversubscribable
resources
I0524 18:54:47.099648 23980 slave.cpp:6166] Received oversubscribable resources {} from the
resource estimator
I0524 18:54:47.100301 23976 process.cpp:3731] Handling HTTP event for process 'slave(737)'
with path: '/slave(737)/containers'
I0524 18:54:47.100726 23974 http.cpp:1115] HTTP GET for /slave(737)/containers from 172.17.0.2:44209
I0524 18:54:47.100765 23974 http.cpp:936] Authorizing principal 'test-principal' to GET the
'/containers' endpoint
I0524 18:54:47.102242 23982 slave.cpp:790] Agent terminating
[       OK ] Endpoint/SlaveEndpointTest.AuthorizedRequest/2 (12 ms)
[ RUN      ] Endpoint/SlaveEndpointTest.UnauthorizedRequest/0
I0524 18:54:47.117101 23967 containerizer.cpp:221] Using isolation: posix/cpu,posix/mem,filesystem/posix,network/cni
W0524 18:54:47.117473 23967 backend.cpp:76] Failed to create 'aufs' backend: AufsBackend requires
root privileges
W0524 18:54:47.117514 23967 backend.cpp:76] Failed to create 'bind' backend: BindBackend requires
root privileges
I0524 18:54:47.117532 23967 provisioner.cpp:249] Using default backend 'copy'
I0524 18:54:47.118795 23969 slave.cpp:225] Mesos agent started on (738)@172.17.0.2:49070
I0524 18:54:47.118832 23969 slave.cpp:226] Flags at startup: --acls="" --appc_simple_discovery_uri_prefix="http://"
--appc_store_dir="/tmp/mesos/store/appc" --authenticate_http_readonly="true" --authenticate_http_readwrite="true"
--authenticatee="crammd5" --authentication_backoff_factor="1secs" --authorizer="local" --cgroups_cpu_enable_pids_and_tids_count="false"
--cgroups_enable_cfs="false" --cgroups_hierarchy="/sys/fs/cgroup" --cgroups_limit_swap="false"
--cgroups_root="mesos" --container_disk_watch_interval="15secs" --containerizers="mesos" --credential="/tmp/Endpoint_SlaveEndpointTest_UnauthorizedRequest_0_PNIVzz/credential"
--default_role="*" --disk_watch_interval="1mins" --docker="docker" --docker_kill_orphans="true"
--docker_registry="https://registry-1.docker.io" --docker_remove_delay="6hrs" --docker_socket="/var/run/docker.sock"
--docker_stop_timeout="0ns" --docker_store_dir="/tmp/mesos/store/docker" --docker_volume_checkpoint_dir="/var/run/mesos/isolators/docker/volume"
--enforce_container_disk_quota="false" --executor_registration_timeout="1mins" --executor_shutdown_grace_period="5secs"
--fetcher_cache_dir="/tmp/Endpoint_SlaveEndpointTest_UnauthorizedRequest_0_PNIVzz/fetch" --fetcher_cache_size="2GB"
--frameworks_home="" --gc_delay="1weeks" --gc_disk_headroom="0.1" --hadoop_home="" --help="false"
--hostname_lookup="true" --http_command_executor="false" --http_credentials="/tmp/Endpoint_SlaveEndpointTest_UnauthorizedRequest_0_PNIVzz/http_credentials"
--http_heartbeat_interval="30secs" --initialize_driver_logging="true" --isolation="posix/cpu,posix/mem"
--launcher="posix" --launcher_dir="/mesos/build/src" --logbufsecs="0" --logging_level="INFO"
--max_completed_executors_per_framework="150" --oversubscribed_resources_interval="15secs"
--perf_duration="10secs" --perf_interval="1mins" --port="5051" --qos_correction_interval_min="0ns"
--quiet="false" --recover="reconnect" --recovery_timeout="15mins" --registration_backoff_factor="10ms"
--resources="cpus:2;gpus:0;mem:1024;disk:1024;ports:[31000-32000]" --revocable_cpu_low_priority="true"
--runtime_dir="/tmp/Endpoint_SlaveEndpointTest_UnauthorizedRequest_0_PNIVzz" --sandbox_directory="/mnt/mesos/sandbox"
--strict="true" --switch_user="true" --systemd_enable_support="true" --systemd_runtime_directory="/run/systemd/system"
--version="false" --work_dir="/tmp/Endpoint_SlaveEndpointTest_UnauthorizedRequest_0_2k5OXb"
I0524 18:54:47.119087 23969 credentials.hpp:86] Loading credential for authentication from
'/tmp/Endpoint_SlaveEndpointTest_UnauthorizedRequest_0_PNIVzz/credential'
I0524 18:54:47.119225 23969 slave.cpp:258] Agent using credential for: test-principal
I0524 18:54:47.119240 23969 credentials.hpp:37] Loading credentials for authentication from
'/tmp/Endpoint_SlaveEndpointTest_UnauthorizedRequest_0_PNIVzz/http_credentials'
I0524 18:54:47.119352 23969 http.cpp:975] Creating default 'basic' HTTP authenticator for
realm 'mesos-agent-readonly'
I0524 18:54:47.119441 23969 http.cpp:975] Creating default 'basic' HTTP authenticator for
realm 'mesos-agent-readwrite'
I0524 18:54:47.120033 23969 slave.cpp:525] Agent resources: cpus(*):2; mem(*):1024; disk(*):1024;
ports(*):[31000-32000]
I0524 18:54:47.120096 23969 slave.cpp:533] Agent attributes: [  ]
I0524 18:54:47.120112 23969 slave.cpp:538] Agent hostname: 8468ccc58d1d
I0524 18:54:47.120249 23970 status_update_manager.cpp:177] Pausing sending status updates
I0524 18:54:47.120649 23969 state.cpp:62] Recovering state from '/tmp/Endpoint_SlaveEndpointTest_UnauthorizedRequest_0_2k5OXb/meta'
I0524 18:54:47.121119 23975 status_update_manager.cpp:203] Recovering status update manager
I0524 18:54:47.121423 23983 containerizer.cpp:608] Recovering containerizer
I0524 18:54:47.122231 23973 provisioner.cpp:410] Provisioner recovery complete
I0524 18:54:47.122452 23974 slave.cpp:5970] Finished recovery
I0524 18:54:47.123006 23974 slave.cpp:6152] Querying resource estimator for oversubscribable
resources
I0524 18:54:47.123229 23979 slave.cpp:6166] Received oversubscribable resources {} from the
resource estimator
I0524 18:54:47.124078 23974 process.cpp:3731] Handling HTTP event for process 'slave(738)'
with path: '/slave(738)/monitor/statistics'
I0524 18:54:47.124547 23977 http.cpp:1115] HTTP GET for /slave(738)/monitor/statistics from
172.17.0.2:44210
I0524 18:54:47.124585 23977 http.cpp:936] Authorizing principal 'test-principal' to GET the
'/monitor/statistics' endpoint
I0524 18:54:47.125336 23970 slave.cpp:790] Agent terminating
[       OK ] Endpoint/SlaveEndpointTest.UnauthorizedRequest/0 (13 ms)
[ RUN      ] Endpoint/SlaveEndpointTest.UnauthorizedRequest/1
I0524 18:54:47.139150 23967 containerizer.cpp:221] Using isolation: posix/cpu,posix/mem,filesystem/posix,network/cni
W0524 18:54:47.139408 23967 backend.cpp:76] Failed to create 'aufs' backend: AufsBackend requires
root privileges
W0524 18:54:47.139451 23967 backend.cpp:76] Failed to create 'bind' backend: BindBackend requires
root privileges
I0524 18:54:47.139462 23967 provisioner.cpp:249] Using default backend 'copy'
I0524 18:54:47.140712 23968 slave.cpp:225] Mesos agent started on (739)@172.17.0.2:49070
I0524 18:54:47.140743 23968 slave.cpp:226] Flags at startup: --acls="" --appc_simple_discovery_uri_prefix="http://"
--appc_store_dir="/tmp/mesos/store/appc" --authenticate_http_readonly="true" --authenticate_http_readwrite="true"
--authenticatee="crammd5" --authentication_backoff_factor="1secs" --authorizer="local" --cgroups_cpu_enable_pids_and_tids_count="false"
--cgroups_enable_cfs="false" --cgroups_hierarchy="/sys/fs/cgroup" --cgroups_limit_swap="false"
--cgroups_root="mesos" --container_disk_watch_interval="15secs" --containerizers="mesos" --credential="/tmp/Endpoint_SlaveEndpointTest_UnauthorizedRequest_1_XLbde6/credential"
--default_role="*" --disk_watch_interval="1mins" --docker="docker" --docker_kill_orphans="true"
--docker_registry="https://registry-1.docker.io" --docker_remove_delay="6hrs" --docker_socket="/var/run/docker.sock"
--docker_stop_timeout="0ns" --docker_store_dir="/tmp/mesos/store/docker" --docker_volume_checkpoint_dir="/var/run/mesos/isolators/docker/volume"
--enforce_container_disk_quota="false" --executor_registration_timeout="1mins" --executor_shutdown_grace_period="5secs"
--fetcher_cache_dir="/tmp/Endpoint_SlaveEndpointTest_UnauthorizedRequest_1_XLbde6/fetch" --fetcher_cache_size="2GB"
--frameworks_home="" --gc_delay="1weeks" --gc_disk_headroom="0.1" --hadoop_home="" --help="false"
--hostname_lookup="true" --http_command_executor="false" --http_credentials="/tmp/Endpoint_SlaveEndpointTest_UnauthorizedRequest_1_XLbde6/http_credentials"
--http_heartbeat_interval="30secs" --initialize_driver_logging="true" --isolation="posix/cpu,posix/mem"
--launcher="posix" --launcher_dir="/mesos/build/src" --logbufsecs="0" --logging_level="INFO"
--max_completed_executors_per_framework="150" --oversubscribed_resources_interval="15secs"
--perf_duration="10secs" --perf_interval="1mins" --port="5051" --qos_correction_interval_min="0ns"
--quiet="false" --recover="reconnect" --recovery_timeout="15mins" --registration_backoff_factor="10ms"
--resources="cpus:2;gpus:0;mem:1024;disk:1024;ports:[31000-32000]" --revocable_cpu_low_priority="true"
--runtime_dir="/tmp/Endpoint_SlaveEndpointTest_UnauthorizedRequest_1_XLbde6" --sandbox_directory="/mnt/mesos/sandbox"
--strict="true" --switch_user="true" --systemd_enable_support="true" --systemd_runtime_directory="/run/systemd/system"
--version="false" --work_dir="/tmp/Endpoint_SlaveEndpointTest_UnauthorizedRequest_1_yT4tyI"
I0524 18:54:47.141068 23968 credentials.hpp:86] Loading credential for authentication from
'/tmp/Endpoint_SlaveEndpointTest_UnauthorizedRequest_1_XLbde6/credential'
I0524 18:54:47.141235 23968 slave.cpp:258] Agent using credential for: test-principal
I0524 18:54:47.141247 23968 credentials.hpp:37] Loading credentials for authentication from
'/tmp/Endpoint_SlaveEndpointTest_UnauthorizedRequest_1_XLbde6/http_credentials'
I0524 18:54:47.141340 23968 http.cpp:975] Creating default 'basic' HTTP authenticator for
realm 'mesos-agent-readonly'
I0524 18:54:47.141394 23968 http.cpp:975] Creating default 'basic' HTTP authenticator for
realm 'mesos-agent-readwrite'
I0524 18:54:47.141777 23968 slave.cpp:525] Agent resources: cpus(*):2; mem(*):1024; disk(*):1024;
ports(*):[31000-32000]
I0524 18:54:47.141808 23968 slave.cpp:533] Agent attributes: [  ]
I0524 18:54:47.141813 23968 slave.cpp:538] Agent hostname: 8468ccc58d1d
I0524 18:54:47.141871 23975 status_update_manager.cpp:177] Pausing sending status updates
I0524 18:54:47.142228 23982 state.cpp:62] Recovering state from '/tmp/Endpoint_SlaveEndpointTest_UnauthorizedRequest_1_yT4tyI/meta'
I0524 18:54:47.142406 23973 status_update_manager.cpp:203] Recovering status update manager
I0524 18:54:47.142520 23969 containerizer.cpp:608] Recovering containerizer
I0524 18:54:47.142992 23971 provisioner.cpp:410] Provisioner recovery complete
I0524 18:54:47.143185 23978 slave.cpp:5970] Finished recovery
I0524 18:54:47.143617 23978 slave.cpp:6152] Querying resource estimator for oversubscribable
resources
I0524 18:54:47.143790 23974 slave.cpp:6166] Received oversubscribable resources {} from the
resource estimator
I0524 18:54:47.144678 23983 process.cpp:3731] Handling HTTP event for process 'slave(739)'
with path: '/slave(739)/monitor/statistics.json'
I0524 18:54:47.145141 23974 http.cpp:1115] HTTP GET for /slave(739)/monitor/statistics.json
from 172.17.0.2:44211
I0524 18:54:47.145200 23974 http.cpp:936] Authorizing principal 'test-principal' to GET the
'/monitor/statistics.json' endpoint
I0524 18:54:47.146169 23977 slave.cpp:790] Agent terminating
[       OK ] Endpoint/SlaveEndpointTest.UnauthorizedRequest/1 (12 ms)
[ RUN      ] Endpoint/SlaveEndpointTest.UnauthorizedRequest/2
I0524 18:54:47.157517 23967 containerizer.cpp:221] Using isolation: posix/cpu,posix/mem,filesystem/posix,network/cni
W0524 18:54:47.157840 23967 backend.cpp:76] Failed to create 'aufs' backend: AufsBackend requires
root privileges
W0524 18:54:47.157884 23967 backend.cpp:76] Failed to create 'bind' backend: BindBackend requires
root privileges
I0524 18:54:47.157899 23967 provisioner.cpp:249] Using default backend 'copy'
I0524 18:54:47.158924 23972 slave.cpp:225] Mesos agent started on (740)@172.17.0.2:49070
I0524 18:54:47.158952 23972 slave.cpp:226] Flags at startup: --acls="" --appc_simple_discovery_uri_prefix="http://"
--appc_store_dir="/tmp/mesos/store/appc" --authenticate_http_readonly="true" --authenticate_http_readwrite="true"
--authenticatee="crammd5" --authentication_backoff_factor="1secs" --authorizer="local" --cgroups_cpu_enable_pids_and_tids_count="false"
--cgroups_enable_cfs="false" --cgroups_hierarchy="/sys/fs/cgroup" --cgroups_limit_swap="false"
--cgroups_root="mesos" --container_disk_watch_interval="15secs" --containerizers="mesos" --credential="/tmp/Endpoint_SlaveEndpointTest_UnauthorizedRequest_2_vKDH4C/credential"
--default_role="*" --disk_watch_interval="1mins" --docker="docker" --docker_kill_orphans="true"
--docker_registry="https://registry-1.docker.io" --docker_remove_delay="6hrs" --docker_socket="/var/run/docker.sock"
--docker_stop_timeout="0ns" --docker_store_dir="/tmp/mesos/store/docker" --docker_volume_checkpoint_dir="/var/run/mesos/isolators/docker/volume"
--enforce_container_disk_quota="false" --executor_registration_timeout="1mins" --executor_shutdown_grace_period="5secs"
--fetcher_cache_dir="/tmp/Endpoint_SlaveEndpointTest_UnauthorizedRequest_2_vKDH4C/fetch" --fetcher_cache_size="2GB"
--frameworks_home="" --gc_delay="1weeks" --gc_disk_headroom="0.1" --hadoop_home="" --help="false"
--hostname_lookup="true" --http_command_executor="false" --http_credentials="/tmp/Endpoint_SlaveEndpointTest_UnauthorizedRequest_2_vKDH4C/http_credentials"
--http_heartbeat_interval="30secs" --initialize_driver_logging="true" --isolation="posix/cpu,posix/mem"
--launcher="posix" --launcher_dir="/mesos/build/src" --logbufsecs="0" --logging_level="INFO"
--max_completed_executors_per_framework="150" --oversubscribed_resources_interval="15secs"
--perf_duration="10secs" --perf_interval="1mins" --port="5051" --qos_correction_interval_min="0ns"
--quiet="false" --recover="reconnect" --recovery_timeout="15mins" --registration_backoff_factor="10ms"
--resources="cpus:2;gpus:0;mem:1024;disk:1024;ports:[31000-32000]" --revocable_cpu_low_priority="true"
--runtime_dir="/tmp/Endpoint_SlaveEndpointTest_UnauthorizedRequest_2_vKDH4C" --sandbox_directory="/mnt/mesos/sandbox"
--strict="true" --switch_user="true" --systemd_enable_support="true" --systemd_runtime_directory="/run/systemd/system"
--version="false" --work_dir="/tmp/Endpoint_SlaveEndpointTest_UnauthorizedRequest_2_Eye1lf"
I0524 18:54:47.159207 23972 credentials.hpp:86] Loading credential for authentication from
'/tmp/Endpoint_SlaveEndpointTest_UnauthorizedRequest_2_vKDH4C/credential'
I0524 18:54:47.159319 23972 slave.cpp:258] Agent using credential for: test-principal
I0524 18:54:47.159337 23972 credentials.hpp:37] Loading credentials for authentication from
'/tmp/Endpoint_SlaveEndpointTest_UnauthorizedRequest_2_vKDH4C/http_credentials'
I0524 18:54:47.159478 23972 http.cpp:975] Creating default 'basic' HTTP authenticator for
realm 'mesos-agent-readonly'
I0524 18:54:47.159533 23972 http.cpp:975] Creating default 'basic' HTTP authenticator for
realm 'mesos-agent-readwrite'
I0524 18:54:47.159963 23972 slave.cpp:525] Agent resources: cpus(*):2; mem(*):1024; disk(*):1024;
ports(*):[31000-32000]
I0524 18:54:47.160006 23972 slave.cpp:533] Agent attributes: [  ]
I0524 18:54:47.160012 23972 slave.cpp:538] Agent hostname: 8468ccc58d1d
I0524 18:54:47.160089 23974 status_update_manager.cpp:177] Pausing sending status updates
I0524 18:54:47.160401 23982 state.cpp:62] Recovering state from '/tmp/Endpoint_SlaveEndpointTest_UnauthorizedRequest_2_Eye1lf/meta'
I0524 18:54:47.160537 23971 status_update_manager.cpp:203] Recovering status update manager
I0524 18:54:47.160684 23977 containerizer.cpp:608] Recovering containerizer
I0524 18:54:47.161193 23977 provisioner.cpp:410] Provisioner recovery complete
I0524 18:54:47.161360 23972 slave.cpp:5970] Finished recovery
I0524 18:54:47.161717 23972 slave.cpp:6152] Querying resource estimator for oversubscribable
resources
I0524 18:54:47.161816 23977 slave.cpp:6166] Received oversubscribable resources {} from the
resource estimator
I0524 18:54:47.162410 23980 process.cpp:3731] Handling HTTP event for process 'slave(740)'
with path: '/slave(740)/containers'
I0524 18:54:47.162840 23973 http.cpp:1115] HTTP GET for /slave(740)/containers from 172.17.0.2:44212
I0524 18:54:47.162871 23973 http.cpp:936] Authorizing principal 'test-principal' to GET the
'/containers' endpoint
I0524 18:54:47.163743 23976 slave.cpp:790] Agent terminating
[       OK ] Endpoint/SlaveEndpointTest.UnauthorizedRequest/2 (11 ms)
[ RUN      ] Endpoint/SlaveEndpointTest.NoAuthorizer/0
I0524 18:54:47.173457 23967 containerizer.cpp:221] Using isolation: posix/cpu,posix/mem,filesystem/posix,network/cni
W0524 18:54:47.173787 23967 backend.cpp:76] Failed to create 'aufs' backend: AufsBackend requires
root privileges
W0524 18:54:47.173836 23967 backend.cpp:76] Failed to create 'bind' backend: BindBackend requires
root privileges
I0524 18:54:47.173851 23967 provisioner.cpp:249] Using default backend 'copy'
I0524 18:54:47.174455 23967 cluster.cpp:448] Creating default 'local' authorizer
I0524 18:54:47.174896 23974 slave.cpp:225] Mesos agent started on (741)@172.17.0.2:49070
I0524 18:54:47.174923 23974 slave.cpp:226] Flags at startup: --acls="" --appc_simple_discovery_uri_prefix="http://"
--appc_store_dir="/tmp/mesos/store/appc" --authenticate_http_readonly="true" --authenticate_http_readwrite="true"
--authenticatee="crammd5" --authentication_backoff_factor="1secs" --authorizer="local" --cgroups_cpu_enable_pids_and_tids_count="false"
--cgroups_enable_cfs="false" --cgroups_hierarchy="/sys/fs/cgroup" --cgroups_limit_swap="false"
--cgroups_root="mesos" --container_disk_watch_interval="15secs" --containerizers="mesos" --credential="/tmp/Endpoint_SlaveEndpointTest_NoAuthorizer_0_P9D459/credential"
--default_role="*" --disk_watch_interval="1mins" --docker="docker" --docker_kill_orphans="true"
--docker_registry="https://registry-1.docker.io" --docker_remove_delay="6hrs" --docker_socket="/var/run/docker.sock"
--docker_stop_timeout="0ns" --docker_store_dir="/tmp/mesos/store/docker" --docker_volume_checkpoint_dir="/var/run/mesos/isolators/docker/volume"
--enforce_container_disk_quota="false" --executor_registration_timeout="1mins" --executor_shutdown_grace_period="5secs"
--fetcher_cache_dir="/tmp/Endpoint_SlaveEndpointTest_NoAuthorizer_0_P9D459/fetch" --fetcher_cache_size="2GB"
--frameworks_home="" --gc_delay="1weeks" --gc_disk_headroom="0.1" --hadoop_home="" --help="false"
--hostname_lookup="true" --http_command_executor="false" --http_credentials="/tmp/Endpoint_SlaveEndpointTest_NoAuthorizer_0_P9D459/http_credentials"
--http_heartbeat_interval="30secs" --initialize_driver_logging="true" --isolation="posix/cpu,posix/mem"
--launcher="posix" --launcher_dir="/mesos/build/src" --logbufsecs="0" --logging_level="INFO"
--max_completed_executors_per_framework="150" --oversubscribed_resources_interval="15secs"
--perf_duration="10secs" --perf_interval="1mins" --port="5051" --qos_correction_interval_min="0ns"
--quiet="false" --recover="reconnect" --recovery_timeout="15mins" --registration_backoff_factor="10ms"
--resources="cpus:2;gpus:0;mem:1024;disk:1024;ports:[31000-32000]" --revocable_cpu_low_priority="true"
--runtime_dir="/tmp/Endpoint_SlaveEndpointTest_NoAuthorizer_0_P9D459" --sandbox_directory="/mnt/mesos/sandbox"
--strict="true" --switch_user="true" --systemd_enable_support="true" --systemd_runtime_directory="/run/systemd/system"
--version="false" --work_dir="/tmp/Endpoint_SlaveEndpointTest_NoAuthorizer_0_6lrLkM"
I0524 18:54:47.175142 23974 credentials.hpp:86] Loading credential for authentication from
'/tmp/Endpoint_SlaveEndpointTest_NoAuthorizer_0_P9D459/credential'
I0524 18:54:47.175233 23974 slave.cpp:258] Agent using credential for: test-principal
I0524 18:54:47.175249 23974 credentials.hpp:37] Loading credentials for authentication from
'/tmp/Endpoint_SlaveEndpointTest_NoAuthorizer_0_P9D459/http_credentials'
I0524 18:54:47.175361 23974 http.cpp:975] Creating default 'basic' HTTP authenticator for
realm 'mesos-agent-readonly'
I0524 18:54:47.175406 23974 http.cpp:975] Creating default 'basic' HTTP authenticator for
realm 'mesos-agent-readwrite'
I0524 18:54:47.175706 23974 slave.cpp:525] Agent resources: cpus(*):2; mem(*):1024; disk(*):1024;
ports(*):[31000-32000]
I0524 18:54:47.175736 23974 slave.cpp:533] Agent attributes: [  ]
I0524 18:54:47.175741 23974 slave.cpp:538] Agent hostname: 8468ccc58d1d
I0524 18:54:47.175803 23968 status_update_manager.cpp:177] Pausing sending status updates
I0524 18:54:47.176074 23972 state.cpp:62] Recovering state from '/tmp/Endpoint_SlaveEndpointTest_NoAuthorizer_0_6lrLkM/meta'
I0524 18:54:47.176178 23972 status_update_manager.cpp:203] Recovering status update manager
I0524 18:54:47.176280 23976 containerizer.cpp:608] Recovering containerizer
I0524 18:54:47.176718 23971 provisioner.cpp:410] Provisioner recovery complete
I0524 18:54:47.176887 23979 slave.cpp:5970] Finished recovery
I0524 18:54:47.177201 23979 slave.cpp:6152] Querying resource estimator for oversubscribable
resources
I0524 18:54:47.177397 23971 slave.cpp:6166] Received oversubscribable resources {} from the
resource estimator
I0524 18:54:47.177901 23975 process.cpp:3731] Handling HTTP event for process 'slave(741)'
with path: '/slave(741)/monitor/statistics'
I0524 18:54:47.178261 23972 http.cpp:1115] HTTP GET for /slave(741)/monitor/statistics from
172.17.0.2:44213
I0524 18:54:47.178293 23972 http.cpp:936] Authorizing principal 'test-principal' to GET the
'/monitor/statistics' endpoint
I0524 18:54:47.179589 23977 slave.cpp:790] Agent terminating
[       OK ] Endpoint/SlaveEndpointTest.NoAuthorizer/0 (10 ms)
[ RUN      ] Endpoint/SlaveEndpointTest.NoAuthorizer/1
I0524 18:54:47.183588 23967 containerizer.cpp:221] Using isolation: posix/cpu,posix/mem,filesystem/posix,network/cni
W0524 18:54:47.183853 23967 backend.cpp:76] Failed to create 'aufs' backend: AufsBackend requires
root privileges
W0524 18:54:47.183884 23967 backend.cpp:76] Failed to create 'bind' backend: BindBackend requires
root privileges
I0524 18:54:47.183894 23967 provisioner.cpp:249] Using default backend 'copy'
I0524 18:54:47.184381 23967 cluster.cpp:448] Creating default 'local' authorizer
I0524 18:54:47.184975 23973 slave.cpp:225] Mesos agent started on (742)@172.17.0.2:49070
I0524 18:54:47.185009 23973 slave.cpp:226] Flags at startup: --acls="" --appc_simple_discovery_uri_prefix="http://"
--appc_store_dir="/tmp/mesos/store/appc" --authenticate_http_readonly="true" --authenticate_http_readwrite="true"
--authenticatee="crammd5" --authentication_backoff_factor="1secs" --authorizer="local" --cgroups_cpu_enable_pids_and_tids_count="false"
--cgroups_enable_cfs="false" --cgroups_hierarchy="/sys/fs/cgroup" --cgroups_limit_swap="false"
--cgroups_root="mesos" --container_disk_watch_interval="15secs" --containerizers="mesos" --credential="/tmp/Endpoint_SlaveEndpointTest_NoAuthorizer_1_rXaZeH/credential"
--default_role="*" --disk_watch_interval="1mins" --docker="docker" --docker_kill_orphans="true"
--docker_registry="https://registry-1.docker.io" --docker_remove_delay="6hrs" --docker_socket="/var/run/docker.sock"
--docker_stop_timeout="0ns" --docker_store_dir="/tmp/mesos/store/docker" --docker_volume_checkpoint_dir="/var/run/mesos/isolators/docker/volume"
--enforce_container_disk_quota="false" --executor_registration_timeout="1mins" --executor_shutdown_grace_period="5secs"
--fetcher_cache_dir="/tmp/Endpoint_SlaveEndpointTest_NoAuthorizer_1_rXaZeH/fetch" --fetcher_cache_size="2GB"
--frameworks_home="" --gc_delay="1weeks" --gc_disk_headroom="0.1" --hadoop_home="" --help="false"
--hostname_lookup="true" --http_command_executor="false" --http_credentials="/tmp/Endpoint_SlaveEndpointTest_NoAuthorizer_1_rXaZeH/http_credentials"
--http_heartbeat_interval="30secs" --initialize_driver_logging="true" --isolation="posix/cpu,posix/mem"
--launcher="posix" --launcher_dir="/mesos/build/src" --logbufsecs="0" --logging_level="INFO"
--max_completed_executors_per_framework="150" --oversubscribed_resources_interval="15secs"
--perf_duration="10secs" --perf_interval="1mins" --port="5051" --qos_correction_interval_min="0ns"
--quiet="false" --recover="reconnect" --recovery_timeout="15mins" --registration_backoff_factor="10ms"
--resources="cpus:2;gpus:0;mem:1024;disk:1024;ports:[31000-32000]" --revocable_cpu_low_priority="true"
--runtime_dir="/tmp/Endpoint_SlaveEndpointTest_NoAuthorizer_1_rXaZeH" --sandbox_directory="/mnt/mesos/sandbox"
--strict="true" --switch_user="true" --systemd_enable_support="true" --systemd_runtime_directory="/run/systemd/system"
--version="false" --work_dir="/tmp/Endpoint_SlaveEndpointTest_NoAuthorizer_1_u1b0rj"
I0524 18:54:47.185272 23973 credentials.hpp:86] Loading credential for authentication from
'/tmp/Endpoint_SlaveEndpointTest_NoAuthorizer_1_rXaZeH/credential'
I0524 18:54:47.185360 23973 slave.cpp:258] Agent using credential for: test-principal
I0524 18:54:47.185374 23973 credentials.hpp:37] Loading credentials for authentication from
'/tmp/Endpoint_SlaveEndpointTest_NoAuthorizer_1_rXaZeH/http_credentials'
I0524 18:54:47.185473 23973 http.cpp:975] Creating default 'basic' HTTP authenticator for
realm 'mesos-agent-readonly'
I0524 18:54:47.185520 23973 http.cpp:975] Creating default 'basic' HTTP authenticator for
realm 'mesos-agent-readwrite'
I0524 18:54:47.185870 23973 slave.cpp:525] Agent resources: cpus(*):2; mem(*):1024; disk(*):1024;
ports(*):[31000-32000]
I0524 18:54:47.185899 23973 slave.cpp:533] Agent attributes: [  ]
I0524 18:54:47.185904 23973 slave.cpp:538] Agent hostname: 8468ccc58d1d
I0524 18:54:47.185962 23976 status_update_manager.cpp:177] Pausing sending status updates
I0524 18:54:47.186238 23976 state.cpp:62] Recovering state from '/tmp/Endpoint_SlaveEndpointTest_NoAuthorizer_1_u1b0rj/meta'
I0524 18:54:47.186405 23983 status_update_manager.cpp:203] Recovering status update manager
I0524 18:54:47.186594 23977 containerizer.cpp:608] Recovering containerizer
I0524 18:54:47.187036 23978 provisioner.cpp:410] Provisioner recovery complete
I0524 18:54:47.187240 23970 slave.cpp:5970] Finished recovery
I0524 18:54:47.187546 23970 slave.cpp:6152] Querying resource estimator for oversubscribable
resources
I0524 18:54:47.187623 23975 slave.cpp:6166] Received oversubscribable resources {} from the
resource estimator
I0524 18:54:47.188143 23979 process.cpp:3731] Handling HTTP event for process 'slave(742)'
with path: '/slave(742)/monitor/statistics.json'
I0524 18:54:47.188511 23974 http.cpp:1115] HTTP GET for /slave(742)/monitor/statistics.json
from 172.17.0.2:44214
I0524 18:54:47.188546 23974 http.cpp:936] Authorizing principal 'test-principal' to GET the
'/monitor/statistics.json' endpoint
I0524 18:54:47.189574 23967 slave.cpp:790] Agent terminating
[       OK ] Endpoint/SlaveEndpointTest.NoAuthorizer/1 (10 ms)
[ RUN      ] Endpoint/SlaveEndpointTest.NoAuthorizer/2
I0524 18:54:47.195027 23967 containerizer.cpp:221] Using isolation: posix/cpu,posix/mem,filesystem/posix,network/cni
W0524 18:54:47.195345 23967 backend.cpp:76] Failed to create 'aufs' backend: AufsBackend requires
root privileges
W0524 18:54:47.195387 23967 backend.cpp:76] Failed to create 'bind' backend: BindBackend requires
root privileges
I0524 18:54:47.195400 23967 provisioner.cpp:249] Using default backend 'copy'
I0524 18:54:47.196148 23967 cluster.cpp:448] Creating default 'local' authorizer
I0524 18:54:47.196743 23979 slave.cpp:225] Mesos agent started on (743)@172.17.0.2:49070
I0524 18:54:47.196780 23979 slave.cpp:226] Flags at startup: --acls="" --appc_simple_discovery_uri_prefix="http://"
--appc_store_dir="/tmp/mesos/store/appc" --authenticate_http_readonly="true" --authenticate_http_readwrite="true"
--authenticatee="crammd5" --authentication_backoff_factor="1secs" --authorizer="local" --cgroups_cpu_enable_pids_and_tids_count="false"
--cgroups_enable_cfs="false" --cgroups_hierarchy="/sys/fs/cgroup" --cgroups_limit_swap="false"
--cgroups_root="mesos" --container_disk_watch_interval="15secs" --containerizers="mesos" --credential="/tmp/Endpoint_SlaveEndpointTest_NoAuthorizer_2_7HgSue/credential"
--default_role="*" --disk_watch_interval="1mins" --docker="docker" --docker_kill_orphans="true"
--docker_registry="https://registry-1.docker.io" --docker_remove_delay="6hrs" --docker_socket="/var/run/docker.sock"
--docker_stop_timeout="0ns" --docker_store_dir="/tmp/mesos/store/docker" --docker_volume_checkpoint_dir="/var/run/mesos/isolators/docker/volume"
--enforce_container_disk_quota="false" --executor_registration_timeout="1mins" --executor_shutdown_grace_period="5secs"
--fetcher_cache_dir="/tmp/Endpoint_SlaveEndpointTest_NoAuthorizer_2_7HgSue/fetch" --fetcher_cache_size="2GB"
--frameworks_home="" --gc_delay="1weeks" --gc_disk_headroom="0.1" --hadoop_home="" --help="false"
--hostname_lookup="true" --http_command_executor="false" --http_credentials="/tmp/Endpoint_SlaveEndpointTest_NoAuthorizer_2_7HgSue/http_credentials"
--http_heartbeat_interval="30secs" --initialize_driver_logging="true" --isolation="posix/cpu,posix/mem"
--launcher="posix" --launcher_dir="/mesos/build/src" --logbufsecs="0" --logging_level="INFO"
--max_completed_executors_per_framework="150" --oversubscribed_resources_interval="15secs"
--perf_duration="10secs" --perf_interval="1mins" --port="5051" --qos_correction_interval_min="0ns"
--quiet="false" --recover="reconnect" --recovery_timeout="15mins" --registration_backoff_factor="10ms"
--resources="cpus:2;gpus:0;mem:1024;disk:1024;ports:[31000-32000]" --revocable_cpu_low_priority="true"
--runtime_dir="/tmp/Endpoint_SlaveEndpointTest_NoAuthorizer_2_7HgSue" --sandbox_directory="/mnt/mesos/sandbox"
--strict="true" --switch_user="true" --systemd_enable_support="true" --systemd_runtime_directory="/run/systemd/system"
--version="false" --work_dir="/tmp/Endpoint_SlaveEndpointTest_NoAuthorizer_2_Oa26FQ"
I0524 18:54:47.197051 23979 credentials.hpp:86] Loading credential for authentication from
'/tmp/Endpoint_SlaveEndpointTest_NoAuthorizer_2_7HgSue/credential'
I0524 18:54:47.197141 23979 slave.cpp:258] Agent using credential for: test-principal
I0524 18:54:47.197155 23979 credentials.hpp:37] Loading credentials for authentication from
'/tmp/Endpoint_SlaveEndpointTest_NoAuthorizer_2_7HgSue/http_credentials'
I0524 18:54:47.197263 23979 http.cpp:975] Creating default 'basic' HTTP authenticator for
realm 'mesos-agent-readonly'
I0524 18:54:47.197319 23979 http.cpp:975] Creating default 'basic' HTTP authenticator for
realm 'mesos-agent-readwrite'
I0524 18:54:47.197731 23979 slave.cpp:525] Agent resources: cpus(*):2; mem(*):1024; disk(*):1024;
ports(*):[31000-32000]
I0524 18:54:47.197770 23979 slave.cpp:533] Agent attributes: [  ]
I0524 18:54:47.197777 23979 slave.cpp:538] Agent hostname: 8468ccc58d1d
I0524 18:54:47.197859 23975 status_update_manager.cpp:177] Pausing sending status updates
I0524 18:54:47.198169 23983 state.cpp:62] Recovering state from '/tmp/Endpoint_SlaveEndpointTest_NoAuthorizer_2_Oa26FQ/meta'
I0524 18:54:47.198451 23980 status_update_manager.cpp:203] Recovering status update manager
I0524 18:54:47.198559 23980 containerizer.cpp:608] Recovering containerizer
I0524 18:54:47.199129 23978 provisioner.cpp:410] Provisioner recovery complete
I0524 18:54:47.199321 23977 slave.cpp:5970] Finished recovery
I0524 18:54:47.199713 23977 slave.cpp:6152] Querying resource estimator for oversubscribable
resources
I0524 18:54:47.199892 23981 slave.cpp:6166] Received oversubscribable resources {} from the
resource estimator
I0524 18:54:47.200515 23970 process.cpp:3731] Handling HTTP event for process 'slave(743)'
with path: '/slave(743)/containers'
I0524 18:54:47.200947 23979 http.cpp:1115] HTTP GET for /slave(743)/containers from 172.17.0.2:44215
I0524 18:54:47.200990 23979 http.cpp:936] Authorizing principal 'test-principal' to GET the
'/containers' endpoint
I0524 18:54:47.202558 23979 slave.cpp:790] Agent terminating
[       OK ] Endpoint/SlaveEndpointTest.NoAuthorizer/2 (13 ms)
[----------] 9 tests from Endpoint/SlaveEndpointTest (150 ms total)

[----------] Global test environment tear-down
[==========] 1518 tests from 167 test cases ran. (300449 ms total)
[  PASSED  ] 1517 tests.
[  FAILED  ] 1 test, listed below:
[  FAILED  ] RegisterSlaveValidationTest.DropInvalidRegistration

 1 FAILED TEST
  YOU HAVE 22 DISABLED TESTS

E0524 18:54:47.258040 23984 process.cpp:951] Failed to accept socket: future discarded
make[3]: *** [CMakeFiles/check] Error 1
make[3]: Leaving directory `/mesos/build'
make[2]: *** [CMakeFiles/check.dir/all] Error 2
make[2]: Leaving directory `/mesos/build'
make[1]: Leaving directory `/mesos/build'
make[1]: *** [CMakeFiles/check.dir/rule] Error 2
make: *** [check] Error 2
+ docker rmi mesos-1495649632-28967
Untagged: mesos-1495649632-28967:latest
Deleted: sha256:5b1b9b6b71b787fd9d365ed3d59285bafd4706870420170469c0eb0adb09eb52
Deleted: sha256:91634eab448dd23ab987557de69cd7345c87d850162dd655678b8c141523e80b
Deleted: sha256:2cce1282540af45e1d181199ff83bb2561950f2d314ea0abba6cf586e934d9d0
Deleted: sha256:2875f265ad413fb11c8bb03be9797eafe5be561c5f3f31452b723412e965daa8
Deleted: sha256:8208f57ea02669293a8b41cb60d9911f05a86faa17c51c7af888fb2fbd02f57c
Deleted: sha256:01e2ac25c278e0d019d0220ee7003ae78aad0a79bf98c68aafaee442a6845eb4
Deleted: sha256:b663e955cb17f689cecac742f6dcf4e08378d58d4f3a16f2bde6810f8f3ade3e
Deleted: sha256:ae01bf6ebf323ef39f7670ee328b99d0b50b00a8a7f7a67a6ff5004e79fc4d96
Deleted: sha256:6834ec622aafec85fb5c6c96de771eacd70e7e8c77bdd498fa0ffa38516d6bf9
Deleted: sha256:36e6faa9fad2365f32ea71526a7d619cc7be732d8fcfdc104ce1404dbdd6af57
Deleted: sha256:0a613ad686f06ed76c517612f8b231342ea890e32e24269ec4f8d1b64f27c830
Deleted: sha256:ab4e844b393e2bc7de7a38f28f4682385392847714691524ac4d837a72aa410f
Deleted: sha256:384e3ee85d1d38c1c86cfbc7701907cc06b0f14b445da4c5492c9afabf7ee263
Deleted: sha256:a457f8437a9b92fd428fe1f83dc2f1e054ada914ac2656ec2248d0367a2a6102
Deleted: sha256:5aa98cbcc62e70c20c2e8b18a831b0233bb5c66b11e7d53af687342522e95cec
Deleted: sha256:c7cee19d07433abba09bd8b7870ddcb6fbf74de62e2ffba07e743f303ca79e3b
Deleted: sha256:9c60bf5f2659b2baa20ceae09c76cc0245b87a7aa7e4504be03bebdefa22dabe
Deleted: sha256:9bf14ac07bfae09663a4777a2dac2d242cb29d8a7eb0064d7b7c91a233b289de
Deleted: sha256:c76395a5a4e6c68977c9cb9c439e6608eb0f2af61da990345764846841bee483
Deleted: sha256:c9745c55e5f2e38bc6d1d06528d728521cc5698a620e790f6311965be3168883
Deleted: sha256:063285f60093ec47e09ea86d8a5ba183a8d91624271c42bdcdb8c06964eb87c0
Deleted: sha256:23f13f8fa5879f5f646e9e86ec92e082581c20637915bc8f0f1d98fbad5468f7
Deleted: sha256:f57487f193e16c21b82c0849805b15417ab21a20c6806a055b2accbf6801aba3
Deleted: sha256:5b3b29339de9f2b2a482ba3bd82f72b6769f0325e88f6e51402469b8219fb35a
Build step 'Execute shell' marked build as failure
Not sending mail to unregistered user neil.conway@gmail.com

Mime
View raw message