mesos-builds mailing list archives

Site index · List index
Message view « Date » · « Thread »
Top « Date » · « Thread »
From Apache Jenkins Server <jenk...@builds.apache.org>
Subject Build failed in Jenkins: Mesos-Buildbot » cmake,clang,--verbose --enable-libevent --enable-ssl,GLOG_v=1 MESOS_VERBOSE=1,ubuntu:14.04,(docker||Hadoop)&&(!ubuntu-us1)&&(!ubuntu-eu2) #3587
Date Mon, 01 May 2017 21:40:29 GMT
See <https://builds.apache.org/job/Mesos-Buildbot/BUILDTOOL=cmake,COMPILER=clang,CONFIGURATION=--verbose%20--enable-libevent%20--enable-ssl,ENVIRONMENT=GLOG_v=1%20MESOS_VERBOSE=1,OS=ubuntu%3A14.04,label_exp=(docker%7C%7CHadoop)&&(!ubuntu-us1)&&(!ubuntu-eu2)/3587/display/redirect?page=changes>

Changes:

[xujyan] Renamed containerizer.md.

------------------------------------------
[...truncated 26.66 MB...]
I0501 21:40:25.651080  1800 slave.cpp:6145] Querying resource estimator for oversubscribable
resources
I0501 21:40:25.651198  1801 slave.cpp:6159] Received oversubscribable resources {} from the
resource estimator
I0501 21:40:25.651746  1805 process.cpp:3731] Handling HTTP event for process 'slave(746)'
with path: '/slave(746)/containers'
I0501 21:40:25.652361  1803 http.cpp:1115] HTTP GET for /slave(746)/containers from 172.17.0.2:37846
I0501 21:40:25.652393  1803 http.cpp:936] Authorizing principal 'test-principal' to GET the
'/containers' endpoint
I0501 21:40:25.653720  1798 slave.cpp:790] Agent terminating
[       OK ] Endpoint/SlaveEndpointTest.AuthorizedRequest/2 (11 ms)
[ RUN      ] Endpoint/SlaveEndpointTest.UnauthorizedRequest/0
I0501 21:40:25.658491 26714 containerizer.cpp:221] Using isolation: posix/cpu,posix/mem,filesystem/posix,network/cni
W0501 21:40:25.658740 26714 backend.cpp:76] Failed to create 'aufs' backend: AufsBackend requires
root privileges
W0501 21:40:25.658776 26714 backend.cpp:76] Failed to create 'bind' backend: BindBackend requires
root privileges
I0501 21:40:25.658787 26714 provisioner.cpp:249] Using default backend 'copy'
I0501 21:40:25.659749  1807 slave.cpp:225] Mesos agent started on (747)@172.17.0.2:34896
I0501 21:40:25.659770  1807 slave.cpp:226] Flags at startup: --acls="" --appc_simple_discovery_uri_prefix="http://"
--appc_store_dir="/tmp/mesos/store/appc" --authenticate_http_executors="true" --authenticate_http_readonly="true"
--authenticate_http_readwrite="true" --authenticatee="crammd5" --authentication_backoff_factor="1secs"
--authorizer="local" --cgroups_cpu_enable_pids_and_tids_count="false" --cgroups_enable_cfs="false"
--cgroups_hierarchy="/sys/fs/cgroup" --cgroups_limit_swap="false" --cgroups_root="mesos" --container_disk_watch_interval="15secs"
--containerizers="mesos" --credential="/tmp/Endpoint_SlaveEndpointTest_UnauthorizedRequest_0_ayx3G0/credential"
--default_role="*" --disk_watch_interval="1mins" --docker="docker" --docker_kill_orphans="true"
--docker_registry="https://registry-1.docker.io" --docker_remove_delay="6hrs" --docker_socket="/var/run/docker.sock"
--docker_stop_timeout="0ns" --docker_store_dir="/tmp/mesos/store/docker" --docker_volume_checkpoint_dir="/var/run/mesos/isolators/docker/volume"
--enforce_container_disk_quota="false" --executor_registration_timeout="1mins" --executor_secret_key="/tmp/Endpoint_SlaveEndpointTest_UnauthorizedRequest_0_ayx3G0/executor_secret_key"
--executor_shutdown_grace_period="5secs" --fetcher_cache_dir="/tmp/Endpoint_SlaveEndpointTest_UnauthorizedRequest_0_ayx3G0/fetch"
--fetcher_cache_size="2GB" --frameworks_home="" --gc_delay="1weeks" --gc_disk_headroom="0.1"
--hadoop_home="" --help="false" --hostname_lookup="true" --http_command_executor="false" --http_credentials="/tmp/Endpoint_SlaveEndpointTest_UnauthorizedRequest_0_ayx3G0/http_credentials"
--http_heartbeat_interval="30secs" --initialize_driver_logging="true" --isolation="posix/cpu,posix/mem"
--launcher="posix" --launcher_dir="/mesos/build/src" --logbufsecs="0" --logging_level="INFO"
--max_completed_executors_per_framework="150" --oversubscribed_resources_interval="15secs"
--perf_duration="10secs" --perf_interval="1mins" --port="5051" --qos_correction_interval_min="0ns"
--quiet="false" --recover="reconnect" --recovery_timeout="15mins" --registration_backoff_factor="10ms"
--resources="cpus:2;gpus:0;mem:1024;disk:1024;ports:[31000-32000]" --revocable_cpu_low_priority="true"
--runtime_dir="/tmp/Endpoint_SlaveEndpointTest_UnauthorizedRequest_0_ayx3G0" --sandbox_directory="/mnt/mesos/sandbox"
--strict="true" --switch_user="true" --systemd_enable_support="true" --systemd_runtime_directory="/run/systemd/system"
--version="false" --work_dir="/tmp/Endpoint_SlaveEndpointTest_UnauthorizedRequest_0_ukkuhi"
I0501 21:40:25.659948  1807 credentials.hpp:86] Loading credential for authentication from
'/tmp/Endpoint_SlaveEndpointTest_UnauthorizedRequest_0_ayx3G0/credential'
I0501 21:40:25.660022  1807 slave.cpp:258] Agent using credential for: test-principal
I0501 21:40:25.660032  1807 credentials.hpp:37] Loading credentials for authentication from
'/tmp/Endpoint_SlaveEndpointTest_UnauthorizedRequest_0_ayx3G0/http_credentials'
I0501 21:40:25.660140  1807 http.cpp:975] Creating default 'basic' HTTP authenticator for
realm 'mesos-agent-executor'
I0501 21:40:25.660176  1807 http.cpp:996] Creating default 'jwt' HTTP authenticator for realm
'mesos-agent-executor'
I0501 21:40:25.660321  1807 http.cpp:975] Creating default 'basic' HTTP authenticator for
realm 'mesos-agent-readonly'
I0501 21:40:25.660455  1807 http.cpp:996] Creating default 'jwt' HTTP authenticator for realm
'mesos-agent-readonly'
I0501 21:40:25.660517  1807 http.cpp:975] Creating default 'basic' HTTP authenticator for
realm 'mesos-agent-readwrite'
I0501 21:40:25.660594  1807 http.cpp:996] Creating default 'jwt' HTTP authenticator for realm
'mesos-agent-readwrite'
I0501 21:40:25.661007  1807 slave.cpp:525] Agent resources: cpus(*):2; mem(*):1024; disk(*):1024;
ports(*):[31000-32000]
I0501 21:40:25.661039  1807 slave.cpp:533] Agent attributes: [  ]
I0501 21:40:25.661046  1807 slave.cpp:538] Agent hostname: 8729d3a70017
I0501 21:40:25.661106  1799 status_update_manager.cpp:177] Pausing sending status updates
I0501 21:40:25.661342  1819 state.cpp:62] Recovering state from '/tmp/Endpoint_SlaveEndpointTest_UnauthorizedRequest_0_ukkuhi/meta'
I0501 21:40:25.661449  1796 status_update_manager.cpp:203] Recovering status update manager
I0501 21:40:25.661562  1809 containerizer.cpp:608] Recovering containerizer
I0501 21:40:25.662040  1800 provisioner.cpp:410] Provisioner recovery complete
I0501 21:40:25.662232  1818 slave.cpp:5963] Finished recovery
I0501 21:40:25.662545  1818 slave.cpp:6145] Querying resource estimator for oversubscribable
resources
I0501 21:40:25.662650  1804 slave.cpp:6159] Received oversubscribable resources {} from the
resource estimator
I0501 21:40:25.663326  1815 process.cpp:3731] Handling HTTP event for process 'slave(747)'
with path: '/slave(747)/monitor/statistics'
I0501 21:40:25.663853  1805 http.cpp:1115] HTTP GET for /slave(747)/monitor/statistics from
172.17.0.2:37848
I0501 21:40:25.663882  1805 http.cpp:936] Authorizing principal 'test-principal' to GET the
'/monitor/statistics' endpoint
I0501 21:40:25.664714  1800 slave.cpp:790] Agent terminating
[       OK ] Endpoint/SlaveEndpointTest.UnauthorizedRequest/0 (10 ms)
[ RUN      ] Endpoint/SlaveEndpointTest.UnauthorizedRequest/1
I0501 21:40:25.669132 26714 containerizer.cpp:221] Using isolation: posix/cpu,posix/mem,filesystem/posix,network/cni
W0501 21:40:25.669381 26714 backend.cpp:76] Failed to create 'aufs' backend: AufsBackend requires
root privileges
W0501 21:40:25.669419 26714 backend.cpp:76] Failed to create 'bind' backend: BindBackend requires
root privileges
I0501 21:40:25.669430 26714 provisioner.cpp:249] Using default backend 'copy'
I0501 21:40:25.670421  1805 slave.cpp:225] Mesos agent started on (748)@172.17.0.2:34896
I0501 21:40:25.670446  1805 slave.cpp:226] Flags at startup: --acls="" --appc_simple_discovery_uri_prefix="http://"
--appc_store_dir="/tmp/mesos/store/appc" --authenticate_http_executors="true" --authenticate_http_readonly="true"
--authenticate_http_readwrite="true" --authenticatee="crammd5" --authentication_backoff_factor="1secs"
--authorizer="local" --cgroups_cpu_enable_pids_and_tids_count="false" --cgroups_enable_cfs="false"
--cgroups_hierarchy="/sys/fs/cgroup" --cgroups_limit_swap="false" --cgroups_root="mesos" --container_disk_watch_interval="15secs"
--containerizers="mesos" --credential="/tmp/Endpoint_SlaveEndpointTest_UnauthorizedRequest_1_Yd4HqS/credential"
--default_role="*" --disk_watch_interval="1mins" --docker="docker" --docker_kill_orphans="true"
--docker_registry="https://registry-1.docker.io" --docker_remove_delay="6hrs" --docker_socket="/var/run/docker.sock"
--docker_stop_timeout="0ns" --docker_store_dir="/tmp/mesos/store/docker" --docker_volume_checkpoint_dir="/var/run/mesos/isolators/docker/volume"
--enforce_container_disk_quota="false" --executor_registration_timeout="1mins" --executor_secret_key="/tmp/Endpoint_SlaveEndpointTest_UnauthorizedRequest_1_Yd4HqS/executor_secret_key"
--executor_shutdown_grace_period="5secs" --fetcher_cache_dir="/tmp/Endpoint_SlaveEndpointTest_UnauthorizedRequest_1_Yd4HqS/fetch"
--fetcher_cache_size="2GB" --frameworks_home="" --gc_delay="1weeks" --gc_disk_headroom="0.1"
--hadoop_home="" --help="false" --hostname_lookup="true" --http_command_executor="false" --http_credentials="/tmp/Endpoint_SlaveEndpointTest_UnauthorizedRequest_1_Yd4HqS/http_credentials"
--http_heartbeat_interval="30secs" --initialize_driver_logging="true" --isolation="posix/cpu,posix/mem"
--launcher="posix" --launcher_dir="/mesos/build/src" --logbufsecs="0" --logging_level="INFO"
--max_completed_executors_per_framework="150" --oversubscribed_resources_interval="15secs"
--perf_duration="10secs" --perf_interval="1mins" --port="5051" --qos_correction_interval_min="0ns"
--quiet="false" --recover="reconnect" --recovery_timeout="15mins" --registration_backoff_factor="10ms"
--resources="cpus:2;gpus:0;mem:1024;disk:1024;ports:[31000-32000]" --revocable_cpu_low_priority="true"
--runtime_dir="/tmp/Endpoint_SlaveEndpointTest_UnauthorizedRequest_1_Yd4HqS" --sandbox_directory="/mnt/mesos/sandbox"
--strict="true" --switch_user="true" --systemd_enable_support="true" --systemd_runtime_directory="/run/systemd/system"
--version="false" --work_dir="/tmp/Endpoint_SlaveEndpointTest_UnauthorizedRequest_1_MmvyZ9"
I0501 21:40:25.670617  1805 credentials.hpp:86] Loading credential for authentication from
'/tmp/Endpoint_SlaveEndpointTest_UnauthorizedRequest_1_Yd4HqS/credential'
I0501 21:40:25.670686  1805 slave.cpp:258] Agent using credential for: test-principal
I0501 21:40:25.670696  1805 credentials.hpp:37] Loading credentials for authentication from
'/tmp/Endpoint_SlaveEndpointTest_UnauthorizedRequest_1_Yd4HqS/http_credentials'
I0501 21:40:25.670796  1805 http.cpp:975] Creating default 'basic' HTTP authenticator for
realm 'mesos-agent-executor'
I0501 21:40:25.670830  1805 http.cpp:996] Creating default 'jwt' HTTP authenticator for realm
'mesos-agent-executor'
I0501 21:40:25.670891  1805 http.cpp:975] Creating default 'basic' HTTP authenticator for
realm 'mesos-agent-readonly'
I0501 21:40:25.670936  1805 http.cpp:996] Creating default 'jwt' HTTP authenticator for realm
'mesos-agent-readonly'
I0501 21:40:25.670994  1805 http.cpp:975] Creating default 'basic' HTTP authenticator for
realm 'mesos-agent-readwrite'
I0501 21:40:25.671026  1805 http.cpp:996] Creating default 'jwt' HTTP authenticator for realm
'mesos-agent-readwrite'
I0501 21:40:25.671411  1805 slave.cpp:525] Agent resources: cpus(*):2; mem(*):1024; disk(*):1024;
ports(*):[31000-32000]
I0501 21:40:25.671442  1805 slave.cpp:533] Agent attributes: [  ]
I0501 21:40:25.671447  1805 slave.cpp:538] Agent hostname: 8729d3a70017
I0501 21:40:25.671495  1804 status_update_manager.cpp:177] Pausing sending status updates
I0501 21:40:25.671841  1810 state.cpp:62] Recovering state from '/tmp/Endpoint_SlaveEndpointTest_UnauthorizedRequest_1_MmvyZ9/meta'
I0501 21:40:25.671941  1817 status_update_manager.cpp:203] Recovering status update manager
I0501 21:40:25.672019  1805 containerizer.cpp:608] Recovering containerizer
I0501 21:40:25.672744  1801 provisioner.cpp:410] Provisioner recovery complete
I0501 21:40:25.672966  1812 slave.cpp:5963] Finished recovery
I0501 21:40:25.673285  1812 slave.cpp:6145] Querying resource estimator for oversubscribable
resources
I0501 21:40:25.673449  1799 slave.cpp:6159] Received oversubscribable resources {} from the
resource estimator
I0501 21:40:25.674141  1809 process.cpp:3731] Handling HTTP event for process 'slave(748)'
with path: '/slave(748)/monitor/statistics.json'
I0501 21:40:25.674695  1797 http.cpp:1115] HTTP GET for /slave(748)/monitor/statistics.json
from 172.17.0.2:37850
I0501 21:40:25.674727  1797 http.cpp:936] Authorizing principal 'test-principal' to GET the
'/monitor/statistics.json' endpoint
I0501 21:40:25.675830  1808 slave.cpp:790] Agent terminating
[       OK ] Endpoint/SlaveEndpointTest.UnauthorizedRequest/1 (10 ms)
[ RUN      ] Endpoint/SlaveEndpointTest.UnauthorizedRequest/2
I0501 21:40:25.680016 26714 containerizer.cpp:221] Using isolation: posix/cpu,posix/mem,filesystem/posix,network/cni
W0501 21:40:25.680258 26714 backend.cpp:76] Failed to create 'aufs' backend: AufsBackend requires
root privileges
W0501 21:40:25.680292 26714 backend.cpp:76] Failed to create 'bind' backend: BindBackend requires
root privileges
I0501 21:40:25.680305 26714 provisioner.cpp:249] Using default backend 'copy'
I0501 21:40:25.681354  1803 slave.cpp:225] Mesos agent started on (749)@172.17.0.2:34896
I0501 21:40:25.681375  1803 slave.cpp:226] Flags at startup: --acls="" --appc_simple_discovery_uri_prefix="http://"
--appc_store_dir="/tmp/mesos/store/appc" --authenticate_http_executors="true" --authenticate_http_readonly="true"
--authenticate_http_readwrite="true" --authenticatee="crammd5" --authentication_backoff_factor="1secs"
--authorizer="local" --cgroups_cpu_enable_pids_and_tids_count="false" --cgroups_enable_cfs="false"
--cgroups_hierarchy="/sys/fs/cgroup" --cgroups_limit_swap="false" --cgroups_root="mesos" --container_disk_watch_interval="15secs"
--containerizers="mesos" --credential="/tmp/Endpoint_SlaveEndpointTest_UnauthorizedRequest_2_ExyOgK/credential"
--default_role="*" --disk_watch_interval="1mins" --docker="docker" --docker_kill_orphans="true"
--docker_registry="https://registry-1.docker.io" --docker_remove_delay="6hrs" --docker_socket="/var/run/docker.sock"
--docker_stop_timeout="0ns" --docker_store_dir="/tmp/mesos/store/docker" --docker_volume_checkpoint_dir="/var/run/mesos/isolators/docker/volume"
--enforce_container_disk_quota="false" --executor_registration_timeout="1mins" --executor_secret_key="/tmp/Endpoint_SlaveEndpointTest_UnauthorizedRequest_2_ExyOgK/executor_secret_key"
--executor_shutdown_grace_period="5secs" --fetcher_cache_dir="/tmp/Endpoint_SlaveEndpointTest_UnauthorizedRequest_2_ExyOgK/fetch"
--fetcher_cache_size="2GB" --frameworks_home="" --gc_delay="1weeks" --gc_disk_headroom="0.1"
--hadoop_home="" --help="false" --hostname_lookup="true" --http_command_executor="false" --http_credentials="/tmp/Endpoint_SlaveEndpointTest_UnauthorizedRequest_2_ExyOgK/http_credentials"
--http_heartbeat_interval="30secs" --initialize_driver_logging="true" --isolation="posix/cpu,posix/mem"
--launcher="posix" --launcher_dir="/mesos/build/src" --logbufsecs="0" --logging_level="INFO"
--max_completed_executors_per_framework="150" --oversubscribed_resources_interval="15secs"
--perf_duration="10secs" --perf_interval="1mins" --port="5051" --qos_correction_interval_min="0ns"
--quiet="false" --recover="reconnect" --recovery_timeout="15mins" --registration_backoff_factor="10ms"
--resources="cpus:2;gpus:0;mem:1024;disk:1024;ports:[31000-32000]" --revocable_cpu_low_priority="true"
--runtime_dir="/tmp/Endpoint_SlaveEndpointTest_UnauthorizedRequest_2_ExyOgK" --sandbox_directory="/mnt/mesos/sandbox"
--strict="true" --switch_user="true" --systemd_enable_support="true" --systemd_runtime_directory="/run/systemd/system"
--version="false" --work_dir="/tmp/Endpoint_SlaveEndpointTest_UnauthorizedRequest_2_GVC2N1"
I0501 21:40:25.681547  1803 credentials.hpp:86] Loading credential for authentication from
'/tmp/Endpoint_SlaveEndpointTest_UnauthorizedRequest_2_ExyOgK/credential'
I0501 21:40:25.681620  1803 slave.cpp:258] Agent using credential for: test-principal
I0501 21:40:25.681630  1803 credentials.hpp:37] Loading credentials for authentication from
'/tmp/Endpoint_SlaveEndpointTest_UnauthorizedRequest_2_ExyOgK/http_credentials'
I0501 21:40:25.681733  1803 http.cpp:975] Creating default 'basic' HTTP authenticator for
realm 'mesos-agent-executor'
I0501 21:40:25.681767  1803 http.cpp:996] Creating default 'jwt' HTTP authenticator for realm
'mesos-agent-executor'
I0501 21:40:25.681823  1803 http.cpp:975] Creating default 'basic' HTTP authenticator for
realm 'mesos-agent-readonly'
I0501 21:40:25.681874  1803 http.cpp:996] Creating default 'jwt' HTTP authenticator for realm
'mesos-agent-readonly'
I0501 21:40:25.681942  1803 http.cpp:975] Creating default 'basic' HTTP authenticator for
realm 'mesos-agent-readwrite'
I0501 21:40:25.681987  1803 http.cpp:996] Creating default 'jwt' HTTP authenticator for realm
'mesos-agent-readwrite'
I0501 21:40:25.682548  1803 slave.cpp:525] Agent resources: cpus(*):2; mem(*):1024; disk(*):1024;
ports(*):[31000-32000]
I0501 21:40:25.682580  1803 slave.cpp:533] Agent attributes: [  ]
I0501 21:40:25.682587  1803 slave.cpp:538] Agent hostname: 8729d3a70017
I0501 21:40:25.682636  1801 status_update_manager.cpp:177] Pausing sending status updates
I0501 21:40:25.682972  1799 state.cpp:62] Recovering state from '/tmp/Endpoint_SlaveEndpointTest_UnauthorizedRequest_2_GVC2N1/meta'
I0501 21:40:25.683176  1819 status_update_manager.cpp:203] Recovering status update manager
I0501 21:40:25.683259  1809 containerizer.cpp:608] Recovering containerizer
I0501 21:40:25.683738  1815 provisioner.cpp:410] Provisioner recovery complete
I0501 21:40:25.683892  1818 slave.cpp:5963] Finished recovery
I0501 21:40:25.684190  1818 slave.cpp:6145] Querying resource estimator for oversubscribable
resources
I0501 21:40:25.684293  1813 slave.cpp:6159] Received oversubscribable resources {} from the
resource estimator
I0501 21:40:25.684845  1819 process.cpp:3731] Handling HTTP event for process 'slave(749)'
with path: '/slave(749)/containers'
I0501 21:40:25.685315  1813 http.cpp:1115] HTTP GET for /slave(749)/containers from 172.17.0.2:37852
I0501 21:40:25.685353  1813 http.cpp:936] Authorizing principal 'test-principal' to GET the
'/containers' endpoint
I0501 21:40:25.686579  1803 slave.cpp:790] Agent terminating
[       OK ] Endpoint/SlaveEndpointTest.UnauthorizedRequest/2 (10 ms)
[ RUN      ] Endpoint/SlaveEndpointTest.NoAuthorizer/0
I0501 21:40:25.691303 26714 containerizer.cpp:221] Using isolation: posix/cpu,posix/mem,filesystem/posix,network/cni
W0501 21:40:25.691550 26714 backend.cpp:76] Failed to create 'aufs' backend: AufsBackend requires
root privileges
W0501 21:40:25.691584 26714 backend.cpp:76] Failed to create 'bind' backend: BindBackend requires
root privileges
I0501 21:40:25.691596 26714 provisioner.cpp:249] Using default backend 'copy'
I0501 21:40:25.692116 26714 cluster.cpp:448] Creating default 'local' authorizer
I0501 21:40:25.692584  1814 slave.cpp:225] Mesos agent started on (750)@172.17.0.2:34896
I0501 21:40:25.692610  1814 slave.cpp:226] Flags at startup: --acls="" --appc_simple_discovery_uri_prefix="http://"
--appc_store_dir="/tmp/mesos/store/appc" --authenticate_http_executors="true" --authenticate_http_readonly="true"
--authenticate_http_readwrite="true" --authenticatee="crammd5" --authentication_backoff_factor="1secs"
--authorizer="local" --cgroups_cpu_enable_pids_and_tids_count="false" --cgroups_enable_cfs="false"
--cgroups_hierarchy="/sys/fs/cgroup" --cgroups_limit_swap="false" --cgroups_root="mesos" --container_disk_watch_interval="15secs"
--containerizers="mesos" --credential="/tmp/Endpoint_SlaveEndpointTest_NoAuthorizer_0_IDvxdC/credential"
--default_role="*" --disk_watch_interval="1mins" --docker="docker" --docker_kill_orphans="true"
--docker_registry="https://registry-1.docker.io" --docker_remove_delay="6hrs" --docker_socket="/var/run/docker.sock"
--docker_stop_timeout="0ns" --docker_store_dir="/tmp/mesos/store/docker" --docker_volume_checkpoint_dir="/var/run/mesos/isolators/docker/volume"
--enforce_container_disk_quota="false" --executor_registration_timeout="1mins" --executor_secret_key="/tmp/Endpoint_SlaveEndpointTest_NoAuthorizer_0_IDvxdC/executor_secret_key"
--executor_shutdown_grace_period="5secs" --fetcher_cache_dir="/tmp/Endpoint_SlaveEndpointTest_NoAuthorizer_0_IDvxdC/fetch"
--fetcher_cache_size="2GB" --frameworks_home="" --gc_delay="1weeks" --gc_disk_headroom="0.1"
--hadoop_home="" --help="false" --hostname_lookup="true" --http_command_executor="false" --http_credentials="/tmp/Endpoint_SlaveEndpointTest_NoAuthorizer_0_IDvxdC/http_credentials"
--http_heartbeat_interval="30secs" --initialize_driver_logging="true" --isolation="posix/cpu,posix/mem"
--launcher="posix" --launcher_dir="/mesos/build/src" --logbufsecs="0" --logging_level="INFO"
--max_completed_executors_per_framework="150" --oversubscribed_resources_interval="15secs"
--perf_duration="10secs" --perf_interval="1mins" --port="5051" --qos_correction_interval_min="0ns"
--quiet="false" --recover="reconnect" --recovery_timeout="15mins" --registration_backoff_factor="10ms"
--resources="cpus:2;gpus:0;mem:1024;disk:1024;ports:[31000-32000]" --revocable_cpu_low_priority="true"
--runtime_dir="/tmp/Endpoint_SlaveEndpointTest_NoAuthorizer_0_IDvxdC" --sandbox_directory="/mnt/mesos/sandbox"
--strict="true" --switch_user="true" --systemd_enable_support="true" --systemd_runtime_directory="/run/systemd/system"
--version="false" --work_dir="/tmp/Endpoint_SlaveEndpointTest_NoAuthorizer_0_gat6IT"
I0501 21:40:25.692785  1814 credentials.hpp:86] Loading credential for authentication from
'/tmp/Endpoint_SlaveEndpointTest_NoAuthorizer_0_IDvxdC/credential'
I0501 21:40:25.692863  1814 slave.cpp:258] Agent using credential for: test-principal
I0501 21:40:25.692873  1814 credentials.hpp:37] Loading credentials for authentication from
'/tmp/Endpoint_SlaveEndpointTest_NoAuthorizer_0_IDvxdC/http_credentials'
I0501 21:40:25.692981  1814 http.cpp:975] Creating default 'basic' HTTP authenticator for
realm 'mesos-agent-executor'
I0501 21:40:25.693014  1814 http.cpp:996] Creating default 'jwt' HTTP authenticator for realm
'mesos-agent-executor'
I0501 21:40:25.693089  1814 http.cpp:975] Creating default 'basic' HTTP authenticator for
realm 'mesos-agent-readonly'
I0501 21:40:25.693173  1814 http.cpp:996] Creating default 'jwt' HTTP authenticator for realm
'mesos-agent-readonly'
I0501 21:40:25.693244  1814 http.cpp:975] Creating default 'basic' HTTP authenticator for
realm 'mesos-agent-readwrite'
I0501 21:40:25.693292  1814 http.cpp:996] Creating default 'jwt' HTTP authenticator for realm
'mesos-agent-readwrite'
I0501 21:40:25.693771  1814 slave.cpp:525] Agent resources: cpus(*):2; mem(*):1024; disk(*):1024;
ports(*):[31000-32000]
I0501 21:40:25.693801  1814 slave.cpp:533] Agent attributes: [  ]
I0501 21:40:25.693809  1814 slave.cpp:538] Agent hostname: 8729d3a70017
I0501 21:40:25.693859  1801 status_update_manager.cpp:177] Pausing sending status updates
I0501 21:40:25.694156  1799 state.cpp:62] Recovering state from '/tmp/Endpoint_SlaveEndpointTest_NoAuthorizer_0_gat6IT/meta'
I0501 21:40:25.694274  1808 status_update_manager.cpp:203] Recovering status update manager
I0501 21:40:25.694347  1800 containerizer.cpp:608] Recovering containerizer
I0501 21:40:25.694949  1800 provisioner.cpp:410] Provisioner recovery complete
I0501 21:40:25.695119  1803 slave.cpp:5963] Finished recovery
I0501 21:40:25.695448  1803 slave.cpp:6145] Querying resource estimator for oversubscribable
resources
I0501 21:40:25.695541  1797 slave.cpp:6159] Received oversubscribable resources {} from the
resource estimator
I0501 21:40:25.696070  1801 process.cpp:3731] Handling HTTP event for process 'slave(750)'
with path: '/slave(750)/monitor/statistics'
I0501 21:40:25.696635  1805 http.cpp:1115] HTTP GET for /slave(750)/monitor/statistics from
172.17.0.2:37854
I0501 21:40:25.696668  1805 http.cpp:936] Authorizing principal 'test-principal' to GET the
'/monitor/statistics' endpoint
I0501 21:40:25.697727  1801 slave.cpp:790] Agent terminating
[       OK ] Endpoint/SlaveEndpointTest.NoAuthorizer/0 (11 ms)
[ RUN      ] Endpoint/SlaveEndpointTest.NoAuthorizer/1
I0501 21:40:25.702553 26714 containerizer.cpp:221] Using isolation: posix/cpu,posix/mem,filesystem/posix,network/cni
W0501 21:40:25.702795 26714 backend.cpp:76] Failed to create 'aufs' backend: AufsBackend requires
root privileges
W0501 21:40:25.702829 26714 backend.cpp:76] Failed to create 'bind' backend: BindBackend requires
root privileges
I0501 21:40:25.702841 26714 provisioner.cpp:249] Using default backend 'copy'
I0501 21:40:25.703483 26714 cluster.cpp:448] Creating default 'local' authorizer
I0501 21:40:25.703999  1806 slave.cpp:225] Mesos agent started on (751)@172.17.0.2:34896
I0501 21:40:25.704025  1806 slave.cpp:226] Flags at startup: --acls="" --appc_simple_discovery_uri_prefix="http://"
--appc_store_dir="/tmp/mesos/store/appc" --authenticate_http_executors="true" --authenticate_http_readonly="true"
--authenticate_http_readwrite="true" --authenticatee="crammd5" --authentication_backoff_factor="1secs"
--authorizer="local" --cgroups_cpu_enable_pids_and_tids_count="false" --cgroups_enable_cfs="false"
--cgroups_hierarchy="/sys/fs/cgroup" --cgroups_limit_swap="false" --cgroups_root="mesos" --container_disk_watch_interval="15secs"
--containerizers="mesos" --credential="/tmp/Endpoint_SlaveEndpointTest_NoAuthorizer_1_iF2Ygu/credential"
--default_role="*" --disk_watch_interval="1mins" --docker="docker" --docker_kill_orphans="true"
--docker_registry="https://registry-1.docker.io" --docker_remove_delay="6hrs" --docker_socket="/var/run/docker.sock"
--docker_stop_timeout="0ns" --docker_store_dir="/tmp/mesos/store/docker" --docker_volume_checkpoint_dir="/var/run/mesos/isolators/docker/volume"
--enforce_container_disk_quota="false" --executor_registration_timeout="1mins" --executor_secret_key="/tmp/Endpoint_SlaveEndpointTest_NoAuthorizer_1_iF2Ygu/executor_secret_key"
--executor_shutdown_grace_period="5secs" --fetcher_cache_dir="/tmp/Endpoint_SlaveEndpointTest_NoAuthorizer_1_iF2Ygu/fetch"
--fetcher_cache_size="2GB" --frameworks_home="" --gc_delay="1weeks" --gc_disk_headroom="0.1"
--hadoop_home="" --help="false" --hostname_lookup="true" --http_command_executor="false" --http_credentials="/tmp/Endpoint_SlaveEndpointTest_NoAuthorizer_1_iF2Ygu/http_credentials"
--http_heartbeat_interval="30secs" --initialize_driver_logging="true" --isolation="posix/cpu,posix/mem"
--launcher="posix" --launcher_dir="/mesos/build/src" --logbufsecs="0" --logging_level="INFO"
--max_completed_executors_per_framework="150" --oversubscribed_resources_interval="15secs"
--perf_duration="10secs" --perf_interval="1mins" --port="5051" --qos_correction_interval_min="0ns"
--quiet="false" --recover="reconnect" --recovery_timeout="15mins" --registration_backoff_factor="10ms"
--resources="cpus:2;gpus:0;mem:1024;disk:1024;ports:[31000-32000]" --revocable_cpu_low_priority="true"
--runtime_dir="/tmp/Endpoint_SlaveEndpointTest_NoAuthorizer_1_iF2Ygu" --sandbox_directory="/mnt/mesos/sandbox"
--strict="true" --switch_user="true" --systemd_enable_support="true" --systemd_runtime_directory="/run/systemd/system"
--version="false" --work_dir="/tmp/Endpoint_SlaveEndpointTest_NoAuthorizer_1_G4LRKL"
I0501 21:40:25.704202  1806 credentials.hpp:86] Loading credential for authentication from
'/tmp/Endpoint_SlaveEndpointTest_NoAuthorizer_1_iF2Ygu/credential'
I0501 21:40:25.704286  1806 slave.cpp:258] Agent using credential for: test-principal
I0501 21:40:25.704298  1806 credentials.hpp:37] Loading credentials for authentication from
'/tmp/Endpoint_SlaveEndpointTest_NoAuthorizer_1_iF2Ygu/http_credentials'
I0501 21:40:25.704407  1806 http.cpp:975] Creating default 'basic' HTTP authenticator for
realm 'mesos-agent-executor'
I0501 21:40:25.704444  1806 http.cpp:996] Creating default 'jwt' HTTP authenticator for realm
'mesos-agent-executor'
I0501 21:40:25.704517  1806 http.cpp:975] Creating default 'basic' HTTP authenticator for
realm 'mesos-agent-readonly'
I0501 21:40:25.704550  1806 http.cpp:996] Creating default 'jwt' HTTP authenticator for realm
'mesos-agent-readonly'
I0501 21:40:25.704680  1806 http.cpp:975] Creating default 'basic' HTTP authenticator for
realm 'mesos-agent-readwrite'
I0501 21:40:25.704718  1806 http.cpp:996] Creating default 'jwt' HTTP authenticator for realm
'mesos-agent-readwrite'
I0501 21:40:25.705237  1806 slave.cpp:525] Agent resources: cpus(*):2; mem(*):1024; disk(*):1024;
ports(*):[31000-32000]
I0501 21:40:25.705269  1806 slave.cpp:533] Agent attributes: [  ]
I0501 21:40:25.705276  1806 slave.cpp:538] Agent hostname: 8729d3a70017
I0501 21:40:25.705327  1797 status_update_manager.cpp:177] Pausing sending status updates
I0501 21:40:25.705615  1798 state.cpp:62] Recovering state from '/tmp/Endpoint_SlaveEndpointTest_NoAuthorizer_1_G4LRKL/meta'
I0501 21:40:25.705859  1807 status_update_manager.cpp:203] Recovering status update manager
I0501 21:40:25.705945  1800 containerizer.cpp:608] Recovering containerizer
I0501 21:40:25.706399  1800 provisioner.cpp:410] Provisioner recovery complete
I0501 21:40:25.706562  1801 slave.cpp:5963] Finished recovery
I0501 21:40:25.706868  1801 slave.cpp:6145] Querying resource estimator for oversubscribable
resources
I0501 21:40:25.707033  1819 slave.cpp:6159] Received oversubscribable resources {} from the
resource estimator
I0501 21:40:25.707568  1803 process.cpp:3731] Handling HTTP event for process 'slave(751)'
with path: '/slave(751)/monitor/statistics.json'
I0501 21:40:25.708103  1812 http.cpp:1115] HTTP GET for /slave(751)/monitor/statistics.json
from 172.17.0.2:37856
I0501 21:40:25.708139  1812 http.cpp:936] Authorizing principal 'test-principal' to GET the
'/monitor/statistics.json' endpoint
I0501 21:40:25.709393  1816 slave.cpp:790] Agent terminating
[       OK ] Endpoint/SlaveEndpointTest.NoAuthorizer/1 (11 ms)
[ RUN      ] Endpoint/SlaveEndpointTest.NoAuthorizer/2
I0501 21:40:25.713969 26714 containerizer.cpp:221] Using isolation: posix/cpu,posix/mem,filesystem/posix,network/cni
W0501 21:40:25.714231 26714 backend.cpp:76] Failed to create 'aufs' backend: AufsBackend requires
root privileges
W0501 21:40:25.714270 26714 backend.cpp:76] Failed to create 'bind' backend: BindBackend requires
root privileges
I0501 21:40:25.714282 26714 provisioner.cpp:249] Using default backend 'copy'
I0501 21:40:25.714939 26714 cluster.cpp:448] Creating default 'local' authorizer
I0501 21:40:25.715425  1799 slave.cpp:225] Mesos agent started on (752)@172.17.0.2:34896
I0501 21:40:25.715445  1799 slave.cpp:226] Flags at startup: --acls="" --appc_simple_discovery_uri_prefix="http://"
--appc_store_dir="/tmp/mesos/store/appc" --authenticate_http_executors="true" --authenticate_http_readonly="true"
--authenticate_http_readwrite="true" --authenticatee="crammd5" --authentication_backoff_factor="1secs"
--authorizer="local" --cgroups_cpu_enable_pids_and_tids_count="false" --cgroups_enable_cfs="false"
--cgroups_hierarchy="/sys/fs/cgroup" --cgroups_limit_swap="false" --cgroups_root="mesos" --container_disk_watch_interval="15secs"
--containerizers="mesos" --credential="/tmp/Endpoint_SlaveEndpointTest_NoAuthorizer_2_Axserm/credential"
--default_role="*" --disk_watch_interval="1mins" --docker="docker" --docker_kill_orphans="true"
--docker_registry="https://registry-1.docker.io" --docker_remove_delay="6hrs" --docker_socket="/var/run/docker.sock"
--docker_stop_timeout="0ns" --docker_store_dir="/tmp/mesos/store/docker" --docker_volume_checkpoint_dir="/var/run/mesos/isolators/docker/volume"
--enforce_container_disk_quota="false" --executor_registration_timeout="1mins" --executor_secret_key="/tmp/Endpoint_SlaveEndpointTest_NoAuthorizer_2_Axserm/executor_secret_key"
--executor_shutdown_grace_period="5secs" --fetcher_cache_dir="/tmp/Endpoint_SlaveEndpointTest_NoAuthorizer_2_Axserm/fetch"
--fetcher_cache_size="2GB" --frameworks_home="" --gc_delay="1weeks" --gc_disk_headroom="0.1"
--hadoop_home="" --help="false" --hostname_lookup="true" --http_command_executor="false" --http_credentials="/tmp/Endpoint_SlaveEndpointTest_NoAuthorizer_2_Axserm/http_credentials"
--http_heartbeat_interval="30secs" --initialize_driver_logging="true" --isolation="posix/cpu,posix/mem"
--launcher="posix" --launcher_dir="/mesos/build/src" --logbufsecs="0" --logging_level="INFO"
--max_completed_executors_per_framework="150" --oversubscribed_resources_interval="15secs"
--perf_duration="10secs" --perf_interval="1mins" --port="5051" --qos_correction_interval_min="0ns"
--quiet="false" --recover="reconnect" --recovery_timeout="15mins" --registration_backoff_factor="10ms"
--resources="cpus:2;gpus:0;mem:1024;disk:1024;ports:[31000-32000]" --revocable_cpu_low_priority="true"
--runtime_dir="/tmp/Endpoint_SlaveEndpointTest_NoAuthorizer_2_Axserm" --sandbox_directory="/mnt/mesos/sandbox"
--strict="true" --switch_user="true" --systemd_enable_support="true" --systemd_runtime_directory="/run/systemd/system"
--version="false" --work_dir="/tmp/Endpoint_SlaveEndpointTest_NoAuthorizer_2_CAGpTD"
I0501 21:40:25.715616  1799 credentials.hpp:86] Loading credential for authentication from
'/tmp/Endpoint_SlaveEndpointTest_NoAuthorizer_2_Axserm/credential'
I0501 21:40:25.715701  1799 slave.cpp:258] Agent using credential for: test-principal
I0501 21:40:25.715713  1799 credentials.hpp:37] Loading credentials for authentication from
'/tmp/Endpoint_SlaveEndpointTest_NoAuthorizer_2_Axserm/http_credentials'
I0501 21:40:25.715821  1799 http.cpp:975] Creating default 'basic' HTTP authenticator for
realm 'mesos-agent-executor'
I0501 21:40:25.715857  1799 http.cpp:996] Creating default 'jwt' HTTP authenticator for realm
'mesos-agent-executor'
I0501 21:40:25.716009  1799 http.cpp:975] Creating default 'basic' HTTP authenticator for
realm 'mesos-agent-readonly'
I0501 21:40:25.716100  1799 http.cpp:996] Creating default 'jwt' HTTP authenticator for realm
'mesos-agent-readonly'
I0501 21:40:25.716183  1799 http.cpp:975] Creating default 'basic' HTTP authenticator for
realm 'mesos-agent-readwrite'
I0501 21:40:25.716217  1799 http.cpp:996] Creating default 'jwt' HTTP authenticator for realm
'mesos-agent-readwrite'
I0501 21:40:25.716634  1799 slave.cpp:525] Agent resources: cpus(*):2; mem(*):1024; disk(*):1024;
ports(*):[31000-32000]
I0501 21:40:25.716665  1799 slave.cpp:533] Agent attributes: [  ]
I0501 21:40:25.716670  1799 slave.cpp:538] Agent hostname: 8729d3a70017
I0501 21:40:25.716722  1813 status_update_manager.cpp:177] Pausing sending status updates
I0501 21:40:25.717003  1800 state.cpp:62] Recovering state from '/tmp/Endpoint_SlaveEndpointTest_NoAuthorizer_2_CAGpTD/meta'
I0501 21:40:25.717118  1798 status_update_manager.cpp:203] Recovering status update manager
I0501 21:40:25.717243  1809 containerizer.cpp:608] Recovering containerizer
I0501 21:40:25.717695  1808 provisioner.cpp:410] Provisioner recovery complete
I0501 21:40:25.717814  1800 slave.cpp:5963] Finished recovery
I0501 21:40:25.718125  1800 slave.cpp:6145] Querying resource estimator for oversubscribable
resources
I0501 21:40:25.718243  1804 slave.cpp:6159] Received oversubscribable resources {} from the
resource estimator
I0501 21:40:25.718821  1809 process.cpp:3731] Handling HTTP event for process 'slave(752)'
with path: '/slave(752)/containers'
I0501 21:40:25.719327  1810 http.cpp:1115] HTTP GET for /slave(752)/containers from 172.17.0.2:37858
I0501 21:40:25.719357  1810 http.cpp:936] Authorizing principal 'test-principal' to GET the
'/containers' endpoint
I0501 21:40:25.720669  1811 slave.cpp:790] Agent terminating
[       OK ] Endpoint/SlaveEndpointTest.NoAuthorizer/2 (12 ms)
[----------] 9 tests from Endpoint/SlaveEndpointTest (101 ms total)

[----------] Global test environment tear-down
[==========] 1527 tests from 169 test cases ran. (225389 ms total)
[  PASSED  ] 1526 tests.
[  FAILED  ] 1 test, listed below:
[  FAILED  ] RegisterSlaveValidationTest.DropInvalidReregistration

 1 FAILED TEST
  YOU HAVE 19 DISABLED TESTS

E0501 21:40:25.775462  1820 process.cpp:951] Failed to accept socket: future discarded
make[3]: Leaving directory `/mesos/build'
make[3]: *** [CMakeFiles/check] Error 1
make[2]: *** [CMakeFiles/check.dir/all] Error 2
make[2]: Leaving directory `/mesos/build'
make[1]: *** [CMakeFiles/check.dir/rule] Error 2
make[1]: Leaving directory `/mesos/build'
make: *** [check] Error 2
+ docker rmi mesos-1493672740-30624
Untagged: mesos-1493672740-30624:latest
Deleted: sha256:4bb2e221ef60992681c297c1704d3578b2d484ddfa87a8b58b36dacaa0b41776
Deleted: sha256:71dcbb674b77fe5871f960a89544708d3c96dd8dcbb9937cf6a8112162f421ba
Deleted: sha256:50c1abf77c0fc24a27e2fdb565f10dad1b4c2ea2f9491b16687f1427c01f7054
Deleted: sha256:63925b7b0fafe1deb1e4a9e852b0a6401800abf0ac553ef9e4750dff1284e2b8
Deleted: sha256:4421993071768accbbc1f6ce8797615ba197b1f8572e8fffaaf4c83d53461da8
Deleted: sha256:49f5ec7d8eccf89c260f69e503cee92b3c3d79b2a456d1b7b0f6e92ba182e6db
Deleted: sha256:889be3b80febff8b04a35cfe70866c0c3ce8c1e5bfbb0e331a627734fd1e8e81
Deleted: sha256:898b9b8e5e486b55858a71fd2cbbcb9f1e1a58ffca55e523f19f9e471b72b57a
Deleted: sha256:9b6eaf140bb0d7aced425c488054919601b5836d53110abd82ffb197568eccc8
Deleted: sha256:333e5a84122ffdbfa3a1b5ce6edd3e2edc82709f87daed9139ba36d736aa15b3
Deleted: sha256:0b559f122327dca73cfd200a5370e483e78ad9ee051d5207afb1b2aafc155c90
Deleted: sha256:4e6378ec98d461a4a4f06e6e649be34c5cf656362485f084e6b3bd11eae804fc
Deleted: sha256:b9675cf6599465ffe9779824521b1aae506a17268f4937a4ebf95921ac193937
Deleted: sha256:8a5330248e8204152bfa1951ac9714302170e29d797e28ea25102015ac23c61b
Deleted: sha256:6ba507c93c4fbcfe0cb3b89d90a8773a58d517fcfe2abe05fee998b1331328fc
Deleted: sha256:2bc6f3d87c9cf32f1ed8c0b864f8b26a3a5b89fc4613bc7c4d13771aa315509b
Deleted: sha256:bf5abb687903194aa88d33f0eb0e25b74d108c7a728818e5ac747b18fd7e3dc9
Deleted: sha256:b129282761def62a6c0bc6c3b864b5d8d6095c185b3b59dba44ede82450770cc
Deleted: sha256:7dd59e97604f54e5a6be2c26ba6ec3a018aaa33a2d5032cb675fa7d1042e5e42
Deleted: sha256:06d3ca2dc32c4e05a04c5f944a993a3725093acf3e810d44dd86203b4d540eed
Deleted: sha256:5449dbf12a69fff296939b51635cf2ffdc5dd7132366ac21fa244a3d2d42d9ec
Deleted: sha256:8fa09a214bc857d21db56754e966e3f903ee38141b06af4af12891094738e1ce
Deleted: sha256:96c7dc129d185dce5e6828a770c0e2534be7669923402da5dcf987263c26c603
Deleted: sha256:dc2b97d1db63685f17e76e35f73c0c79982a6cd74fdb35771f9046aa48013cdf
Build step 'Execute shell' marked build as failure
Not sending mail to unregistered user xujyan@apple.com

Mime
View raw message