mesos-builds mailing list archives

Site index · List index
Message view « Date » · « Thread »
Top « Date » · « Thread »
From Apache Jenkins Server <jenk...@builds.apache.org>
Subject Build failed in Jenkins: Mesos-Buildbot » autotools,gcc,--verbose --enable-libevent --enable-ssl,GLOG_v=1 MESOS_VERBOSE=1,ubuntu:14.04,(docker||Hadoop)&&(!ubuntu-us1)&&(!ubuntu-eu2) #3731
Date Fri, 26 May 2017 21:17:06 GMT
See <https://builds.apache.org/job/Mesos-Buildbot/BUILDTOOL=autotools,COMPILER=gcc,CONFIGURATION=--verbose%20--enable-libevent%20--enable-ssl,ENVIRONMENT=GLOG_v=1%20MESOS_VERBOSE=1,OS=ubuntu%3A14.04,label_exp=(docker%7C%7CHadoop)&&(!ubuntu-us1)&&(!ubuntu-eu2)/3731/display/redirect?page=changes>

Changes:

[anand] Update vendored protobuf tar.gz to 3.3.0.

[anand] Remove unnecessary patch after protobuf upgrade to 3.3.0.

[anand] Update 3rdparty build to support protobuf 3.3.0.

[anand] Update related tests in stout to support protobuf 3.3.0.

[anand] Updated Mesos build library to use protobuf 3.3.0.

[anand] Added a test for evolving large protobuf message.

[anand] Updated LICENSE information for protobuf 3.3.0.

------------------------------------------
[...truncated 28.74 MB...]
I0526 21:16:44.944816 25054 slave.cpp:6269] Received oversubscribable resources {} from the
resource estimator
I0526 21:16:44.950420 25058 process.cpp:3730] Handling HTTP event for process 'slave(753)'
with path: '/slave(753)/containers'
I0526 21:16:44.953955 25058 http.cpp:1115] HTTP GET for /slave(753)/containers from 172.17.0.3:35558
I0526 21:16:44.954491 25058 http.cpp:936] Authorizing principal 'test-principal' to GET the
'/containers' endpoint
I0526 21:16:44.968672 25061 slave.cpp:801] Agent terminating
[       OK ] Endpoint/SlaveEndpointTest.AuthorizedRequest/2 (55 ms)
[ RUN      ] Endpoint/SlaveEndpointTest.UnauthorizedRequest/0
I0526 21:16:44.983141  6923 containerizer.cpp:230] Using isolation: posix/cpu,posix/mem,filesystem/posix,network/cni,environment_secret
W0526 21:16:44.983649  6923 backend.cpp:76] Failed to create 'aufs' backend: AufsBackend requires
root privileges
W0526 21:16:44.983753  6923 backend.cpp:76] Failed to create 'bind' backend: BindBackend requires
root privileges
I0526 21:16:44.983788  6923 provisioner.cpp:255] Using default backend 'copy'
I0526 21:16:44.987035 25056 slave.cpp:232] Mesos agent started on (754)@172.17.0.3:36006
I0526 21:16:44.987061 25056 slave.cpp:233] Flags at startup: --acls="" --appc_simple_discovery_uri_prefix="http://"
--appc_store_dir="/tmp/mesos/store/appc" --authenticate_http_executors="true" --authenticate_http_readonly="true"
--authenticate_http_readwrite="true" --authenticatee="crammd5" --authentication_backoff_factor="1secs"
--authorizer="local" --cgroups_cpu_enable_pids_and_tids_count="false" --cgroups_enable_cfs="false"
--cgroups_hierarchy="/sys/fs/cgroup" --cgroups_limit_swap="false" --cgroups_root="mesos" --container_disk_watch_interval="15secs"
--containerizers="mesos" --credential="/tmp/Endpoint_SlaveEndpointTest_UnauthorizedRequest_0_7nhNRF/credential"
--default_role="*" --disk_watch_interval="1mins" --docker="docker" --docker_kill_orphans="true"
--docker_registry="https://registry-1.docker.io" --docker_remove_delay="6hrs" --docker_socket="/var/run/docker.sock"
--docker_stop_timeout="0ns" --docker_store_dir="/tmp/mesos/store/docker" --docker_volume_checkpoint_dir="/var/run/mesos/isolators/docker/volume"
--enforce_container_disk_quota="false" --executor_registration_timeout="1mins" --executor_reregistration_timeout="2secs"
--executor_secret_key="/tmp/Endpoint_SlaveEndpointTest_UnauthorizedRequest_0_7nhNRF/executor_secret_key"
--executor_shutdown_grace_period="5secs" --fetcher_cache_dir="/tmp/Endpoint_SlaveEndpointTest_UnauthorizedRequest_0_7nhNRF/fetch"
--fetcher_cache_size="2GB" --frameworks_home="" --gc_delay="1weeks" --gc_disk_headroom="0.1"
--hadoop_home="" --help="false" --hostname_lookup="true" --http_command_executor="false" --http_credentials="/tmp/Endpoint_SlaveEndpointTest_UnauthorizedRequest_0_7nhNRF/http_credentials"
--http_heartbeat_interval="30secs" --initialize_driver_logging="true" --isolation="posix/cpu,posix/mem"
--launcher="posix" --launcher_dir="/mesos/mesos-1.4.0/_build/src" --logbufsecs="0" --logging_level="INFO"
--max_completed_executors_per_framework="150" --oversubscribed_resources_interval="15secs"
--perf_duration="10secs" --perf_interval="1mins" --port="5051" --qos_correction_interval_min="0ns"
--quiet="false" --recover="reconnect" --recovery_timeout="15mins" --registration_backoff_factor="10ms"
--resources="cpus:2;gpus:0;mem:1024;disk:1024;ports:[31000-32000]" --revocable_cpu_low_priority="true"
--runtime_dir="/tmp/Endpoint_SlaveEndpointTest_UnauthorizedRequest_0_7nhNRF" --sandbox_directory="/mnt/mesos/sandbox"
--strict="true" --switch_user="true" --systemd_enable_support="true" --systemd_runtime_directory="/run/systemd/system"
--version="false" --work_dir="/tmp/Endpoint_SlaveEndpointTest_UnauthorizedRequest_0_eunuYO"
I0526 21:16:44.987460 25056 credentials.hpp:86] Loading credential for authentication from
'/tmp/Endpoint_SlaveEndpointTest_UnauthorizedRequest_0_7nhNRF/credential'
I0526 21:16:45.008656 25056 slave.cpp:265] Agent using credential for: test-principal
I0526 21:16:45.008839 25056 credentials.hpp:37] Loading credentials for authentication from
'/tmp/Endpoint_SlaveEndpointTest_UnauthorizedRequest_0_7nhNRF/http_credentials'
I0526 21:16:45.009168 25056 http.cpp:975] Creating default 'basic' HTTP authenticator for
realm 'mesos-agent-executor'
I0526 21:16:45.009359 25056 http.cpp:996] Creating default 'jwt' HTTP authenticator for realm
'mesos-agent-executor'
I0526 21:16:45.009763 25056 http.cpp:975] Creating default 'basic' HTTP authenticator for
realm 'mesos-agent-readonly'
I0526 21:16:45.009847 25056 http.cpp:996] Creating default 'jwt' HTTP authenticator for realm
'mesos-agent-readonly'
I0526 21:16:45.010115 25056 http.cpp:975] Creating default 'basic' HTTP authenticator for
realm 'mesos-agent-readwrite'
I0526 21:16:45.010236 25056 http.cpp:996] Creating default 'jwt' HTTP authenticator for realm
'mesos-agent-readwrite'
I0526 21:16:45.011718 25056 slave.cpp:536] Agent resources: cpus(*):2; mem(*):1024; disk(*):1024;
ports(*):[31000-32000]
I0526 21:16:45.011791 25056 slave.cpp:544] Agent attributes: [  ]
I0526 21:16:45.011811 25056 slave.cpp:549] Agent hostname: 73453c76fdc9
I0526 21:16:45.012581 25051 status_update_manager.cpp:177] Pausing sending status updates
I0526 21:16:45.013758 25061 state.cpp:62] Recovering state from '/tmp/Endpoint_SlaveEndpointTest_UnauthorizedRequest_0_eunuYO/meta'
I0526 21:16:45.014142 25053 status_update_manager.cpp:203] Recovering status update manager
I0526 21:16:45.014415 25060 containerizer.cpp:582] Recovering containerizer
I0526 21:16:45.016448 25062 provisioner.cpp:416] Provisioner recovery complete
I0526 21:16:45.017035 25064 slave.cpp:6073] Finished recovery
I0526 21:16:45.017788 25064 slave.cpp:6255] Querying resource estimator for oversubscribable
resources
I0526 21:16:45.018121 25056 slave.cpp:6269] Received oversubscribable resources {} from the
resource estimator
I0526 21:16:45.022538 25054 process.cpp:3730] Handling HTTP event for process 'slave(754)'
with path: '/slave(754)/monitor/statistics'
I0526 21:16:45.025352 25051 http.cpp:1115] HTTP GET for /slave(754)/monitor/statistics from
172.17.0.3:35565
I0526 21:16:45.025490 25051 http.cpp:936] Authorizing principal 'test-principal' to GET the
'/monitor/statistics' endpoint
I0526 21:16:45.029002 25061 slave.cpp:801] Agent terminating
[       OK ] Endpoint/SlaveEndpointTest.UnauthorizedRequest/0 (80 ms)
[ RUN      ] Endpoint/SlaveEndpointTest.UnauthorizedRequest/1
I0526 21:16:45.062876  6923 containerizer.cpp:230] Using isolation: posix/cpu,posix/mem,filesystem/posix,network/cni,environment_secret
W0526 21:16:45.063529  6923 backend.cpp:76] Failed to create 'aufs' backend: AufsBackend requires
root privileges
W0526 21:16:45.063686  6923 backend.cpp:76] Failed to create 'bind' backend: BindBackend requires
root privileges
I0526 21:16:45.063742  6923 provisioner.cpp:255] Using default backend 'copy'
I0526 21:16:45.068116 25051 slave.cpp:232] Mesos agent started on (755)@172.17.0.3:36006
I0526 21:16:45.068158 25051 slave.cpp:233] Flags at startup: --acls="" --appc_simple_discovery_uri_prefix="http://"
--appc_store_dir="/tmp/mesos/store/appc" --authenticate_http_executors="true" --authenticate_http_readonly="true"
--authenticate_http_readwrite="true" --authenticatee="crammd5" --authentication_backoff_factor="1secs"
--authorizer="local" --cgroups_cpu_enable_pids_and_tids_count="false" --cgroups_enable_cfs="false"
--cgroups_hierarchy="/sys/fs/cgroup" --cgroups_limit_swap="false" --cgroups_root="mesos" --container_disk_watch_interval="15secs"
--containerizers="mesos" --credential="/tmp/Endpoint_SlaveEndpointTest_UnauthorizedRequest_1_pDoA95/credential"
--default_role="*" --disk_watch_interval="1mins" --docker="docker" --docker_kill_orphans="true"
--docker_registry="https://registry-1.docker.io" --docker_remove_delay="6hrs" --docker_socket="/var/run/docker.sock"
--docker_stop_timeout="0ns" --docker_store_dir="/tmp/mesos/store/docker" --docker_volume_checkpoint_dir="/var/run/mesos/isolators/docker/volume"
--enforce_container_disk_quota="false" --executor_registration_timeout="1mins" --executor_reregistration_timeout="2secs"
--executor_secret_key="/tmp/Endpoint_SlaveEndpointTest_UnauthorizedRequest_1_pDoA95/executor_secret_key"
--executor_shutdown_grace_period="5secs" --fetcher_cache_dir="/tmp/Endpoint_SlaveEndpointTest_UnauthorizedRequest_1_pDoA95/fetch"
--fetcher_cache_size="2GB" --frameworks_home="" --gc_delay="1weeks" --gc_disk_headroom="0.1"
--hadoop_home="" --help="false" --hostname_lookup="true" --http_command_executor="false" --http_credentials="/tmp/Endpoint_SlaveEndpointTest_UnauthorizedRequest_1_pDoA95/http_credentials"
--http_heartbeat_interval="30secs" --initialize_driver_logging="true" --isolation="posix/cpu,posix/mem"
--launcher="posix" --launcher_dir="/mesos/mesos-1.4.0/_build/src" --logbufsecs="0" --logging_level="INFO"
--max_completed_executors_per_framework="150" --oversubscribed_resources_interval="15secs"
--perf_duration="10secs" --perf_interval="1mins" --port="5051" --qos_correction_interval_min="0ns"
--quiet="false" --recover="reconnect" --recovery_timeout="15mins" --registration_backoff_factor="10ms"
--resources="cpus:2;gpus:0;mem:1024;disk:1024;ports:[31000-32000]" --revocable_cpu_low_priority="true"
--runtime_dir="/tmp/Endpoint_SlaveEndpointTest_UnauthorizedRequest_1_pDoA95" --sandbox_directory="/mnt/mesos/sandbox"
--strict="true" --switch_user="true" --systemd_enable_support="true" --systemd_runtime_directory="/run/systemd/system"
--version="false" --work_dir="/tmp/Endpoint_SlaveEndpointTest_UnauthorizedRequest_1_Esmk3e"
I0526 21:16:45.068861 25051 credentials.hpp:86] Loading credential for authentication from
'/tmp/Endpoint_SlaveEndpointTest_UnauthorizedRequest_1_pDoA95/credential'
I0526 21:16:45.069114 25051 slave.cpp:265] Agent using credential for: test-principal
I0526 21:16:45.069136 25051 credentials.hpp:37] Loading credentials for authentication from
'/tmp/Endpoint_SlaveEndpointTest_UnauthorizedRequest_1_pDoA95/http_credentials'
I0526 21:16:45.069469 25051 http.cpp:975] Creating default 'basic' HTTP authenticator for
realm 'mesos-agent-executor'
I0526 21:16:45.069619 25051 http.cpp:996] Creating default 'jwt' HTTP authenticator for realm
'mesos-agent-executor'
I0526 21:16:45.069829 25051 http.cpp:975] Creating default 'basic' HTTP authenticator for
realm 'mesos-agent-readonly'
I0526 21:16:45.069911 25051 http.cpp:996] Creating default 'jwt' HTTP authenticator for realm
'mesos-agent-readonly'
I0526 21:16:45.070147 25051 http.cpp:975] Creating default 'basic' HTTP authenticator for
realm 'mesos-agent-readwrite'
I0526 21:16:45.070336 25051 http.cpp:996] Creating default 'jwt' HTTP authenticator for realm
'mesos-agent-readwrite'
I0526 21:16:45.072293 25051 slave.cpp:536] Agent resources: cpus(*):2; mem(*):1024; disk(*):1024;
ports(*):[31000-32000]
I0526 21:16:45.072430 25051 slave.cpp:544] Agent attributes: [  ]
I0526 21:16:45.072458 25051 slave.cpp:549] Agent hostname: 73453c76fdc9
I0526 21:16:45.072718 25052 status_update_manager.cpp:177] Pausing sending status updates
I0526 21:16:45.074537 25063 state.cpp:62] Recovering state from '/tmp/Endpoint_SlaveEndpointTest_UnauthorizedRequest_1_Esmk3e/meta'
I0526 21:16:45.075003 25052 status_update_manager.cpp:203] Recovering status update manager
I0526 21:16:45.075299 25056 containerizer.cpp:582] Recovering containerizer
I0526 21:16:45.077205 25058 provisioner.cpp:416] Provisioner recovery complete
I0526 21:16:45.077579 25052 slave.cpp:6073] Finished recovery
I0526 21:16:45.078172 25052 slave.cpp:6255] Querying resource estimator for oversubscribable
resources
I0526 21:16:45.078541 25057 slave.cpp:6269] Received oversubscribable resources {} from the
resource estimator
I0526 21:16:45.081606 25062 process.cpp:3730] Handling HTTP event for process 'slave(755)'
with path: '/slave(755)/monitor/statistics.json'
I0526 21:16:45.084766 25061 http.cpp:1115] HTTP GET for /slave(755)/monitor/statistics.json
from 172.17.0.3:35566
I0526 21:16:45.084877 25061 http.cpp:936] Authorizing principal 'test-principal' to GET the
'/monitor/statistics.json' endpoint
I0526 21:16:45.088469 25064 slave.cpp:801] Agent terminating
[       OK ] Endpoint/SlaveEndpointTest.UnauthorizedRequest/1 (54 ms)
[ RUN      ] Endpoint/SlaveEndpointTest.UnauthorizedRequest/2
I0526 21:16:45.117363  6923 containerizer.cpp:230] Using isolation: posix/cpu,posix/mem,filesystem/posix,network/cni,environment_secret
W0526 21:16:45.117815  6923 backend.cpp:76] Failed to create 'aufs' backend: AufsBackend requires
root privileges
W0526 21:16:45.117911  6923 backend.cpp:76] Failed to create 'bind' backend: BindBackend requires
root privileges
I0526 21:16:45.117954  6923 provisioner.cpp:255] Using default backend 'copy'
I0526 21:16:45.122625 25057 slave.cpp:232] Mesos agent started on (756)@172.17.0.3:36006
I0526 21:16:45.122649 25057 slave.cpp:233] Flags at startup: --acls="" --appc_simple_discovery_uri_prefix="http://"
--appc_store_dir="/tmp/mesos/store/appc" --authenticate_http_executors="true" --authenticate_http_readonly="true"
--authenticate_http_readwrite="true" --authenticatee="crammd5" --authentication_backoff_factor="1secs"
--authorizer="local" --cgroups_cpu_enable_pids_and_tids_count="false" --cgroups_enable_cfs="false"
--cgroups_hierarchy="/sys/fs/cgroup" --cgroups_limit_swap="false" --cgroups_root="mesos" --container_disk_watch_interval="15secs"
--containerizers="mesos" --credential="/tmp/Endpoint_SlaveEndpointTest_UnauthorizedRequest_2_dBlN1w/credential"
--default_role="*" --disk_watch_interval="1mins" --docker="docker" --docker_kill_orphans="true"
--docker_registry="https://registry-1.docker.io" --docker_remove_delay="6hrs" --docker_socket="/var/run/docker.sock"
--docker_stop_timeout="0ns" --docker_store_dir="/tmp/mesos/store/docker" --docker_volume_checkpoint_dir="/var/run/mesos/isolators/docker/volume"
--enforce_container_disk_quota="false" --executor_registration_timeout="1mins" --executor_reregistration_timeout="2secs"
--executor_secret_key="/tmp/Endpoint_SlaveEndpointTest_UnauthorizedRequest_2_dBlN1w/executor_secret_key"
--executor_shutdown_grace_period="5secs" --fetcher_cache_dir="/tmp/Endpoint_SlaveEndpointTest_UnauthorizedRequest_2_dBlN1w/fetch"
--fetcher_cache_size="2GB" --frameworks_home="" --gc_delay="1weeks" --gc_disk_headroom="0.1"
--hadoop_home="" --help="false" --hostname_lookup="true" --http_command_executor="false" --http_credentials="/tmp/Endpoint_SlaveEndpointTest_UnauthorizedRequest_2_dBlN1w/http_credentials"
--http_heartbeat_interval="30secs" --initialize_driver_logging="true" --isolation="posix/cpu,posix/mem"
--launcher="posix" --launcher_dir="/mesos/mesos-1.4.0/_build/src" --logbufsecs="0" --logging_level="INFO"
--max_completed_executors_per_framework="150" --oversubscribed_resources_interval="15secs"
--perf_duration="10secs" --perf_interval="1mins" --port="5051" --qos_correction_interval_min="0ns"
--quiet="false" --recover="reconnect" --recovery_timeout="15mins" --registration_backoff_factor="10ms"
--resources="cpus:2;gpus:0;mem:1024;disk:1024;ports:[31000-32000]" --revocable_cpu_low_priority="true"
--runtime_dir="/tmp/Endpoint_SlaveEndpointTest_UnauthorizedRequest_2_dBlN1w" --sandbox_directory="/mnt/mesos/sandbox"
--strict="true" --switch_user="true" --systemd_enable_support="true" --systemd_runtime_directory="/run/systemd/system"
--version="false" --work_dir="/tmp/Endpoint_SlaveEndpointTest_UnauthorizedRequest_2_oo5DMF"
I0526 21:16:45.123155 25057 credentials.hpp:86] Loading credential for authentication from
'/tmp/Endpoint_SlaveEndpointTest_UnauthorizedRequest_2_dBlN1w/credential'
I0526 21:16:45.123348 25057 slave.cpp:265] Agent using credential for: test-principal
I0526 21:16:45.123371 25057 credentials.hpp:37] Loading credentials for authentication from
'/tmp/Endpoint_SlaveEndpointTest_UnauthorizedRequest_2_dBlN1w/http_credentials'
I0526 21:16:45.123695 25057 http.cpp:975] Creating default 'basic' HTTP authenticator for
realm 'mesos-agent-executor'
I0526 21:16:45.123845 25057 http.cpp:996] Creating default 'jwt' HTTP authenticator for realm
'mesos-agent-executor'
I0526 21:16:45.124120 25057 http.cpp:975] Creating default 'basic' HTTP authenticator for
realm 'mesos-agent-readonly'
I0526 21:16:45.124223 25057 http.cpp:996] Creating default 'jwt' HTTP authenticator for realm
'mesos-agent-readonly'
I0526 21:16:45.124464 25057 http.cpp:975] Creating default 'basic' HTTP authenticator for
realm 'mesos-agent-readwrite'
I0526 21:16:45.124555 25057 http.cpp:996] Creating default 'jwt' HTTP authenticator for realm
'mesos-agent-readwrite'
I0526 21:16:45.125885 25057 slave.cpp:536] Agent resources: cpus(*):2; mem(*):1024; disk(*):1024;
ports(*):[31000-32000]
I0526 21:16:45.125957 25057 slave.cpp:544] Agent attributes: [  ]
I0526 21:16:45.125969 25057 slave.cpp:549] Agent hostname: 73453c76fdc9
I0526 21:16:45.126130 25058 status_update_manager.cpp:177] Pausing sending status updates
I0526 21:16:45.127729 25053 state.cpp:62] Recovering state from '/tmp/Endpoint_SlaveEndpointTest_UnauthorizedRequest_2_oo5DMF/meta'
I0526 21:16:45.128108 25058 status_update_manager.cpp:203] Recovering status update manager
I0526 21:16:45.128355 25063 containerizer.cpp:582] Recovering containerizer
I0526 21:16:45.129750 25055 provisioner.cpp:416] Provisioner recovery complete
I0526 21:16:45.130121 25057 slave.cpp:6073] Finished recovery
I0526 21:16:45.130612 25057 slave.cpp:6255] Querying resource estimator for oversubscribable
resources
I0526 21:16:45.130892 25062 slave.cpp:6269] Received oversubscribable resources {} from the
resource estimator
I0526 21:16:45.133100 25060 process.cpp:3730] Handling HTTP event for process 'slave(756)'
with path: '/slave(756)/containers'
I0526 21:16:45.135416 25055 http.cpp:1115] HTTP GET for /slave(756)/containers from 172.17.0.3:35570
I0526 21:16:45.135493 25055 http.cpp:936] Authorizing principal 'test-principal' to GET the
'/containers' endpoint
I0526 21:16:45.138211 25050 slave.cpp:801] Agent terminating
[       OK ] Endpoint/SlaveEndpointTest.UnauthorizedRequest/2 (49 ms)
[ RUN      ] Endpoint/SlaveEndpointTest.NoAuthorizer/0
I0526 21:16:45.168020  6923 containerizer.cpp:230] Using isolation: posix/cpu,posix/mem,filesystem/posix,network/cni,environment_secret
W0526 21:16:45.168557  6923 backend.cpp:76] Failed to create 'aufs' backend: AufsBackend requires
root privileges
W0526 21:16:45.168676  6923 backend.cpp:76] Failed to create 'bind' backend: BindBackend requires
root privileges
I0526 21:16:45.168772  6923 provisioner.cpp:255] Using default backend 'copy'
I0526 21:16:45.170992  6923 cluster.cpp:448] Creating default 'local' authorizer
I0526 21:16:45.172503 25051 slave.cpp:232] Mesos agent started on (757)@172.17.0.3:36006
I0526 21:16:45.172533 25051 slave.cpp:233] Flags at startup: --acls="" --appc_simple_discovery_uri_prefix="http://"
--appc_store_dir="/tmp/mesos/store/appc" --authenticate_http_executors="true" --authenticate_http_readonly="true"
--authenticate_http_readwrite="true" --authenticatee="crammd5" --authentication_backoff_factor="1secs"
--authorizer="local" --cgroups_cpu_enable_pids_and_tids_count="false" --cgroups_enable_cfs="false"
--cgroups_hierarchy="/sys/fs/cgroup" --cgroups_limit_swap="false" --cgroups_root="mesos" --container_disk_watch_interval="15secs"
--containerizers="mesos" --credential="/tmp/Endpoint_SlaveEndpointTest_NoAuthorizer_0_JPxVqY/credential"
--default_role="*" --disk_watch_interval="1mins" --docker="docker" --docker_kill_orphans="true"
--docker_registry="https://registry-1.docker.io" --docker_remove_delay="6hrs" --docker_socket="/var/run/docker.sock"
--docker_stop_timeout="0ns" --docker_store_dir="/tmp/mesos/store/docker" --docker_volume_checkpoint_dir="/var/run/mesos/isolators/docker/volume"
--enforce_container_disk_quota="false" --executor_registration_timeout="1mins" --executor_reregistration_timeout="2secs"
--executor_secret_key="/tmp/Endpoint_SlaveEndpointTest_NoAuthorizer_0_JPxVqY/executor_secret_key"
--executor_shutdown_grace_period="5secs" --fetcher_cache_dir="/tmp/Endpoint_SlaveEndpointTest_NoAuthorizer_0_JPxVqY/fetch"
--fetcher_cache_size="2GB" --frameworks_home="" --gc_delay="1weeks" --gc_disk_headroom="0.1"
--hadoop_home="" --help="false" --hostname_lookup="true" --http_command_executor="false" --http_credentials="/tmp/Endpoint_SlaveEndpointTest_NoAuthorizer_0_JPxVqY/http_credentials"
--http_heartbeat_interval="30secs" --initialize_driver_logging="true" --isolation="posix/cpu,posix/mem"
--launcher="posix" --launcher_dir="/mesos/mesos-1.4.0/_build/src" --logbufsecs="0" --logging_level="INFO"
--max_completed_executors_per_framework="150" --oversubscribed_resources_interval="15secs"
--perf_duration="10secs" --perf_interval="1mins" --port="5051" --qos_correction_interval_min="0ns"
--quiet="false" --recover="reconnect" --recovery_timeout="15mins" --registration_backoff_factor="10ms"
--resources="cpus:2;gpus:0;mem:1024;disk:1024;ports:[31000-32000]" --revocable_cpu_low_priority="true"
--runtime_dir="/tmp/Endpoint_SlaveEndpointTest_NoAuthorizer_0_JPxVqY" --sandbox_directory="/mnt/mesos/sandbox"
--strict="true" --switch_user="true" --systemd_enable_support="true" --systemd_runtime_directory="/run/systemd/system"
--version="false" --work_dir="/tmp/Endpoint_SlaveEndpointTest_NoAuthorizer_0_WlJD36"
I0526 21:16:45.173259 25051 credentials.hpp:86] Loading credential for authentication from
'/tmp/Endpoint_SlaveEndpointTest_NoAuthorizer_0_JPxVqY/credential'
I0526 21:16:45.173493 25051 slave.cpp:265] Agent using credential for: test-principal
I0526 21:16:45.173521 25051 credentials.hpp:37] Loading credentials for authentication from
'/tmp/Endpoint_SlaveEndpointTest_NoAuthorizer_0_JPxVqY/http_credentials'
I0526 21:16:45.173893 25051 http.cpp:975] Creating default 'basic' HTTP authenticator for
realm 'mesos-agent-executor'
I0526 21:16:45.174018 25051 http.cpp:996] Creating default 'jwt' HTTP authenticator for realm
'mesos-agent-executor'
I0526 21:16:45.174243 25051 http.cpp:975] Creating default 'basic' HTTP authenticator for
realm 'mesos-agent-readonly'
I0526 21:16:45.174346 25051 http.cpp:996] Creating default 'jwt' HTTP authenticator for realm
'mesos-agent-readonly'
I0526 21:16:45.174576 25051 http.cpp:975] Creating default 'basic' HTTP authenticator for
realm 'mesos-agent-readwrite'
I0526 21:16:45.174666 25051 http.cpp:996] Creating default 'jwt' HTTP authenticator for realm
'mesos-agent-readwrite'
I0526 21:16:45.176084 25051 slave.cpp:536] Agent resources: cpus(*):2; mem(*):1024; disk(*):1024;
ports(*):[31000-32000]
I0526 21:16:45.176156 25051 slave.cpp:544] Agent attributes: [  ]
I0526 21:16:45.176169 25051 slave.cpp:549] Agent hostname: 73453c76fdc9
I0526 21:16:45.176407 25050 status_update_manager.cpp:177] Pausing sending status updates
I0526 21:16:45.178035 25056 state.cpp:62] Recovering state from '/tmp/Endpoint_SlaveEndpointTest_NoAuthorizer_0_WlJD36/meta'
I0526 21:16:45.178445 25053 status_update_manager.cpp:203] Recovering status update manager
I0526 21:16:45.178642 25053 containerizer.cpp:582] Recovering containerizer
I0526 21:16:45.180367 25057 provisioner.cpp:416] Provisioner recovery complete
I0526 21:16:45.180779 25055 slave.cpp:6073] Finished recovery
I0526 21:16:45.181434 25055 slave.cpp:6255] Querying resource estimator for oversubscribable
resources
I0526 21:16:45.181813 25059 slave.cpp:6269] Received oversubscribable resources {} from the
resource estimator
I0526 21:16:45.184633 25057 process.cpp:3730] Handling HTTP event for process 'slave(757)'
with path: '/slave(757)/monitor/statistics'
I0526 21:16:45.187026 25061 http.cpp:1115] HTTP GET for /slave(757)/monitor/statistics from
172.17.0.3:35571
I0526 21:16:45.187162 25061 http.cpp:936] Authorizing principal 'test-principal' to GET the
'/monitor/statistics' endpoint
I0526 21:16:45.190798 25052 slave.cpp:801] Agent terminating
[       OK ] Endpoint/SlaveEndpointTest.NoAuthorizer/0 (44 ms)
[ RUN      ] Endpoint/SlaveEndpointTest.NoAuthorizer/1
I0526 21:16:45.211833  6923 containerizer.cpp:230] Using isolation: posix/cpu,posix/mem,filesystem/posix,network/cni,environment_secret
W0526 21:16:45.212324  6923 backend.cpp:76] Failed to create 'aufs' backend: AufsBackend requires
root privileges
W0526 21:16:45.212435  6923 backend.cpp:76] Failed to create 'bind' backend: BindBackend requires
root privileges
I0526 21:16:45.212471  6923 provisioner.cpp:255] Using default backend 'copy'
I0526 21:16:45.214197  6923 cluster.cpp:448] Creating default 'local' authorizer
I0526 21:16:45.215781 25063 slave.cpp:232] Mesos agent started on (758)@172.17.0.3:36006
I0526 21:16:45.215847 25063 slave.cpp:233] Flags at startup: --acls="" --appc_simple_discovery_uri_prefix="http://"
--appc_store_dir="/tmp/mesos/store/appc" --authenticate_http_executors="true" --authenticate_http_readonly="true"
--authenticate_http_readwrite="true" --authenticatee="crammd5" --authentication_backoff_factor="1secs"
--authorizer="local" --cgroups_cpu_enable_pids_and_tids_count="false" --cgroups_enable_cfs="false"
--cgroups_hierarchy="/sys/fs/cgroup" --cgroups_limit_swap="false" --cgroups_root="mesos" --container_disk_watch_interval="15secs"
--containerizers="mesos" --credential="/tmp/Endpoint_SlaveEndpointTest_NoAuthorizer_1_xzyVjq/credential"
--default_role="*" --disk_watch_interval="1mins" --docker="docker" --docker_kill_orphans="true"
--docker_registry="https://registry-1.docker.io" --docker_remove_delay="6hrs" --docker_socket="/var/run/docker.sock"
--docker_stop_timeout="0ns" --docker_store_dir="/tmp/mesos/store/docker" --docker_volume_checkpoint_dir="/var/run/mesos/isolators/docker/volume"
--enforce_container_disk_quota="false" --executor_registration_timeout="1mins" --executor_reregistration_timeout="2secs"
--executor_secret_key="/tmp/Endpoint_SlaveEndpointTest_NoAuthorizer_1_xzyVjq/executor_secret_key"
--executor_shutdown_grace_period="5secs" --fetcher_cache_dir="/tmp/Endpoint_SlaveEndpointTest_NoAuthorizer_1_xzyVjq/fetch"
--fetcher_cache_size="2GB" --frameworks_home="" --gc_delay="1weeks" --gc_disk_headroom="0.1"
--hadoop_home="" --help="false" --hostname_lookup="true" --http_command_executor="false" --http_credentials="/tmp/Endpoint_SlaveEndpointTest_NoAuthorizer_1_xzyVjq/http_credentials"
--http_heartbeat_interval="30secs" --initialize_driver_logging="true" --isolation="posix/cpu,posix/mem"
--launcher="posix" --launcher_dir="/mesos/mesos-1.4.0/_build/src" --logbufsecs="0" --logging_level="INFO"
--max_completed_executors_per_framework="150" --oversubscribed_resources_interval="15secs"
--perf_duration="10secs" --perf_interval="1mins" --port="5051" --qos_correction_interval_min="0ns"
--quiet="false" --recover="reconnect" --recovery_timeout="15mins" --registration_backoff_factor="10ms"
--resources="cpus:2;gpus:0;mem:1024;disk:1024;ports:[31000-32000]" --revocable_cpu_low_priority="true"
--runtime_dir="/tmp/Endpoint_SlaveEndpointTest_NoAuthorizer_1_xzyVjq" --sandbox_directory="/mnt/mesos/sandbox"
--strict="true" --switch_user="true" --systemd_enable_support="true" --systemd_runtime_directory="/run/systemd/system"
--version="false" --work_dir="/tmp/Endpoint_SlaveEndpointTest_NoAuthorizer_1_cKmsPy"
I0526 21:16:45.216369 25063 credentials.hpp:86] Loading credential for authentication from
'/tmp/Endpoint_SlaveEndpointTest_NoAuthorizer_1_xzyVjq/credential'
I0526 21:16:45.216601 25063 slave.cpp:265] Agent using credential for: test-principal
I0526 21:16:45.216626 25063 credentials.hpp:37] Loading credentials for authentication from
'/tmp/Endpoint_SlaveEndpointTest_NoAuthorizer_1_xzyVjq/http_credentials'
I0526 21:16:45.216987 25063 http.cpp:975] Creating default 'basic' HTTP authenticator for
realm 'mesos-agent-executor'
I0526 21:16:45.217125 25063 http.cpp:996] Creating default 'jwt' HTTP authenticator for realm
'mesos-agent-executor'
I0526 21:16:45.217375 25063 http.cpp:975] Creating default 'basic' HTTP authenticator for
realm 'mesos-agent-readonly'
I0526 21:16:45.217471 25063 http.cpp:996] Creating default 'jwt' HTTP authenticator for realm
'mesos-agent-readonly'
I0526 21:16:45.217722 25063 http.cpp:975] Creating default 'basic' HTTP authenticator for
realm 'mesos-agent-readwrite'
I0526 21:16:45.217819 25063 http.cpp:996] Creating default 'jwt' HTTP authenticator for realm
'mesos-agent-readwrite'
I0526 21:16:45.219265 25063 slave.cpp:536] Agent resources: cpus(*):2; mem(*):1024; disk(*):1024;
ports(*):[31000-32000]
I0526 21:16:45.219339 25063 slave.cpp:544] Agent attributes: [  ]
I0526 21:16:45.219352 25063 slave.cpp:549] Agent hostname: 73453c76fdc9
I0526 21:16:45.219517 25050 status_update_manager.cpp:177] Pausing sending status updates
I0526 21:16:45.221050 25059 state.cpp:62] Recovering state from '/tmp/Endpoint_SlaveEndpointTest_NoAuthorizer_1_cKmsPy/meta'
I0526 21:16:45.221335 25052 status_update_manager.cpp:203] Recovering status update manager
I0526 21:16:45.221639 25050 containerizer.cpp:582] Recovering containerizer
I0526 21:16:45.223361 25059 provisioner.cpp:416] Provisioner recovery complete
I0526 21:16:45.223757 25063 slave.cpp:6073] Finished recovery
I0526 21:16:45.224306 25063 slave.cpp:6255] Querying resource estimator for oversubscribable
resources
I0526 21:16:45.224601 25049 slave.cpp:6269] Received oversubscribable resources {} from the
resource estimator
I0526 21:16:45.227746 25060 process.cpp:3730] Handling HTTP event for process 'slave(758)'
with path: '/slave(758)/monitor/statistics.json'
I0526 21:16:45.230394 25063 http.cpp:1115] HTTP GET for /slave(758)/monitor/statistics.json
from 172.17.0.3:35572
I0526 21:16:45.230535 25063 http.cpp:936] Authorizing principal 'test-principal' to GET the
'/monitor/statistics.json' endpoint
I0526 21:16:45.234591  6923 slave.cpp:801] Agent terminating
[       OK ] Endpoint/SlaveEndpointTest.NoAuthorizer/1 (51 ms)
[ RUN      ] Endpoint/SlaveEndpointTest.NoAuthorizer/2
I0526 21:16:45.263175  6923 containerizer.cpp:230] Using isolation: posix/cpu,posix/mem,filesystem/posix,network/cni,environment_secret
W0526 21:16:45.263689  6923 backend.cpp:76] Failed to create 'aufs' backend: AufsBackend requires
root privileges
W0526 21:16:45.263801  6923 backend.cpp:76] Failed to create 'bind' backend: BindBackend requires
root privileges
I0526 21:16:45.263844  6923 provisioner.cpp:255] Using default backend 'copy'
I0526 21:16:45.265482  6923 cluster.cpp:448] Creating default 'local' authorizer
I0526 21:16:45.267019 25063 slave.cpp:232] Mesos agent started on (759)@172.17.0.3:36006
I0526 21:16:45.267042 25063 slave.cpp:233] Flags at startup: --acls="" --appc_simple_discovery_uri_prefix="http://"
--appc_store_dir="/tmp/mesos/store/appc" --authenticate_http_executors="true" --authenticate_http_readonly="true"
--authenticate_http_readwrite="true" --authenticatee="crammd5" --authentication_backoff_factor="1secs"
--authorizer="local" --cgroups_cpu_enable_pids_and_tids_count="false" --cgroups_enable_cfs="false"
--cgroups_hierarchy="/sys/fs/cgroup" --cgroups_limit_swap="false" --cgroups_root="mesos" --container_disk_watch_interval="15secs"
--containerizers="mesos" --credential="/tmp/Endpoint_SlaveEndpointTest_NoAuthorizer_2_IJzWIS/credential"
--default_role="*" --disk_watch_interval="1mins" --docker="docker" --docker_kill_orphans="true"
--docker_registry="https://registry-1.docker.io" --docker_remove_delay="6hrs" --docker_socket="/var/run/docker.sock"
--docker_stop_timeout="0ns" --docker_store_dir="/tmp/mesos/store/docker" --docker_volume_checkpoint_dir="/var/run/mesos/isolators/docker/volume"
--enforce_container_disk_quota="false" --executor_registration_timeout="1mins" --executor_reregistration_timeout="2secs"
--executor_secret_key="/tmp/Endpoint_SlaveEndpointTest_NoAuthorizer_2_IJzWIS/executor_secret_key"
--executor_shutdown_grace_period="5secs" --fetcher_cache_dir="/tmp/Endpoint_SlaveEndpointTest_NoAuthorizer_2_IJzWIS/fetch"
--fetcher_cache_size="2GB" --frameworks_home="" --gc_delay="1weeks" --gc_disk_headroom="0.1"
--hadoop_home="" --help="false" --hostname_lookup="true" --http_command_executor="false" --http_credentials="/tmp/Endpoint_SlaveEndpointTest_NoAuthorizer_2_IJzWIS/http_credentials"
--http_heartbeat_interval="30secs" --initialize_driver_logging="true" --isolation="posix/cpu,posix/mem"
--launcher="posix" --launcher_dir="/mesos/mesos-1.4.0/_build/src" --logbufsecs="0" --logging_level="INFO"
--max_completed_executors_per_framework="150" --oversubscribed_resources_interval="15secs"
--perf_duration="10secs" --perf_interval="1mins" --port="5051" --qos_correction_interval_min="0ns"
--quiet="false" --recover="reconnect" --recovery_timeout="15mins" --registration_backoff_factor="10ms"
--resources="cpus:2;gpus:0;mem:1024;disk:1024;ports:[31000-32000]" --revocable_cpu_low_priority="true"
--runtime_dir="/tmp/Endpoint_SlaveEndpointTest_NoAuthorizer_2_IJzWIS" --sandbox_directory="/mnt/mesos/sandbox"
--strict="true" --switch_user="true" --systemd_enable_support="true" --systemd_runtime_directory="/run/systemd/system"
--version="false" --work_dir="/tmp/Endpoint_SlaveEndpointTest_NoAuthorizer_2_DzP750"
I0526 21:16:45.267491 25063 credentials.hpp:86] Loading credential for authentication from
'/tmp/Endpoint_SlaveEndpointTest_NoAuthorizer_2_IJzWIS/credential'
I0526 21:16:45.267673 25063 slave.cpp:265] Agent using credential for: test-principal
I0526 21:16:45.267693 25063 credentials.hpp:37] Loading credentials for authentication from
'/tmp/Endpoint_SlaveEndpointTest_NoAuthorizer_2_IJzWIS/http_credentials'
I0526 21:16:45.268050 25063 http.cpp:975] Creating default 'basic' HTTP authenticator for
realm 'mesos-agent-executor'
I0526 21:16:45.268189 25063 http.cpp:996] Creating default 'jwt' HTTP authenticator for realm
'mesos-agent-executor'
I0526 21:16:45.268437 25063 http.cpp:975] Creating default 'basic' HTTP authenticator for
realm 'mesos-agent-readonly'
I0526 21:16:45.268535 25063 http.cpp:996] Creating default 'jwt' HTTP authenticator for realm
'mesos-agent-readonly'
I0526 21:16:45.268685 25063 http.cpp:975] Creating default 'basic' HTTP authenticator for
realm 'mesos-agent-readwrite'
I0526 21:16:45.268774 25063 http.cpp:996] Creating default 'jwt' HTTP authenticator for realm
'mesos-agent-readwrite'
I0526 21:16:45.270009 25063 slave.cpp:536] Agent resources: cpus(*):2; mem(*):1024; disk(*):1024;
ports(*):[31000-32000]
I0526 21:16:45.270077 25063 slave.cpp:544] Agent attributes: [  ]
I0526 21:16:45.270089 25063 slave.cpp:549] Agent hostname: 73453c76fdc9
I0526 21:16:45.270226 25052 status_update_manager.cpp:177] Pausing sending status updates
I0526 21:16:45.271515 25057 state.cpp:62] Recovering state from '/tmp/Endpoint_SlaveEndpointTest_NoAuthorizer_2_DzP750/meta'
I0526 21:16:45.271874 25050 status_update_manager.cpp:203] Recovering status update manager
I0526 21:16:45.272090 25064 containerizer.cpp:582] Recovering containerizer
I0526 21:16:45.273460 25052 provisioner.cpp:416] Provisioner recovery complete
I0526 21:16:45.273872 25054 slave.cpp:6073] Finished recovery
I0526 21:16:45.274330 25054 slave.cpp:6255] Querying resource estimator for oversubscribable
resources
I0526 21:16:45.274600 25055 slave.cpp:6269] Received oversubscribable resources {} from the
resource estimator
I0526 21:16:45.276758 25053 process.cpp:3730] Handling HTTP event for process 'slave(759)'
with path: '/slave(759)/containers'
I0526 21:16:45.278461 25050 http.cpp:1115] HTTP GET for /slave(759)/containers from 172.17.0.3:35574
I0526 21:16:45.278568 25050 http.cpp:936] Authorizing principal 'test-principal' to GET the
'/containers' endpoint
I0526 21:16:45.281461 25052 slave.cpp:801] Agent terminating
[       OK ] Endpoint/SlaveEndpointTest.NoAuthorizer/2 (29 ms)
[----------] 9 tests from Endpoint/SlaveEndpointTest (544 ms total)

[----------] Global test environment tear-down
[==========] 1588 tests from 178 test cases ran. (689701 ms total)
[  PASSED  ] 1587 tests.
[  FAILED  ] 1 test, listed below:
[  FAILED  ] ExamplesTest.PythonFramework

 1 FAILED TEST
  YOU HAVE 22 DISABLED TESTS

E0526 21:16:45.371431 25065 process.cpp:950] Failed to accept socket: future discarded
make[4]: *** [check-local] Error 1
make[4]: Leaving directory `/mesos/mesos-1.4.0/_build/src'
make[3]: *** [check-am] Error 2
make[3]: Leaving directory `/mesos/mesos-1.4.0/_build/src'
make[2]: *** [check] Error 2
make[2]: Leaving directory `/mesos/mesos-1.4.0/_build/src'
make[1]: *** [check-recursive] Error 1
make[1]: Leaving directory `/mesos/mesos-1.4.0/_build'
make: *** [distcheck] Error 1
+ docker rmi mesos-1495829397-2662
Untagged: mesos-1495829397-2662:latest
Deleted: sha256:98da9bb16d743f5bb7a348bd10b680c617567ba4068704fc1a629580fee36f8d
Deleted: sha256:65375cc2cc49f851345f774cdbe2a85f4163d4b7cf50f2ebe1d28966b336c432
Deleted: sha256:c41893e09b201dd98bb5a8ef00239e507eb82ff263423fa5bb162d04e99cfeb7
Deleted: sha256:a10be5ebb964cb6b983fe97b4ac6851bc9a97acd9dc6b88ed3832ce8d734017d
Deleted: sha256:e7780664121046698113f5ecf637696a9e872d45e0911adbcedb1b8ef1267b15
Deleted: sha256:106c47f43b3e31baa97013d46b2a082b80ab50f40016b636542b26d6223c8146
Deleted: sha256:d9f52801682688758a9ec98eb797dea9949ddc90e27ac247f7177d6fbaf57830
Deleted: sha256:cb8ed558634ff3294792b6773ae65c9c6fce4c9510f2c3870fb6bdc0b54d76d4
Deleted: sha256:3f2d1b954d1068253522ac34db7d92884a64f31cf785efcf5397ed4663f9c0ac
Deleted: sha256:dab72de0ae2b397415ede7bfd86975a317103e860caba352596bff0e335ce283
Deleted: sha256:8fbdcd42396700ddd4bc90615ebb144438069dbb3c167f9a0ebd9df0b82f9d7f
Deleted: sha256:ed0330540d3bebb63e4f19828a6b6390e522e1f05f5945e816f870bc088195f1
Deleted: sha256:5771f0ca5a1925eac509320299cac8c065ce9d92ea80575e413d4ae73f853503
Deleted: sha256:5f86dfc9d5ea6987f9192b58b1d19b72b9ef0ab49846485ed906d1fe49220f2b
Deleted: sha256:2c054832bd22405137bcb6dd31a677119e41bd32a26fd13612cbfcc4a05ed32a
Deleted: sha256:dfed2960ff89dfdef7316123eb8273deb7bf292098041b9abbdb9e3e8d7f3aab
Deleted: sha256:7abe20bff23e90c071a34dc779ff76464e317e69119df884252594ba4836cb3d
Deleted: sha256:ccbf8407f110d3b5c0c5c9a79a8e0818fedc45db3fa044d7204af35b1e5f50fd
Deleted: sha256:371b2a1551bce9a7723515329d530f91c15e4f07c4a70e8499d783479f056622
Deleted: sha256:7f813dc44f50732702c26e69bebf50796d2cdc49b60db3e6c1f164af804f0576
Deleted: sha256:b6f5c3d81149234faabd6edffcf2718525a898c015ca0d258d8a0b48801963c5
Deleted: sha256:ea466207269e7f92ec28141d6063cb9d16cc213300b99284258b2f7b825adee8
Deleted: sha256:64192fec8f8f06094bd1ad4ca698d0dd0e86670c222d4ba61f9669fc60b85ed0
Deleted: sha256:a72b4f4cae75dacfb819332ed19bd513100043bb1817eaa43ccf4cd2edce6015
Build step 'Execute shell' marked build as failure

Mime
View raw message