mesos-builds mailing list archives

Site index · List index
Message view « Date » · « Thread »
Top « Date » · « Thread »
From Apache Jenkins Server <jenk...@builds.apache.org>
Subject Build failed in Jenkins: Mesos-Buildbot » autotools,clang,--verbose --enable-libevent --enable-ssl,GLOG_v=1 MESOS_VERBOSE=1,ubuntu:14.04,(docker||Hadoop)&&(!ubuntu-us1)&&(!ubuntu-eu2) #3660
Date Thu, 11 May 2017 15:57:52 GMT
See <https://builds.apache.org/job/Mesos-Buildbot/BUILDTOOL=autotools,COMPILER=clang,CONFIGURATION=--verbose%20--enable-libevent%20--enable-ssl,ENVIRONMENT=GLOG_v=1%20MESOS_VERBOSE=1,OS=ubuntu%3A14.04,label_exp=(docker%7C%7CHadoop)&&(!ubuntu-us1)&&(!ubuntu-eu2)/3660/display/redirect>

------------------------------------------
[...truncated 28.53 MB...]
I0511 15:57:28.536334 17169 process.cpp:3730] Handling HTTP event for process 'slave(756)'
with path: '/slave(756)/containers'
I0511 15:57:28.537713 17165 http.cpp:1115] HTTP GET for /slave(756)/containers from 172.17.0.2:59487
I0511 15:57:28.537781 17165 http.cpp:936] Authorizing principal 'test-principal' to GET the
'/containers' endpoint
I0511 15:57:28.540436 17162 slave.cpp:790] Agent terminating
[       OK ] Endpoint/SlaveEndpointTest.AuthorizedRequest/2 (28 ms)
[ RUN      ] Endpoint/SlaveEndpointTest.UnauthorizedRequest/0
I0511 15:57:28.552073 31330 containerizer.cpp:221] Using isolation: posix/cpu,posix/mem,filesystem/posix,network/cni
W0511 15:57:28.552743 31330 backend.cpp:76] Failed to create 'aufs' backend: AufsBackend requires
root privileges
W0511 15:57:28.552863 31330 backend.cpp:76] Failed to create 'bind' backend: BindBackend requires
root privileges
I0511 15:57:28.553019 31330 provisioner.cpp:249] Using default backend 'copy'
I0511 15:57:28.556890 17162 slave.cpp:225] Mesos agent started on (757)@172.17.0.2:49842
I0511 15:57:28.556953 17162 slave.cpp:226] Flags at startup: --acls="" --appc_simple_discovery_uri_prefix="http://"
--appc_store_dir="/tmp/mesos/store/appc" --authenticate_http_executors="true" --authenticate_http_readonly="true"
--authenticate_http_readwrite="true" --authenticatee="crammd5" --authentication_backoff_factor="1secs"
--authorizer="local" --cgroups_cpu_enable_pids_and_tids_count="false" --cgroups_enable_cfs="false"
--cgroups_hierarchy="/sys/fs/cgroup" --cgroups_limit_swap="false" --cgroups_root="mesos" --container_disk_watch_interval="15secs"
--containerizers="mesos" --credential="/tmp/Endpoint_SlaveEndpointTest_UnauthorizedRequest_0_P7St2q/credential"
--default_role="*" --disk_watch_interval="1mins" --docker="docker" --docker_kill_orphans="true"
--docker_registry="https://registry-1.docker.io" --docker_remove_delay="6hrs" --docker_socket="/var/run/docker.sock"
--docker_stop_timeout="0ns" --docker_store_dir="/tmp/mesos/store/docker" --docker_volume_checkpoint_dir="/var/run/mesos/isolators/docker/volume"
--enforce_container_disk_quota="false" --executor_registration_timeout="1mins" --executor_secret_key="/tmp/Endpoint_SlaveEndpointTest_UnauthorizedRequest_0_P7St2q/executor_secret_key"
--executor_shutdown_grace_period="5secs" --fetcher_cache_dir="/tmp/Endpoint_SlaveEndpointTest_UnauthorizedRequest_0_P7St2q/fetch"
--fetcher_cache_size="2GB" --frameworks_home="" --gc_delay="1weeks" --gc_disk_headroom="0.1"
--hadoop_home="" --help="false" --hostname_lookup="true" --http_command_executor="false" --http_credentials="/tmp/Endpoint_SlaveEndpointTest_UnauthorizedRequest_0_P7St2q/http_credentials"
--http_heartbeat_interval="30secs" --initialize_driver_logging="true" --isolation="posix/cpu,posix/mem"
--launcher="posix" --launcher_dir="/mesos/mesos-1.4.0/_build/src" --logbufsecs="0" --logging_level="INFO"
--max_completed_executors_per_framework="150" --oversubscribed_resources_interval="15secs"
--perf_duration="10secs" --perf_interval="1mins" --port="5051" --qos_correction_interval_min="0ns"
--quiet="false" --recover="reconnect" --recovery_timeout="15mins" --registration_backoff_factor="10ms"
--resources="cpus:2;gpus:0;mem:1024;disk:1024;ports:[31000-32000]" --revocable_cpu_low_priority="true"
--runtime_dir="/tmp/Endpoint_SlaveEndpointTest_UnauthorizedRequest_0_P7St2q" --sandbox_directory="/mnt/mesos/sandbox"
--strict="true" --switch_user="true" --systemd_enable_support="true" --systemd_runtime_directory="/run/systemd/system"
--version="false" --work_dir="/tmp/Endpoint_SlaveEndpointTest_UnauthorizedRequest_0_vJMq8g"
I0511 15:57:28.557554 17162 credentials.hpp:86] Loading credential for authentication from
'/tmp/Endpoint_SlaveEndpointTest_UnauthorizedRequest_0_P7St2q/credential'
I0511 15:57:28.557776 17162 slave.cpp:258] Agent using credential for: test-principal
I0511 15:57:28.557811 17162 credentials.hpp:37] Loading credentials for authentication from
'/tmp/Endpoint_SlaveEndpointTest_UnauthorizedRequest_0_P7St2q/http_credentials'
I0511 15:57:28.558272 17162 http.cpp:975] Creating default 'basic' HTTP authenticator for
realm 'mesos-agent-executor'
I0511 15:57:28.558420 17162 http.cpp:996] Creating default 'jwt' HTTP authenticator for realm
'mesos-agent-executor'
I0511 15:57:28.558744 17162 http.cpp:975] Creating default 'basic' HTTP authenticator for
realm 'mesos-agent-readonly'
I0511 15:57:28.558861 17162 http.cpp:996] Creating default 'jwt' HTTP authenticator for realm
'mesos-agent-readonly'
I0511 15:57:28.559104 17162 http.cpp:975] Creating default 'basic' HTTP authenticator for
realm 'mesos-agent-readwrite'
I0511 15:57:28.559221 17162 http.cpp:996] Creating default 'jwt' HTTP authenticator for realm
'mesos-agent-readwrite'
I0511 15:57:28.560712 17162 slave.cpp:525] Agent resources: cpus(*):2; mem(*):1024; disk(*):1024;
ports(*):[31000-32000]
I0511 15:57:28.560796 17162 slave.cpp:533] Agent attributes: [  ]
I0511 15:57:28.560822 17162 slave.cpp:538] Agent hostname: cd258f63dd00
I0511 15:57:28.560997 17158 status_update_manager.cpp:177] Pausing sending status updates
I0511 15:57:28.562234 17164 state.cpp:62] Recovering state from '/tmp/Endpoint_SlaveEndpointTest_UnauthorizedRequest_0_vJMq8g/meta'
I0511 15:57:28.562522 17159 status_update_manager.cpp:203] Recovering status update manager
I0511 15:57:28.562753 17172 containerizer.cpp:608] Recovering containerizer
I0511 15:57:28.564052 17160 provisioner.cpp:410] Provisioner recovery complete
I0511 15:57:28.564460 17158 slave.cpp:5970] Finished recovery
I0511 15:57:28.564985 17158 slave.cpp:6152] Querying resource estimator for oversubscribable
resources
I0511 15:57:28.565276 17173 slave.cpp:6166] Received oversubscribable resources {} from the
resource estimator
I0511 15:57:28.567139 17164 process.cpp:3730] Handling HTTP event for process 'slave(757)'
with path: '/slave(757)/monitor/statistics'
I0511 15:57:28.568806 17167 http.cpp:1115] HTTP GET for /slave(757)/monitor/statistics from
172.17.0.2:59488
I0511 15:57:28.568894 17167 http.cpp:936] Authorizing principal 'test-principal' to GET the
'/monitor/statistics' endpoint
I0511 15:57:28.570888 17168 slave.cpp:790] Agent terminating
[       OK ] Endpoint/SlaveEndpointTest.UnauthorizedRequest/0 (29 ms)
[ RUN      ] Endpoint/SlaveEndpointTest.UnauthorizedRequest/1
I0511 15:57:28.581060 31330 containerizer.cpp:221] Using isolation: posix/cpu,posix/mem,filesystem/posix,network/cni
W0511 15:57:28.581670 31330 backend.cpp:76] Failed to create 'aufs' backend: AufsBackend requires
root privileges
W0511 15:57:28.581784 31330 backend.cpp:76] Failed to create 'bind' backend: BindBackend requires
root privileges
I0511 15:57:28.581835 31330 provisioner.cpp:249] Using default backend 'copy'
I0511 15:57:28.585363 17172 slave.cpp:225] Mesos agent started on (758)@172.17.0.2:49842
I0511 15:57:28.585412 17172 slave.cpp:226] Flags at startup: --acls="" --appc_simple_discovery_uri_prefix="http://"
--appc_store_dir="/tmp/mesos/store/appc" --authenticate_http_executors="true" --authenticate_http_readonly="true"
--authenticate_http_readwrite="true" --authenticatee="crammd5" --authentication_backoff_factor="1secs"
--authorizer="local" --cgroups_cpu_enable_pids_and_tids_count="false" --cgroups_enable_cfs="false"
--cgroups_hierarchy="/sys/fs/cgroup" --cgroups_limit_swap="false" --cgroups_root="mesos" --container_disk_watch_interval="15secs"
--containerizers="mesos" --credential="/tmp/Endpoint_SlaveEndpointTest_UnauthorizedRequest_1_jI22U4/credential"
--default_role="*" --disk_watch_interval="1mins" --docker="docker" --docker_kill_orphans="true"
--docker_registry="https://registry-1.docker.io" --docker_remove_delay="6hrs" --docker_socket="/var/run/docker.sock"
--docker_stop_timeout="0ns" --docker_store_dir="/tmp/mesos/store/docker" --docker_volume_checkpoint_dir="/var/run/mesos/isolators/docker/volume"
--enforce_container_disk_quota="false" --executor_registration_timeout="1mins" --executor_secret_key="/tmp/Endpoint_SlaveEndpointTest_UnauthorizedRequest_1_jI22U4/executor_secret_key"
--executor_shutdown_grace_period="5secs" --fetcher_cache_dir="/tmp/Endpoint_SlaveEndpointTest_UnauthorizedRequest_1_jI22U4/fetch"
--fetcher_cache_size="2GB" --frameworks_home="" --gc_delay="1weeks" --gc_disk_headroom="0.1"
--hadoop_home="" --help="false" --hostname_lookup="true" --http_command_executor="false" --http_credentials="/tmp/Endpoint_SlaveEndpointTest_UnauthorizedRequest_1_jI22U4/http_credentials"
--http_heartbeat_interval="30secs" --initialize_driver_logging="true" --isolation="posix/cpu,posix/mem"
--launcher="posix" --launcher_dir="/mesos/mesos-1.4.0/_build/src" --logbufsecs="0" --logging_level="INFO"
--max_completed_executors_per_framework="150" --oversubscribed_resources_interval="15secs"
--perf_duration="10secs" --perf_interval="1mins" --port="5051" --qos_correction_interval_min="0ns"
--quiet="false" --recover="reconnect" --recovery_timeout="15mins" --registration_backoff_factor="10ms"
--resources="cpus:2;gpus:0;mem:1024;disk:1024;ports:[31000-32000]" --revocable_cpu_low_priority="true"
--runtime_dir="/tmp/Endpoint_SlaveEndpointTest_UnauthorizedRequest_1_jI22U4" --sandbox_directory="/mnt/mesos/sandbox"
--strict="true" --switch_user="true" --systemd_enable_support="true" --systemd_runtime_directory="/run/systemd/system"
--version="false" --work_dir="/tmp/Endpoint_SlaveEndpointTest_UnauthorizedRequest_1_n5PgWU"
I0511 15:57:28.585919 17172 credentials.hpp:86] Loading credential for authentication from
'/tmp/Endpoint_SlaveEndpointTest_UnauthorizedRequest_1_jI22U4/credential'
I0511 15:57:28.586122 17172 slave.cpp:258] Agent using credential for: test-principal
I0511 15:57:28.586153 17172 credentials.hpp:37] Loading credentials for authentication from
'/tmp/Endpoint_SlaveEndpointTest_UnauthorizedRequest_1_jI22U4/http_credentials'
I0511 15:57:28.586526 17172 http.cpp:975] Creating default 'basic' HTTP authenticator for
realm 'mesos-agent-executor'
I0511 15:57:28.586657 17172 http.cpp:996] Creating default 'jwt' HTTP authenticator for realm
'mesos-agent-executor'
I0511 15:57:28.586925 17172 http.cpp:975] Creating default 'basic' HTTP authenticator for
realm 'mesos-agent-readonly'
I0511 15:57:28.587060 17172 http.cpp:996] Creating default 'jwt' HTTP authenticator for realm
'mesos-agent-readonly'
I0511 15:57:28.587316 17172 http.cpp:975] Creating default 'basic' HTTP authenticator for
realm 'mesos-agent-readwrite'
I0511 15:57:28.587441 17172 http.cpp:996] Creating default 'jwt' HTTP authenticator for realm
'mesos-agent-readwrite'
I0511 15:57:28.589171 17172 slave.cpp:525] Agent resources: cpus(*):2; mem(*):1024; disk(*):1024;
ports(*):[31000-32000]
I0511 15:57:28.589275 17172 slave.cpp:533] Agent attributes: [  ]
I0511 15:57:28.589303 17172 slave.cpp:538] Agent hostname: cd258f63dd00
I0511 15:57:28.589481 17170 status_update_manager.cpp:177] Pausing sending status updates
I0511 15:57:28.591146 17166 state.cpp:62] Recovering state from '/tmp/Endpoint_SlaveEndpointTest_UnauthorizedRequest_1_n5PgWU/meta'
I0511 15:57:28.591409 17163 status_update_manager.cpp:203] Recovering status update manager
I0511 15:57:28.591645 17172 containerizer.cpp:608] Recovering containerizer
I0511 15:57:28.593142 17173 provisioner.cpp:410] Provisioner recovery complete
I0511 15:57:28.593581 17171 slave.cpp:5970] Finished recovery
I0511 15:57:28.594218 17171 slave.cpp:6152] Querying resource estimator for oversubscribable
resources
I0511 15:57:28.594514 17169 slave.cpp:6166] Received oversubscribable resources {} from the
resource estimator
I0511 15:57:28.596539 17161 process.cpp:3730] Handling HTTP event for process 'slave(758)'
with path: '/slave(758)/monitor/statistics.json'
I0511 15:57:28.598266 17167 http.cpp:1115] HTTP GET for /slave(758)/monitor/statistics.json
from 172.17.0.2:59489
I0511 15:57:28.598340 17167 http.cpp:936] Authorizing principal 'test-principal' to GET the
'/monitor/statistics.json' endpoint
I0511 15:57:28.600476 17161 slave.cpp:790] Agent terminating
[       OK ] Endpoint/SlaveEndpointTest.UnauthorizedRequest/1 (29 ms)
[ RUN      ] Endpoint/SlaveEndpointTest.UnauthorizedRequest/2
I0511 15:57:28.611739 31330 containerizer.cpp:221] Using isolation: posix/cpu,posix/mem,filesystem/posix,network/cni
W0511 15:57:28.612314 31330 backend.cpp:76] Failed to create 'aufs' backend: AufsBackend requires
root privileges
W0511 15:57:28.612454 31330 backend.cpp:76] Failed to create 'bind' backend: BindBackend requires
root privileges
I0511 15:57:28.612506 31330 provisioner.cpp:249] Using default backend 'copy'
I0511 15:57:28.614979 17160 slave.cpp:225] Mesos agent started on (759)@172.17.0.2:49842
I0511 15:57:28.615021 17160 slave.cpp:226] Flags at startup: --acls="" --appc_simple_discovery_uri_prefix="http://"
--appc_store_dir="/tmp/mesos/store/appc" --authenticate_http_executors="true" --authenticate_http_readonly="true"
--authenticate_http_readwrite="true" --authenticatee="crammd5" --authentication_backoff_factor="1secs"
--authorizer="local" --cgroups_cpu_enable_pids_and_tids_count="false" --cgroups_enable_cfs="false"
--cgroups_hierarchy="/sys/fs/cgroup" --cgroups_limit_swap="false" --cgroups_root="mesos" --container_disk_watch_interval="15secs"
--containerizers="mesos" --credential="/tmp/Endpoint_SlaveEndpointTest_UnauthorizedRequest_2_3xg66I/credential"
--default_role="*" --disk_watch_interval="1mins" --docker="docker" --docker_kill_orphans="true"
--docker_registry="https://registry-1.docker.io" --docker_remove_delay="6hrs" --docker_socket="/var/run/docker.sock"
--docker_stop_timeout="0ns" --docker_store_dir="/tmp/mesos/store/docker" --docker_volume_checkpoint_dir="/var/run/mesos/isolators/docker/volume"
--enforce_container_disk_quota="false" --executor_registration_timeout="1mins" --executor_secret_key="/tmp/Endpoint_SlaveEndpointTest_UnauthorizedRequest_2_3xg66I/executor_secret_key"
--executor_shutdown_grace_period="5secs" --fetcher_cache_dir="/tmp/Endpoint_SlaveEndpointTest_UnauthorizedRequest_2_3xg66I/fetch"
--fetcher_cache_size="2GB" --frameworks_home="" --gc_delay="1weeks" --gc_disk_headroom="0.1"
--hadoop_home="" --help="false" --hostname_lookup="true" --http_command_executor="false" --http_credentials="/tmp/Endpoint_SlaveEndpointTest_UnauthorizedRequest_2_3xg66I/http_credentials"
--http_heartbeat_interval="30secs" --initialize_driver_logging="true" --isolation="posix/cpu,posix/mem"
--launcher="posix" --launcher_dir="/mesos/mesos-1.4.0/_build/src" --logbufsecs="0" --logging_level="INFO"
--max_completed_executors_per_framework="150" --oversubscribed_resources_interval="15secs"
--perf_duration="10secs" --perf_interval="1mins" --port="5051" --qos_correction_interval_min="0ns"
--quiet="false" --recover="reconnect" --recovery_timeout="15mins" --registration_backoff_factor="10ms"
--resources="cpus:2;gpus:0;mem:1024;disk:1024;ports:[31000-32000]" --revocable_cpu_low_priority="true"
--runtime_dir="/tmp/Endpoint_SlaveEndpointTest_UnauthorizedRequest_2_3xg66I" --sandbox_directory="/mnt/mesos/sandbox"
--strict="true" --switch_user="true" --systemd_enable_support="true" --systemd_runtime_directory="/run/systemd/system"
--version="false" --work_dir="/tmp/Endpoint_SlaveEndpointTest_UnauthorizedRequest_2_B2Xn3y"
I0511 15:57:28.615460 17160 credentials.hpp:86] Loading credential for authentication from
'/tmp/Endpoint_SlaveEndpointTest_UnauthorizedRequest_2_3xg66I/credential'
I0511 15:57:28.615610 17160 slave.cpp:258] Agent using credential for: test-principal
I0511 15:57:28.615636 17160 credentials.hpp:37] Loading credentials for authentication from
'/tmp/Endpoint_SlaveEndpointTest_UnauthorizedRequest_2_3xg66I/http_credentials'
I0511 15:57:28.615958 17160 http.cpp:975] Creating default 'basic' HTTP authenticator for
realm 'mesos-agent-executor'
I0511 15:57:28.616094 17160 http.cpp:996] Creating default 'jwt' HTTP authenticator for realm
'mesos-agent-executor'
I0511 15:57:28.616432 17160 http.cpp:975] Creating default 'basic' HTTP authenticator for
realm 'mesos-agent-readonly'
I0511 15:57:28.616539 17160 http.cpp:996] Creating default 'jwt' HTTP authenticator for realm
'mesos-agent-readonly'
I0511 15:57:28.616770 17160 http.cpp:975] Creating default 'basic' HTTP authenticator for
realm 'mesos-agent-readwrite'
I0511 15:57:28.616905 17160 http.cpp:996] Creating default 'jwt' HTTP authenticator for realm
'mesos-agent-readwrite'
I0511 15:57:28.618139 17160 slave.cpp:525] Agent resources: cpus(*):2; mem(*):1024; disk(*):1024;
ports(*):[31000-32000]
I0511 15:57:28.618208 17160 slave.cpp:533] Agent attributes: [  ]
I0511 15:57:28.618222 17160 slave.cpp:538] Agent hostname: cd258f63dd00
I0511 15:57:28.618337 17164 status_update_manager.cpp:177] Pausing sending status updates
I0511 15:57:28.619585 17161 state.cpp:62] Recovering state from '/tmp/Endpoint_SlaveEndpointTest_UnauthorizedRequest_2_B2Xn3y/meta'
I0511 15:57:28.619904 17166 status_update_manager.cpp:203] Recovering status update manager
I0511 15:57:28.620252 17172 containerizer.cpp:608] Recovering containerizer
I0511 15:57:28.621604 17172 provisioner.cpp:410] Provisioner recovery complete
I0511 15:57:28.622037 17162 slave.cpp:5970] Finished recovery
I0511 15:57:28.622468 17162 slave.cpp:6152] Querying resource estimator for oversubscribable
resources
I0511 15:57:28.622768 17165 slave.cpp:6166] Received oversubscribable resources {} from the
resource estimator
I0511 15:57:28.624691 17164 process.cpp:3730] Handling HTTP event for process 'slave(759)'
with path: '/slave(759)/containers'
I0511 15:57:28.626382 17164 http.cpp:1115] HTTP GET for /slave(759)/containers from 172.17.0.2:59490
I0511 15:57:28.626441 17164 http.cpp:936] Authorizing principal 'test-principal' to GET the
'/containers' endpoint
I0511 15:57:28.628285 17160 slave.cpp:790] Agent terminating
[       OK ] Endpoint/SlaveEndpointTest.UnauthorizedRequest/2 (26 ms)
[ RUN      ] Endpoint/SlaveEndpointTest.NoAuthorizer/0
I0511 15:57:28.636945 31330 containerizer.cpp:221] Using isolation: posix/cpu,posix/mem,filesystem/posix,network/cni
W0511 15:57:28.637456 31330 backend.cpp:76] Failed to create 'aufs' backend: AufsBackend requires
root privileges
W0511 15:57:28.637560 31330 backend.cpp:76] Failed to create 'bind' backend: BindBackend requires
root privileges
I0511 15:57:28.637595 31330 provisioner.cpp:249] Using default backend 'copy'
I0511 15:57:28.638806 31330 cluster.cpp:448] Creating default 'local' authorizer
I0511 15:57:28.640702 17165 slave.cpp:225] Mesos agent started on (760)@172.17.0.2:49842
I0511 15:57:28.640784 17165 slave.cpp:226] Flags at startup: --acls="" --appc_simple_discovery_uri_prefix="http://"
--appc_store_dir="/tmp/mesos/store/appc" --authenticate_http_executors="true" --authenticate_http_readonly="true"
--authenticate_http_readwrite="true" --authenticatee="crammd5" --authentication_backoff_factor="1secs"
--authorizer="local" --cgroups_cpu_enable_pids_and_tids_count="false" --cgroups_enable_cfs="false"
--cgroups_hierarchy="/sys/fs/cgroup" --cgroups_limit_swap="false" --cgroups_root="mesos" --container_disk_watch_interval="15secs"
--containerizers="mesos" --credential="/tmp/Endpoint_SlaveEndpointTest_NoAuthorizer_0_bjzoAn/credential"
--default_role="*" --disk_watch_interval="1mins" --docker="docker" --docker_kill_orphans="true"
--docker_registry="https://registry-1.docker.io" --docker_remove_delay="6hrs" --docker_socket="/var/run/docker.sock"
--docker_stop_timeout="0ns" --docker_store_dir="/tmp/mesos/store/docker" --docker_volume_checkpoint_dir="/var/run/mesos/isolators/docker/volume"
--enforce_container_disk_quota="false" --executor_registration_timeout="1mins" --executor_secret_key="/tmp/Endpoint_SlaveEndpointTest_NoAuthorizer_0_bjzoAn/executor_secret_key"
--executor_shutdown_grace_period="5secs" --fetcher_cache_dir="/tmp/Endpoint_SlaveEndpointTest_NoAuthorizer_0_bjzoAn/fetch"
--fetcher_cache_size="2GB" --frameworks_home="" --gc_delay="1weeks" --gc_disk_headroom="0.1"
--hadoop_home="" --help="false" --hostname_lookup="true" --http_command_executor="false" --http_credentials="/tmp/Endpoint_SlaveEndpointTest_NoAuthorizer_0_bjzoAn/http_credentials"
--http_heartbeat_interval="30secs" --initialize_driver_logging="true" --isolation="posix/cpu,posix/mem"
--launcher="posix" --launcher_dir="/mesos/mesos-1.4.0/_build/src" --logbufsecs="0" --logging_level="INFO"
--max_completed_executors_per_framework="150" --oversubscribed_resources_interval="15secs"
--perf_duration="10secs" --perf_interval="1mins" --port="5051" --qos_correction_interval_min="0ns"
--quiet="false" --recover="reconnect" --recovery_timeout="15mins" --registration_backoff_factor="10ms"
--resources="cpus:2;gpus:0;mem:1024;disk:1024;ports:[31000-32000]" --revocable_cpu_low_priority="true"
--runtime_dir="/tmp/Endpoint_SlaveEndpointTest_NoAuthorizer_0_bjzoAn" --sandbox_directory="/mnt/mesos/sandbox"
--strict="true" --switch_user="true" --systemd_enable_support="true" --systemd_runtime_directory="/run/systemd/system"
--version="false" --work_dir="/tmp/Endpoint_SlaveEndpointTest_NoAuthorizer_0_Vnwvsd"
I0511 15:57:28.641258 17165 credentials.hpp:86] Loading credential for authentication from
'/tmp/Endpoint_SlaveEndpointTest_NoAuthorizer_0_bjzoAn/credential'
I0511 15:57:28.641458 17165 slave.cpp:258] Agent using credential for: test-principal
I0511 15:57:28.641482 17165 credentials.hpp:37] Loading credentials for authentication from
'/tmp/Endpoint_SlaveEndpointTest_NoAuthorizer_0_bjzoAn/http_credentials'
I0511 15:57:28.641768 17165 http.cpp:975] Creating default 'basic' HTTP authenticator for
realm 'mesos-agent-executor'
I0511 15:57:28.641952 17165 http.cpp:996] Creating default 'jwt' HTTP authenticator for realm
'mesos-agent-executor'
I0511 15:57:28.642427 17165 http.cpp:975] Creating default 'basic' HTTP authenticator for
realm 'mesos-agent-readonly'
I0511 15:57:28.642530 17165 http.cpp:996] Creating default 'jwt' HTTP authenticator for realm
'mesos-agent-readonly'
I0511 15:57:28.642719 17165 http.cpp:975] Creating default 'basic' HTTP authenticator for
realm 'mesos-agent-readwrite'
I0511 15:57:28.642812 17165 http.cpp:996] Creating default 'jwt' HTTP authenticator for realm
'mesos-agent-readwrite'
I0511 15:57:28.644239 17165 slave.cpp:525] Agent resources: cpus(*):2; mem(*):1024; disk(*):1024;
ports(*):[31000-32000]
I0511 15:57:28.644316 17165 slave.cpp:533] Agent attributes: [  ]
I0511 15:57:28.644338 17165 slave.cpp:538] Agent hostname: cd258f63dd00
I0511 15:57:28.644485 17159 status_update_manager.cpp:177] Pausing sending status updates
I0511 15:57:28.645814 17168 state.cpp:62] Recovering state from '/tmp/Endpoint_SlaveEndpointTest_NoAuthorizer_0_Vnwvsd/meta'
I0511 15:57:28.646209 17170 status_update_manager.cpp:203] Recovering status update manager
I0511 15:57:28.646571 17169 containerizer.cpp:608] Recovering containerizer
I0511 15:57:28.647821 17165 provisioner.cpp:410] Provisioner recovery complete
I0511 15:57:28.648147 17173 slave.cpp:5970] Finished recovery
I0511 15:57:28.648660 17173 slave.cpp:6152] Querying resource estimator for oversubscribable
resources
I0511 15:57:28.648924 17172 slave.cpp:6166] Received oversubscribable resources {} from the
resource estimator
I0511 15:57:28.650637 17162 process.cpp:3730] Handling HTTP event for process 'slave(760)'
with path: '/slave(760)/monitor/statistics'
I0511 15:57:28.652320 17173 http.cpp:1115] HTTP GET for /slave(760)/monitor/statistics from
172.17.0.2:59491
I0511 15:57:28.652420 17173 http.cpp:936] Authorizing principal 'test-principal' to GET the
'/monitor/statistics' endpoint
I0511 15:57:28.656318 17164 slave.cpp:790] Agent terminating
[       OK ] Endpoint/SlaveEndpointTest.NoAuthorizer/0 (30 ms)
[ RUN      ] Endpoint/SlaveEndpointTest.NoAuthorizer/1
I0511 15:57:28.668684 31330 containerizer.cpp:221] Using isolation: posix/cpu,posix/mem,filesystem/posix,network/cni
W0511 15:57:28.669288 31330 backend.cpp:76] Failed to create 'aufs' backend: AufsBackend requires
root privileges
W0511 15:57:28.669419 31330 backend.cpp:76] Failed to create 'bind' backend: BindBackend requires
root privileges
I0511 15:57:28.669502 31330 provisioner.cpp:249] Using default backend 'copy'
I0511 15:57:28.671422 31330 cluster.cpp:448] Creating default 'local' authorizer
I0511 15:57:28.673053 17161 slave.cpp:225] Mesos agent started on (761)@172.17.0.2:49842
I0511 15:57:28.673080 17161 slave.cpp:226] Flags at startup: --acls="" --appc_simple_discovery_uri_prefix="http://"
--appc_store_dir="/tmp/mesos/store/appc" --authenticate_http_executors="true" --authenticate_http_readonly="true"
--authenticate_http_readwrite="true" --authenticatee="crammd5" --authentication_backoff_factor="1secs"
--authorizer="local" --cgroups_cpu_enable_pids_and_tids_count="false" --cgroups_enable_cfs="false"
--cgroups_hierarchy="/sys/fs/cgroup" --cgroups_limit_swap="false" --cgroups_root="mesos" --container_disk_watch_interval="15secs"
--containerizers="mesos" --credential="/tmp/Endpoint_SlaveEndpointTest_NoAuthorizer_1_7xiRm2/credential"
--default_role="*" --disk_watch_interval="1mins" --docker="docker" --docker_kill_orphans="true"
--docker_registry="https://registry-1.docker.io" --docker_remove_delay="6hrs" --docker_socket="/var/run/docker.sock"
--docker_stop_timeout="0ns" --docker_store_dir="/tmp/mesos/store/docker" --docker_volume_checkpoint_dir="/var/run/mesos/isolators/docker/volume"
--enforce_container_disk_quota="false" --executor_registration_timeout="1mins" --executor_secret_key="/tmp/Endpoint_SlaveEndpointTest_NoAuthorizer_1_7xiRm2/executor_secret_key"
--executor_shutdown_grace_period="5secs" --fetcher_cache_dir="/tmp/Endpoint_SlaveEndpointTest_NoAuthorizer_1_7xiRm2/fetch"
--fetcher_cache_size="2GB" --frameworks_home="" --gc_delay="1weeks" --gc_disk_headroom="0.1"
--hadoop_home="" --help="false" --hostname_lookup="true" --http_command_executor="false" --http_credentials="/tmp/Endpoint_SlaveEndpointTest_NoAuthorizer_1_7xiRm2/http_credentials"
--http_heartbeat_interval="30secs" --initialize_driver_logging="true" --isolation="posix/cpu,posix/mem"
--launcher="posix" --launcher_dir="/mesos/mesos-1.4.0/_build/src" --logbufsecs="0" --logging_level="INFO"
--max_completed_executors_per_framework="150" --oversubscribed_resources_interval="15secs"
--perf_duration="10secs" --perf_interval="1mins" --port="5051" --qos_correction_interval_min="0ns"
--quiet="false" --recover="reconnect" --recovery_timeout="15mins" --registration_backoff_factor="10ms"
--resources="cpus:2;gpus:0;mem:1024;disk:1024;ports:[31000-32000]" --revocable_cpu_low_priority="true"
--runtime_dir="/tmp/Endpoint_SlaveEndpointTest_NoAuthorizer_1_7xiRm2" --sandbox_directory="/mnt/mesos/sandbox"
--strict="true" --switch_user="true" --systemd_enable_support="true" --systemd_runtime_directory="/run/systemd/system"
--version="false" --work_dir="/tmp/Endpoint_SlaveEndpointTest_NoAuthorizer_1_L8rX9R"
I0511 15:57:28.673480 17161 credentials.hpp:86] Loading credential for authentication from
'/tmp/Endpoint_SlaveEndpointTest_NoAuthorizer_1_7xiRm2/credential'
I0511 15:57:28.673719 17161 slave.cpp:258] Agent using credential for: test-principal
I0511 15:57:28.673743 17161 credentials.hpp:37] Loading credentials for authentication from
'/tmp/Endpoint_SlaveEndpointTest_NoAuthorizer_1_7xiRm2/http_credentials'
I0511 15:57:28.673992 17161 http.cpp:975] Creating default 'basic' HTTP authenticator for
realm 'mesos-agent-executor'
I0511 15:57:28.674100 17161 http.cpp:996] Creating default 'jwt' HTTP authenticator for realm
'mesos-agent-executor'
I0511 15:57:28.674404 17161 http.cpp:975] Creating default 'basic' HTTP authenticator for
realm 'mesos-agent-readonly'
I0511 15:57:28.674530 17161 http.cpp:996] Creating default 'jwt' HTTP authenticator for realm
'mesos-agent-readonly'
I0511 15:57:28.674757 17161 http.cpp:975] Creating default 'basic' HTTP authenticator for
realm 'mesos-agent-readwrite'
I0511 15:57:28.674854 17161 http.cpp:996] Creating default 'jwt' HTTP authenticator for realm
'mesos-agent-readwrite'
I0511 15:57:28.676164 17161 slave.cpp:525] Agent resources: cpus(*):2; mem(*):1024; disk(*):1024;
ports(*):[31000-32000]
I0511 15:57:28.676235 17161 slave.cpp:533] Agent attributes: [  ]
I0511 15:57:28.676254 17161 slave.cpp:538] Agent hostname: cd258f63dd00
I0511 15:57:28.676422 17165 status_update_manager.cpp:177] Pausing sending status updates
I0511 15:57:28.677860 17172 state.cpp:62] Recovering state from '/tmp/Endpoint_SlaveEndpointTest_NoAuthorizer_1_L8rX9R/meta'
I0511 15:57:28.678159 17166 status_update_manager.cpp:203] Recovering status update manager
I0511 15:57:28.678481 17161 containerizer.cpp:608] Recovering containerizer
I0511 15:57:28.680122 17160 provisioner.cpp:410] Provisioner recovery complete
I0511 15:57:28.680673 17163 slave.cpp:5970] Finished recovery
I0511 15:57:28.681175 17163 slave.cpp:6152] Querying resource estimator for oversubscribable
resources
I0511 15:57:28.681452 17173 slave.cpp:6166] Received oversubscribable resources {} from the
resource estimator
I0511 15:57:28.682945 17165 process.cpp:3730] Handling HTTP event for process 'slave(761)'
with path: '/slave(761)/monitor/statistics.json'
I0511 15:57:28.685503 17166 http.cpp:1115] HTTP GET for /slave(761)/monitor/statistics.json
from 172.17.0.2:59492
I0511 15:57:28.685583 17166 http.cpp:936] Authorizing principal 'test-principal' to GET the
'/monitor/statistics.json' endpoint
I0511 15:57:28.689064 17168 slave.cpp:790] Agent terminating
[       OK ] Endpoint/SlaveEndpointTest.NoAuthorizer/1 (31 ms)
[ RUN      ] Endpoint/SlaveEndpointTest.NoAuthorizer/2
I0511 15:57:28.699784 31330 containerizer.cpp:221] Using isolation: posix/cpu,posix/mem,filesystem/posix,network/cni
W0511 15:57:28.700222 31330 backend.cpp:76] Failed to create 'aufs' backend: AufsBackend requires
root privileges
W0511 15:57:28.700311 31330 backend.cpp:76] Failed to create 'bind' backend: BindBackend requires
root privileges
I0511 15:57:28.700350 31330 provisioner.cpp:249] Using default backend 'copy'
I0511 15:57:28.702139 31330 cluster.cpp:448] Creating default 'local' authorizer
I0511 15:57:28.704036 17165 slave.cpp:225] Mesos agent started on (762)@172.17.0.2:49842
I0511 15:57:28.704087 17165 slave.cpp:226] Flags at startup: --acls="" --appc_simple_discovery_uri_prefix="http://"
--appc_store_dir="/tmp/mesos/store/appc" --authenticate_http_executors="true" --authenticate_http_readonly="true"
--authenticate_http_readwrite="true" --authenticatee="crammd5" --authentication_backoff_factor="1secs"
--authorizer="local" --cgroups_cpu_enable_pids_and_tids_count="false" --cgroups_enable_cfs="false"
--cgroups_hierarchy="/sys/fs/cgroup" --cgroups_limit_swap="false" --cgroups_root="mesos" --container_disk_watch_interval="15secs"
--containerizers="mesos" --credential="/tmp/Endpoint_SlaveEndpointTest_NoAuthorizer_2_DbRPtH/credential"
--default_role="*" --disk_watch_interval="1mins" --docker="docker" --docker_kill_orphans="true"
--docker_registry="https://registry-1.docker.io" --docker_remove_delay="6hrs" --docker_socket="/var/run/docker.sock"
--docker_stop_timeout="0ns" --docker_store_dir="/tmp/mesos/store/docker" --docker_volume_checkpoint_dir="/var/run/mesos/isolators/docker/volume"
--enforce_container_disk_quota="false" --executor_registration_timeout="1mins" --executor_secret_key="/tmp/Endpoint_SlaveEndpointTest_NoAuthorizer_2_DbRPtH/executor_secret_key"
--executor_shutdown_grace_period="5secs" --fetcher_cache_dir="/tmp/Endpoint_SlaveEndpointTest_NoAuthorizer_2_DbRPtH/fetch"
--fetcher_cache_size="2GB" --frameworks_home="" --gc_delay="1weeks" --gc_disk_headroom="0.1"
--hadoop_home="" --help="false" --hostname_lookup="true" --http_command_executor="false" --http_credentials="/tmp/Endpoint_SlaveEndpointTest_NoAuthorizer_2_DbRPtH/http_credentials"
--http_heartbeat_interval="30secs" --initialize_driver_logging="true" --isolation="posix/cpu,posix/mem"
--launcher="posix" --launcher_dir="/mesos/mesos-1.4.0/_build/src" --logbufsecs="0" --logging_level="INFO"
--max_completed_executors_per_framework="150" --oversubscribed_resources_interval="15secs"
--perf_duration="10secs" --perf_interval="1mins" --port="5051" --qos_correction_interval_min="0ns"
--quiet="false" --recover="reconnect" --recovery_timeout="15mins" --registration_backoff_factor="10ms"
--resources="cpus:2;gpus:0;mem:1024;disk:1024;ports:[31000-32000]" --revocable_cpu_low_priority="true"
--runtime_dir="/tmp/Endpoint_SlaveEndpointTest_NoAuthorizer_2_DbRPtH" --sandbox_directory="/mnt/mesos/sandbox"
--strict="true" --switch_user="true" --systemd_enable_support="true" --systemd_runtime_directory="/run/systemd/system"
--version="false" --work_dir="/tmp/Endpoint_SlaveEndpointTest_NoAuthorizer_2_HhmRbx"
I0511 15:57:28.704987 17165 credentials.hpp:86] Loading credential for authentication from
'/tmp/Endpoint_SlaveEndpointTest_NoAuthorizer_2_DbRPtH/credential'
I0511 15:57:28.705497 17165 slave.cpp:258] Agent using credential for: test-principal
I0511 15:57:28.705533 17165 credentials.hpp:37] Loading credentials for authentication from
'/tmp/Endpoint_SlaveEndpointTest_NoAuthorizer_2_DbRPtH/http_credentials'
I0511 15:57:28.706068 17165 http.cpp:975] Creating default 'basic' HTTP authenticator for
realm 'mesos-agent-executor'
I0511 15:57:28.706195 17165 http.cpp:996] Creating default 'jwt' HTTP authenticator for realm
'mesos-agent-executor'
I0511 15:57:28.706478 17165 http.cpp:975] Creating default 'basic' HTTP authenticator for
realm 'mesos-agent-readonly'
I0511 15:57:28.706792 17165 http.cpp:996] Creating default 'jwt' HTTP authenticator for realm
'mesos-agent-readonly'
I0511 15:57:28.707118 17165 http.cpp:975] Creating default 'basic' HTTP authenticator for
realm 'mesos-agent-readwrite'
I0511 15:57:28.707264 17165 http.cpp:996] Creating default 'jwt' HTTP authenticator for realm
'mesos-agent-readwrite'
I0511 15:57:28.709030 17165 slave.cpp:525] Agent resources: cpus(*):2; mem(*):1024; disk(*):1024;
ports(*):[31000-32000]
I0511 15:57:28.709105 17165 slave.cpp:533] Agent attributes: [  ]
I0511 15:57:28.709125 17165 slave.cpp:538] Agent hostname: cd258f63dd00
I0511 15:57:28.709347 17168 status_update_manager.cpp:177] Pausing sending status updates
I0511 15:57:28.710438 17164 state.cpp:62] Recovering state from '/tmp/Endpoint_SlaveEndpointTest_NoAuthorizer_2_HhmRbx/meta'
I0511 15:57:28.710726 17169 status_update_manager.cpp:203] Recovering status update manager
I0511 15:57:28.711158 17172 containerizer.cpp:608] Recovering containerizer
I0511 15:57:28.712455 17169 provisioner.cpp:410] Provisioner recovery complete
I0511 15:57:28.712790 17161 slave.cpp:5970] Finished recovery
I0511 15:57:28.713306 17161 slave.cpp:6152] Querying resource estimator for oversubscribable
resources
I0511 15:57:28.713574 17164 slave.cpp:6166] Received oversubscribable resources {} from the
resource estimator
I0511 15:57:28.715812 17161 process.cpp:3730] Handling HTTP event for process 'slave(762)'
with path: '/slave(762)/containers'
I0511 15:57:28.717561 17165 http.cpp:1115] HTTP GET for /slave(762)/containers from 172.17.0.2:59493
I0511 15:57:28.717620 17165 http.cpp:936] Authorizing principal 'test-principal' to GET the
'/containers' endpoint
I0511 15:57:28.721335 17159 slave.cpp:790] Agent terminating
[       OK ] Endpoint/SlaveEndpointTest.NoAuthorizer/2 (32 ms)
[----------] 9 tests from Endpoint/SlaveEndpointTest (271 ms total)

[----------] Global test environment tear-down
[==========] 1585 tests from 177 test cases ran. (522545 ms total)
[  PASSED  ] 1583 tests.
[  FAILED  ] 2 tests, listed below:
[  FAILED  ] MasterTest.MaxCompletedTasksPerFrameworkFlag
[  FAILED  ] ContentType/SchedulerTest.Subscribe/1, where GetParam() = application/json

 2 FAILED TESTS
  YOU HAVE 19 DISABLED TESTS

E0511 15:57:28.784235 17174 process.cpp:950] Failed to accept socket: future discarded
make[4]: *** [check-local] Error 1
make[4]: Leaving directory `/mesos/mesos-1.4.0/_build/src'
make[3]: *** [check-am] Error 2
make[3]: Leaving directory `/mesos/mesos-1.4.0/_build/src'
make[2]: *** [check] Error 2
make[2]: Leaving directory `/mesos/mesos-1.4.0/_build/src'
make[1]: *** [check-recursive] Error 1
make[1]: Leaving directory `/mesos/mesos-1.4.0/_build'
make: *** [distcheck] Error 1
+ docker rmi mesos-1494515532-5394
Untagged: mesos-1494515532-5394:latest
Deleted: sha256:8fc5ed6b3b58c63c004bfad8953cd35cc81ee0e9509381a2efb149e8066a5c36
Deleted: sha256:353e13310c0d0e2bcb0f793ce8d728ef1ce7a15943fa0f4fbc8b2ef4345c3424
Deleted: sha256:fff9fb0257b77abf3c0d5443d5a41aca1c1da8676e74c57df6cb9235e1a1d018
Deleted: sha256:dd0a0070a603e622278dc1390b41b072ce90f8b740cc88ec0fb977e098dea44b
Deleted: sha256:314134f78c91b774daf2bf8de59d08a8c931333dd02d52a091e88a6868611b2a
Deleted: sha256:7a64cdca096072d338406dfe8e78852f5d1c4600cf7ca83e49884607f8eeb6dd
Deleted: sha256:d26f2bf1158c42dc5dcbd25fb11b3e54cd15bca952dbca37c50f2b92a90c9046
Deleted: sha256:df6c4e9aa1a99f961c70a8750db8fa02b4f7f31fff4699c93b8a986952ced439
Deleted: sha256:2098f0552beeb627f9af971f8d3663e8fcf2232fbbccbed2b2441bbcdb138f91
Deleted: sha256:285092a1d7d876e5a3b3550942f34945601a2412e51c716ad9ae15cf4084ef97
Deleted: sha256:8c7e15ccbc75e723ba0758f2c7070b1938bf6305248e015f3d325d0565b9a5d7
Deleted: sha256:167ff0b0ec8b7169a2b2c69bc00dea43ffbebbfc832bfe67b8db41a6a56a258f
Deleted: sha256:74371894c235fe55ce63c41ff04282872421d396197cbae9e2e6ff5680d1fc7d
Deleted: sha256:36bbddbf35be2a109db11e1362c64ffd11b42d496e1658ac7151ad34de89c9d0
Deleted: sha256:dffd28f206c66b6ce6ca2416b01681f768a150e3a51afde6480776cf2987bbc9
Deleted: sha256:42e681acbc8e0e7495ace086e590df01a5d6e769fc6d4a00b677d4b1f24dbbab
Deleted: sha256:37112c36b3fd00a150df44f2044add9e0e99990d657b1de37b19cee90033db42
Deleted: sha256:1dc6ebd920a84cdbccfd75c3c1a6fea68cf3fcc24bf31b8d2e30300b72e3dbff
Deleted: sha256:c73213b5eb4a9ed39239e7a08b84d7f908f8e6b57a2d0e7c214d62ed3d9daa9c
Deleted: sha256:2a37a9cc681d3df673db0547c01abe3ec1de779ef08f2bea25498ad7d6048f24
Deleted: sha256:c006b6dca2faf2496bee869f7ebb03e50bc644c8ce67dff394d8d45d65d39a65
Deleted: sha256:7fddf01764e9462b87396dfe3cc176a0d102f49c461fe238fa0f23173dac1781
Deleted: sha256:ac515685e7e9f0626bcddcc7870f496002ed9e85f3b63a843da8dc699422f0e6
Deleted: sha256:2e18d6d2c09135428205bf80cc1693af9e684b83835ee4dba6c00ea3a3465c30
Build step 'Execute shell' marked build as failure

Mime
View raw message