mesos-builds mailing list archives

Site index · List index
Message view « Date » · « Thread »
Top « Date » · « Thread »
From Apache Jenkins Server <jenk...@builds.apache.org>
Subject Build failed in Jenkins: Mesos-Buildbot » cmake,gcc,--verbose --enable-libevent --enable-ssl,GLOG_v=1 MESOS_VERBOSE=1,centos:7,(docker||Hadoop)&&(!ubuntu-us1)&&(!ubuntu-eu2) #3660
Date Thu, 11 May 2017 15:54:51 GMT
See <https://builds.apache.org/job/Mesos-Buildbot/BUILDTOOL=cmake,COMPILER=gcc,CONFIGURATION=--verbose%20--enable-libevent%20--enable-ssl,ENVIRONMENT=GLOG_v=1%20MESOS_VERBOSE=1,OS=centos%3A7,label_exp=(docker%7C%7CHadoop)&&(!ubuntu-us1)&&(!ubuntu-eu2)/3660/display/redirect>

------------------------------------------
[...truncated 27.02 MB...]
I0511 15:54:40.024636  2359 slave.cpp:6152] Querying resource estimator for oversubscribable
resources
I0511 15:54:40.024776  2352 slave.cpp:6166] Received oversubscribable resources {} from the
resource estimator
I0511 15:54:40.025449  2349 process.cpp:3730] Handling HTTP event for process 'slave(751)'
with path: '/slave(751)/containers'
I0511 15:54:40.026010  2357 http.cpp:1115] HTTP GET for /slave(751)/containers from 172.17.0.3:56058
I0511 15:54:40.026051  2357 http.cpp:936] Authorizing principal 'test-principal' to GET the
'/containers' endpoint
I0511 15:54:40.027334  2354 slave.cpp:790] Agent terminating
[       OK ] Endpoint/SlaveEndpointTest.AuthorizedRequest/2 (12 ms)
[ RUN      ] Endpoint/SlaveEndpointTest.UnauthorizedRequest/0
I0511 15:54:40.032227 27417 containerizer.cpp:221] Using isolation: posix/cpu,posix/mem,filesystem/posix,network/cni
W0511 15:54:40.032462 27417 backend.cpp:76] Failed to create 'aufs' backend: AufsBackend requires
root privileges
W0511 15:54:40.032500 27417 backend.cpp:76] Failed to create 'bind' backend: BindBackend requires
root privileges
I0511 15:54:40.032511 27417 provisioner.cpp:249] Using default backend 'copy'
I0511 15:54:40.033416  2347 slave.cpp:225] Mesos agent started on (752)@172.17.0.3:41288
I0511 15:54:40.033432  2347 slave.cpp:226] Flags at startup: --acls="" --appc_simple_discovery_uri_prefix="http://"
--appc_store_dir="/tmp/mesos/store/appc" --authenticate_http_executors="true" --authenticate_http_readonly="true"
--authenticate_http_readwrite="true" --authenticatee="crammd5" --authentication_backoff_factor="1secs"
--authorizer="local" --cgroups_cpu_enable_pids_and_tids_count="false" --cgroups_enable_cfs="false"
--cgroups_hierarchy="/sys/fs/cgroup" --cgroups_limit_swap="false" --cgroups_root="mesos" --container_disk_watch_interval="15secs"
--containerizers="mesos" --credential="/tmp/Endpoint_SlaveEndpointTest_UnauthorizedRequest_0_utFMYk/credential"
--default_role="*" --disk_watch_interval="1mins" --docker="docker" --docker_kill_orphans="true"
--docker_registry="https://registry-1.docker.io" --docker_remove_delay="6hrs" --docker_socket="/var/run/docker.sock"
--docker_stop_timeout="0ns" --docker_store_dir="/tmp/mesos/store/docker" --docker_volume_checkpoint_dir="/var/run/mesos/isolators/docker/volume"
--enforce_container_disk_quota="false" --executor_registration_timeout="1mins" --executor_secret_key="/tmp/Endpoint_SlaveEndpointTest_UnauthorizedRequest_0_utFMYk/executor_secret_key"
--executor_shutdown_grace_period="5secs" --fetcher_cache_dir="/tmp/Endpoint_SlaveEndpointTest_UnauthorizedRequest_0_utFMYk/fetch"
--fetcher_cache_size="2GB" --frameworks_home="" --gc_delay="1weeks" --gc_disk_headroom="0.1"
--hadoop_home="" --help="false" --hostname_lookup="true" --http_command_executor="false" --http_credentials="/tmp/Endpoint_SlaveEndpointTest_UnauthorizedRequest_0_utFMYk/http_credentials"
--http_heartbeat_interval="30secs" --initialize_driver_logging="true" --isolation="posix/cpu,posix/mem"
--launcher="posix" --launcher_dir="/mesos/build/src" --logbufsecs="0" --logging_level="INFO"
--max_completed_executors_per_framework="150" --oversubscribed_resources_interval="15secs"
--perf_duration="10secs" --perf_interval="1mins" --port="5051" --qos_correction_interval_min="0ns"
--quiet="false" --recover="reconnect" --recovery_timeout="15mins" --registration_backoff_factor="10ms"
--resources="cpus:2;gpus:0;mem:1024;disk:1024;ports:[31000-32000]" --revocable_cpu_low_priority="true"
--runtime_dir="/tmp/Endpoint_SlaveEndpointTest_UnauthorizedRequest_0_utFMYk" --sandbox_directory="/mnt/mesos/sandbox"
--strict="true" --switch_user="true" --systemd_enable_support="true" --systemd_runtime_directory="/run/systemd/system"
--version="false" --work_dir="/tmp/Endpoint_SlaveEndpointTest_UnauthorizedRequest_0_lbfKfH"
I0511 15:54:40.033629  2347 credentials.hpp:86] Loading credential for authentication from
'/tmp/Endpoint_SlaveEndpointTest_UnauthorizedRequest_0_utFMYk/credential'
I0511 15:54:40.033706  2347 slave.cpp:258] Agent using credential for: test-principal
I0511 15:54:40.033720  2347 credentials.hpp:37] Loading credentials for authentication from
'/tmp/Endpoint_SlaveEndpointTest_UnauthorizedRequest_0_utFMYk/http_credentials'
I0511 15:54:40.033824  2347 http.cpp:975] Creating default 'basic' HTTP authenticator for
realm 'mesos-agent-executor'
I0511 15:54:40.033862  2347 http.cpp:996] Creating default 'jwt' HTTP authenticator for realm
'mesos-agent-executor'
I0511 15:54:40.034029  2347 http.cpp:975] Creating default 'basic' HTTP authenticator for
realm 'mesos-agent-readonly'
I0511 15:54:40.034070  2347 http.cpp:996] Creating default 'jwt' HTTP authenticator for realm
'mesos-agent-readonly'
I0511 15:54:40.034189  2347 http.cpp:975] Creating default 'basic' HTTP authenticator for
realm 'mesos-agent-readwrite'
I0511 15:54:40.034235  2347 http.cpp:996] Creating default 'jwt' HTTP authenticator for realm
'mesos-agent-readwrite'
I0511 15:54:40.034729  2347 slave.cpp:525] Agent resources: cpus(*):2; mem(*):1024; disk(*):1024;
ports(*):[31000-32000]
I0511 15:54:40.034760  2347 slave.cpp:533] Agent attributes: [  ]
I0511 15:54:40.034768  2347 slave.cpp:538] Agent hostname: 8ad86f695bce
I0511 15:54:40.034842  2361 status_update_manager.cpp:177] Pausing sending status updates
I0511 15:54:40.035173  2357 state.cpp:62] Recovering state from '/tmp/Endpoint_SlaveEndpointTest_UnauthorizedRequest_0_lbfKfH/meta'
I0511 15:54:40.035343  2367 status_update_manager.cpp:203] Recovering status update manager
I0511 15:54:40.035521  2355 containerizer.cpp:608] Recovering containerizer
I0511 15:54:40.036057  2367 provisioner.cpp:410] Provisioner recovery complete
I0511 15:54:40.036259  2346 slave.cpp:5970] Finished recovery
I0511 15:54:40.036630  2346 slave.cpp:6152] Querying resource estimator for oversubscribable
resources
I0511 15:54:40.036782  2362 slave.cpp:6166] Received oversubscribable resources {} from the
resource estimator
I0511 15:54:40.037463  2347 process.cpp:3730] Handling HTTP event for process 'slave(752)'
with path: '/slave(752)/monitor/statistics'
I0511 15:54:40.038130  2353 http.cpp:1115] HTTP GET for /slave(752)/monitor/statistics from
172.17.0.3:56060
I0511 15:54:40.038167  2353 http.cpp:936] Authorizing principal 'test-principal' to GET the
'/monitor/statistics' endpoint
I0511 15:54:40.039916  2355 slave.cpp:790] Agent terminating
[       OK ] Endpoint/SlaveEndpointTest.UnauthorizedRequest/0 (12 ms)
[ RUN      ] Endpoint/SlaveEndpointTest.UnauthorizedRequest/1
I0511 15:54:40.045243 27417 containerizer.cpp:221] Using isolation: posix/cpu,posix/mem,filesystem/posix,network/cni
W0511 15:54:40.045490 27417 backend.cpp:76] Failed to create 'aufs' backend: AufsBackend requires
root privileges
W0511 15:54:40.045526 27417 backend.cpp:76] Failed to create 'bind' backend: BindBackend requires
root privileges
I0511 15:54:40.045539 27417 provisioner.cpp:249] Using default backend 'copy'
I0511 15:54:40.046871  2366 slave.cpp:225] Mesos agent started on (753)@172.17.0.3:41288
I0511 15:54:40.046885  2366 slave.cpp:226] Flags at startup: --acls="" --appc_simple_discovery_uri_prefix="http://"
--appc_store_dir="/tmp/mesos/store/appc" --authenticate_http_executors="true" --authenticate_http_readonly="true"
--authenticate_http_readwrite="true" --authenticatee="crammd5" --authentication_backoff_factor="1secs"
--authorizer="local" --cgroups_cpu_enable_pids_and_tids_count="false" --cgroups_enable_cfs="false"
--cgroups_hierarchy="/sys/fs/cgroup" --cgroups_limit_swap="false" --cgroups_root="mesos" --container_disk_watch_interval="15secs"
--containerizers="mesos" --credential="/tmp/Endpoint_SlaveEndpointTest_UnauthorizedRequest_1_il2oZT/credential"
--default_role="*" --disk_watch_interval="1mins" --docker="docker" --docker_kill_orphans="true"
--docker_registry="https://registry-1.docker.io" --docker_remove_delay="6hrs" --docker_socket="/var/run/docker.sock"
--docker_stop_timeout="0ns" --docker_store_dir="/tmp/mesos/store/docker" --docker_volume_checkpoint_dir="/var/run/mesos/isolators/docker/volume"
--enforce_container_disk_quota="false" --executor_registration_timeout="1mins" --executor_secret_key="/tmp/Endpoint_SlaveEndpointTest_UnauthorizedRequest_1_il2oZT/executor_secret_key"
--executor_shutdown_grace_period="5secs" --fetcher_cache_dir="/tmp/Endpoint_SlaveEndpointTest_UnauthorizedRequest_1_il2oZT/fetch"
--fetcher_cache_size="2GB" --frameworks_home="" --gc_delay="1weeks" --gc_disk_headroom="0.1"
--hadoop_home="" --help="false" --hostname_lookup="true" --http_command_executor="false" --http_credentials="/tmp/Endpoint_SlaveEndpointTest_UnauthorizedRequest_1_il2oZT/http_credentials"
--http_heartbeat_interval="30secs" --initialize_driver_logging="true" --isolation="posix/cpu,posix/mem"
--launcher="posix" --launcher_dir="/mesos/build/src" --logbufsecs="0" --logging_level="INFO"
--max_completed_executors_per_framework="150" --oversubscribed_resources_interval="15secs"
--perf_duration="10secs" --perf_interval="1mins" --port="5051" --qos_correction_interval_min="0ns"
--quiet="false" --recover="reconnect" --recovery_timeout="15mins" --registration_backoff_factor="10ms"
--resources="cpus:2;gpus:0;mem:1024;disk:1024;ports:[31000-32000]" --revocable_cpu_low_priority="true"
--runtime_dir="/tmp/Endpoint_SlaveEndpointTest_UnauthorizedRequest_1_il2oZT" --sandbox_directory="/mnt/mesos/sandbox"
--strict="true" --switch_user="true" --systemd_enable_support="true" --systemd_runtime_directory="/run/systemd/system"
--version="false" --work_dir="/tmp/Endpoint_SlaveEndpointTest_UnauthorizedRequest_1_tUrqeg"
I0511 15:54:40.047096  2366 credentials.hpp:86] Loading credential for authentication from
'/tmp/Endpoint_SlaveEndpointTest_UnauthorizedRequest_1_il2oZT/credential'
I0511 15:54:40.047175  2366 slave.cpp:258] Agent using credential for: test-principal
I0511 15:54:40.047188  2366 credentials.hpp:37] Loading credentials for authentication from
'/tmp/Endpoint_SlaveEndpointTest_UnauthorizedRequest_1_il2oZT/http_credentials'
I0511 15:54:40.047297  2366 http.cpp:975] Creating default 'basic' HTTP authenticator for
realm 'mesos-agent-executor'
I0511 15:54:40.047334  2366 http.cpp:996] Creating default 'jwt' HTTP authenticator for realm
'mesos-agent-executor'
I0511 15:54:40.047402  2366 http.cpp:975] Creating default 'basic' HTTP authenticator for
realm 'mesos-agent-readonly'
I0511 15:54:40.047485  2366 http.cpp:996] Creating default 'jwt' HTTP authenticator for realm
'mesos-agent-readonly'
I0511 15:54:40.047555  2366 http.cpp:975] Creating default 'basic' HTTP authenticator for
realm 'mesos-agent-readwrite'
I0511 15:54:40.047595  2366 http.cpp:996] Creating default 'jwt' HTTP authenticator for realm
'mesos-agent-readwrite'
I0511 15:54:40.048176  2366 slave.cpp:525] Agent resources: cpus(*):2; mem(*):1024; disk(*):1024;
ports(*):[31000-32000]
I0511 15:54:40.048207  2366 slave.cpp:533] Agent attributes: [  ]
I0511 15:54:40.048216  2366 slave.cpp:538] Agent hostname: 8ad86f695bce
I0511 15:54:40.048298  2352 status_update_manager.cpp:177] Pausing sending status updates
I0511 15:54:40.048602  2349 state.cpp:62] Recovering state from '/tmp/Endpoint_SlaveEndpointTest_UnauthorizedRequest_1_tUrqeg/meta'
I0511 15:54:40.048810  2367 status_update_manager.cpp:203] Recovering status update manager
I0511 15:54:40.048913  2351 containerizer.cpp:608] Recovering containerizer
I0511 15:54:40.049512  2347 provisioner.cpp:410] Provisioner recovery complete
I0511 15:54:40.049680  2366 slave.cpp:5970] Finished recovery
I0511 15:54:40.050030  2366 slave.cpp:6152] Querying resource estimator for oversubscribable
resources
I0511 15:54:40.050145  2350 slave.cpp:6166] Received oversubscribable resources {} from the
resource estimator
I0511 15:54:40.050771  2347 process.cpp:3730] Handling HTTP event for process 'slave(753)'
with path: '/slave(753)/monitor/statistics.json'
I0511 15:54:40.051527  2368 http.cpp:1115] HTTP GET for /slave(753)/monitor/statistics.json
from 172.17.0.3:56062
I0511 15:54:40.051566  2368 http.cpp:936] Authorizing principal 'test-principal' to GET the
'/monitor/statistics.json' endpoint
I0511 15:54:40.052774  2361 slave.cpp:790] Agent terminating
[       OK ] Endpoint/SlaveEndpointTest.UnauthorizedRequest/1 (11 ms)
[ RUN      ] Endpoint/SlaveEndpointTest.UnauthorizedRequest/2
I0511 15:54:40.057128 27417 containerizer.cpp:221] Using isolation: posix/cpu,posix/mem,filesystem/posix,network/cni
W0511 15:54:40.057358 27417 backend.cpp:76] Failed to create 'aufs' backend: AufsBackend requires
root privileges
W0511 15:54:40.057394 27417 backend.cpp:76] Failed to create 'bind' backend: BindBackend requires
root privileges
I0511 15:54:40.057410 27417 provisioner.cpp:249] Using default backend 'copy'
I0511 15:54:40.058254  2348 slave.cpp:225] Mesos agent started on (754)@172.17.0.3:41288
I0511 15:54:40.058272  2348 slave.cpp:226] Flags at startup: --acls="" --appc_simple_discovery_uri_prefix="http://"
--appc_store_dir="/tmp/mesos/store/appc" --authenticate_http_executors="true" --authenticate_http_readonly="true"
--authenticate_http_readwrite="true" --authenticatee="crammd5" --authentication_backoff_factor="1secs"
--authorizer="local" --cgroups_cpu_enable_pids_and_tids_count="false" --cgroups_enable_cfs="false"
--cgroups_hierarchy="/sys/fs/cgroup" --cgroups_limit_swap="false" --cgroups_root="mesos" --container_disk_watch_interval="15secs"
--containerizers="mesos" --credential="/tmp/Endpoint_SlaveEndpointTest_UnauthorizedRequest_2_OGzn7s/credential"
--default_role="*" --disk_watch_interval="1mins" --docker="docker" --docker_kill_orphans="true"
--docker_registry="https://registry-1.docker.io" --docker_remove_delay="6hrs" --docker_socket="/var/run/docker.sock"
--docker_stop_timeout="0ns" --docker_store_dir="/tmp/mesos/store/docker" --docker_volume_checkpoint_dir="/var/run/mesos/isolators/docker/volume"
--enforce_container_disk_quota="false" --executor_registration_timeout="1mins" --executor_secret_key="/tmp/Endpoint_SlaveEndpointTest_UnauthorizedRequest_2_OGzn7s/executor_secret_key"
--executor_shutdown_grace_period="5secs" --fetcher_cache_dir="/tmp/Endpoint_SlaveEndpointTest_UnauthorizedRequest_2_OGzn7s/fetch"
--fetcher_cache_size="2GB" --frameworks_home="" --gc_delay="1weeks" --gc_disk_headroom="0.1"
--hadoop_home="" --help="false" --hostname_lookup="true" --http_command_executor="false" --http_credentials="/tmp/Endpoint_SlaveEndpointTest_UnauthorizedRequest_2_OGzn7s/http_credentials"
--http_heartbeat_interval="30secs" --initialize_driver_logging="true" --isolation="posix/cpu,posix/mem"
--launcher="posix" --launcher_dir="/mesos/build/src" --logbufsecs="0" --logging_level="INFO"
--max_completed_executors_per_framework="150" --oversubscribed_resources_interval="15secs"
--perf_duration="10secs" --perf_interval="1mins" --port="5051" --qos_correction_interval_min="0ns"
--quiet="false" --recover="reconnect" --recovery_timeout="15mins" --registration_backoff_factor="10ms"
--resources="cpus:2;gpus:0;mem:1024;disk:1024;ports:[31000-32000]" --revocable_cpu_low_priority="true"
--runtime_dir="/tmp/Endpoint_SlaveEndpointTest_UnauthorizedRequest_2_OGzn7s" --sandbox_directory="/mnt/mesos/sandbox"
--strict="true" --switch_user="true" --systemd_enable_support="true" --systemd_runtime_directory="/run/systemd/system"
--version="false" --work_dir="/tmp/Endpoint_SlaveEndpointTest_UnauthorizedRequest_2_bzACkP"
I0511 15:54:40.058521  2348 credentials.hpp:86] Loading credential for authentication from
'/tmp/Endpoint_SlaveEndpointTest_UnauthorizedRequest_2_OGzn7s/credential'
I0511 15:54:40.058609  2348 slave.cpp:258] Agent using credential for: test-principal
I0511 15:54:40.058619  2348 credentials.hpp:37] Loading credentials for authentication from
'/tmp/Endpoint_SlaveEndpointTest_UnauthorizedRequest_2_OGzn7s/http_credentials'
I0511 15:54:40.058727  2348 http.cpp:975] Creating default 'basic' HTTP authenticator for
realm 'mesos-agent-executor'
I0511 15:54:40.058765  2348 http.cpp:996] Creating default 'jwt' HTTP authenticator for realm
'mesos-agent-executor'
I0511 15:54:40.058832  2348 http.cpp:975] Creating default 'basic' HTTP authenticator for
realm 'mesos-agent-readonly'
I0511 15:54:40.058872  2348 http.cpp:996] Creating default 'jwt' HTTP authenticator for realm
'mesos-agent-readonly'
I0511 15:54:40.058928  2348 http.cpp:975] Creating default 'basic' HTTP authenticator for
realm 'mesos-agent-readwrite'
I0511 15:54:40.058959  2348 http.cpp:996] Creating default 'jwt' HTTP authenticator for realm
'mesos-agent-readwrite'
I0511 15:54:40.059434  2348 slave.cpp:525] Agent resources: cpus(*):2; mem(*):1024; disk(*):1024;
ports(*):[31000-32000]
I0511 15:54:40.059466  2348 slave.cpp:533] Agent attributes: [  ]
I0511 15:54:40.059478  2348 slave.cpp:538] Agent hostname: 8ad86f695bce
I0511 15:54:40.059543  2353 status_update_manager.cpp:177] Pausing sending status updates
I0511 15:54:40.059777  2355 state.cpp:62] Recovering state from '/tmp/Endpoint_SlaveEndpointTest_UnauthorizedRequest_2_bzACkP/meta'
I0511 15:54:40.059895  2349 status_update_manager.cpp:203] Recovering status update manager
I0511 15:54:40.060161  2347 containerizer.cpp:608] Recovering containerizer
I0511 15:54:40.060672  2352 provisioner.cpp:410] Provisioner recovery complete
I0511 15:54:40.060837  2346 slave.cpp:5970] Finished recovery
I0511 15:54:40.061185  2346 slave.cpp:6152] Querying resource estimator for oversubscribable
resources
I0511 15:54:40.061400  2359 slave.cpp:6166] Received oversubscribable resources {} from the
resource estimator
I0511 15:54:40.061987  2354 process.cpp:3730] Handling HTTP event for process 'slave(754)'
with path: '/slave(754)/containers'
I0511 15:54:40.062685  2354 http.cpp:1115] HTTP GET for /slave(754)/containers from 172.17.0.3:56064
I0511 15:54:40.062714  2354 http.cpp:936] Authorizing principal 'test-principal' to GET the
'/containers' endpoint
I0511 15:54:40.063760  2348 slave.cpp:790] Agent terminating
[       OK ] Endpoint/SlaveEndpointTest.UnauthorizedRequest/2 (11 ms)
[ RUN      ] Endpoint/SlaveEndpointTest.NoAuthorizer/0
I0511 15:54:40.068506 27417 containerizer.cpp:221] Using isolation: posix/cpu,posix/mem,filesystem/posix,network/cni
W0511 15:54:40.068738 27417 backend.cpp:76] Failed to create 'aufs' backend: AufsBackend requires
root privileges
W0511 15:54:40.068780 27417 backend.cpp:76] Failed to create 'bind' backend: BindBackend requires
root privileges
I0511 15:54:40.068792 27417 provisioner.cpp:249] Using default backend 'copy'
I0511 15:54:40.069319 27417 cluster.cpp:448] Creating default 'local' authorizer
I0511 15:54:40.069768  2346 slave.cpp:225] Mesos agent started on (755)@172.17.0.3:41288
I0511 15:54:40.069787  2346 slave.cpp:226] Flags at startup: --acls="" --appc_simple_discovery_uri_prefix="http://"
--appc_store_dir="/tmp/mesos/store/appc" --authenticate_http_executors="true" --authenticate_http_readonly="true"
--authenticate_http_readwrite="true" --authenticatee="crammd5" --authentication_backoff_factor="1secs"
--authorizer="local" --cgroups_cpu_enable_pids_and_tids_count="false" --cgroups_enable_cfs="false"
--cgroups_hierarchy="/sys/fs/cgroup" --cgroups_limit_swap="false" --cgroups_root="mesos" --container_disk_watch_interval="15secs"
--containerizers="mesos" --credential="/tmp/Endpoint_SlaveEndpointTest_NoAuthorizer_0_JrA3l2/credential"
--default_role="*" --disk_watch_interval="1mins" --docker="docker" --docker_kill_orphans="true"
--docker_registry="https://registry-1.docker.io" --docker_remove_delay="6hrs" --docker_socket="/var/run/docker.sock"
--docker_stop_timeout="0ns" --docker_store_dir="/tmp/mesos/store/docker" --docker_volume_checkpoint_dir="/var/run/mesos/isolators/docker/volume"
--enforce_container_disk_quota="false" --executor_registration_timeout="1mins" --executor_secret_key="/tmp/Endpoint_SlaveEndpointTest_NoAuthorizer_0_JrA3l2/executor_secret_key"
--executor_shutdown_grace_period="5secs" --fetcher_cache_dir="/tmp/Endpoint_SlaveEndpointTest_NoAuthorizer_0_JrA3l2/fetch"
--fetcher_cache_size="2GB" --frameworks_home="" --gc_delay="1weeks" --gc_disk_headroom="0.1"
--hadoop_home="" --help="false" --hostname_lookup="true" --http_command_executor="false" --http_credentials="/tmp/Endpoint_SlaveEndpointTest_NoAuthorizer_0_JrA3l2/http_credentials"
--http_heartbeat_interval="30secs" --initialize_driver_logging="true" --isolation="posix/cpu,posix/mem"
--launcher="posix" --launcher_dir="/mesos/build/src" --logbufsecs="0" --logging_level="INFO"
--max_completed_executors_per_framework="150" --oversubscribed_resources_interval="15secs"
--perf_duration="10secs" --perf_interval="1mins" --port="5051" --qos_correction_interval_min="0ns"
--quiet="false" --recover="reconnect" --recovery_timeout="15mins" --registration_backoff_factor="10ms"
--resources="cpus:2;gpus:0;mem:1024;disk:1024;ports:[31000-32000]" --revocable_cpu_low_priority="true"
--runtime_dir="/tmp/Endpoint_SlaveEndpointTest_NoAuthorizer_0_JrA3l2" --sandbox_directory="/mnt/mesos/sandbox"
--strict="true" --switch_user="true" --systemd_enable_support="true" --systemd_runtime_directory="/run/systemd/system"
--version="false" --work_dir="/tmp/Endpoint_SlaveEndpointTest_NoAuthorizer_0_P0tCxo"
I0511 15:54:40.070004  2346 credentials.hpp:86] Loading credential for authentication from
'/tmp/Endpoint_SlaveEndpointTest_NoAuthorizer_0_JrA3l2/credential'
I0511 15:54:40.070106  2346 slave.cpp:258] Agent using credential for: test-principal
I0511 15:54:40.070124  2346 credentials.hpp:37] Loading credentials for authentication from
'/tmp/Endpoint_SlaveEndpointTest_NoAuthorizer_0_JrA3l2/http_credentials'
I0511 15:54:40.070261  2346 http.cpp:975] Creating default 'basic' HTTP authenticator for
realm 'mesos-agent-executor'
I0511 15:54:40.070305  2346 http.cpp:996] Creating default 'jwt' HTTP authenticator for realm
'mesos-agent-executor'
I0511 15:54:40.070399  2346 http.cpp:975] Creating default 'basic' HTTP authenticator for
realm 'mesos-agent-readonly'
I0511 15:54:40.070443  2346 http.cpp:996] Creating default 'jwt' HTTP authenticator for realm
'mesos-agent-readonly'
I0511 15:54:40.070528  2346 http.cpp:975] Creating default 'basic' HTTP authenticator for
realm 'mesos-agent-readwrite'
I0511 15:54:40.070580  2346 http.cpp:996] Creating default 'jwt' HTTP authenticator for realm
'mesos-agent-readwrite'
I0511 15:54:40.071123  2346 slave.cpp:525] Agent resources: cpus(*):2; mem(*):1024; disk(*):1024;
ports(*):[31000-32000]
I0511 15:54:40.071156  2346 slave.cpp:533] Agent attributes: [  ]
I0511 15:54:40.071167  2346 slave.cpp:538] Agent hostname: 8ad86f695bce
I0511 15:54:40.071234  2356 status_update_manager.cpp:177] Pausing sending status updates
I0511 15:54:40.071527  2358 state.cpp:62] Recovering state from '/tmp/Endpoint_SlaveEndpointTest_NoAuthorizer_0_P0tCxo/meta'
I0511 15:54:40.071724  2367 status_update_manager.cpp:203] Recovering status update manager
I0511 15:54:40.071799  2354 containerizer.cpp:608] Recovering containerizer
I0511 15:54:40.072458  2362 provisioner.cpp:410] Provisioner recovery complete
I0511 15:54:40.072650  2356 slave.cpp:5970] Finished recovery
I0511 15:54:40.073002  2356 slave.cpp:6152] Querying resource estimator for oversubscribable
resources
I0511 15:54:40.073127  2360 slave.cpp:6166] Received oversubscribable resources {} from the
resource estimator
I0511 15:54:40.073664  2354 process.cpp:3730] Handling HTTP event for process 'slave(755)'
with path: '/slave(755)/monitor/statistics'
I0511 15:54:40.074257  2364 http.cpp:1115] HTTP GET for /slave(755)/monitor/statistics from
172.17.0.3:56066
I0511 15:54:40.074290  2364 http.cpp:936] Authorizing principal 'test-principal' to GET the
'/monitor/statistics' endpoint
I0511 15:54:40.075887  2362 slave.cpp:790] Agent terminating
[       OK ] Endpoint/SlaveEndpointTest.NoAuthorizer/0 (12 ms)
[ RUN      ] Endpoint/SlaveEndpointTest.NoAuthorizer/1
I0511 15:54:40.080590 27417 containerizer.cpp:221] Using isolation: posix/cpu,posix/mem,filesystem/posix,network/cni
W0511 15:54:40.080826 27417 backend.cpp:76] Failed to create 'aufs' backend: AufsBackend requires
root privileges
W0511 15:54:40.080868 27417 backend.cpp:76] Failed to create 'bind' backend: BindBackend requires
root privileges
I0511 15:54:40.080885 27417 provisioner.cpp:249] Using default backend 'copy'
I0511 15:54:40.081496 27417 cluster.cpp:448] Creating default 'local' authorizer
I0511 15:54:40.081894  2349 slave.cpp:225] Mesos agent started on (756)@172.17.0.3:41288
I0511 15:54:40.081913  2349 slave.cpp:226] Flags at startup: --acls="" --appc_simple_discovery_uri_prefix="http://"
--appc_store_dir="/tmp/mesos/store/appc" --authenticate_http_executors="true" --authenticate_http_readonly="true"
--authenticate_http_readwrite="true" --authenticatee="crammd5" --authentication_backoff_factor="1secs"
--authorizer="local" --cgroups_cpu_enable_pids_and_tids_count="false" --cgroups_enable_cfs="false"
--cgroups_hierarchy="/sys/fs/cgroup" --cgroups_limit_swap="false" --cgroups_root="mesos" --container_disk_watch_interval="15secs"
--containerizers="mesos" --credential="/tmp/Endpoint_SlaveEndpointTest_NoAuthorizer_1_O0oUHB/credential"
--default_role="*" --disk_watch_interval="1mins" --docker="docker" --docker_kill_orphans="true"
--docker_registry="https://registry-1.docker.io" --docker_remove_delay="6hrs" --docker_socket="/var/run/docker.sock"
--docker_stop_timeout="0ns" --docker_store_dir="/tmp/mesos/store/docker" --docker_volume_checkpoint_dir="/var/run/mesos/isolators/docker/volume"
--enforce_container_disk_quota="false" --executor_registration_timeout="1mins" --executor_secret_key="/tmp/Endpoint_SlaveEndpointTest_NoAuthorizer_1_O0oUHB/executor_secret_key"
--executor_shutdown_grace_period="5secs" --fetcher_cache_dir="/tmp/Endpoint_SlaveEndpointTest_NoAuthorizer_1_O0oUHB/fetch"
--fetcher_cache_size="2GB" --frameworks_home="" --gc_delay="1weeks" --gc_disk_headroom="0.1"
--hadoop_home="" --help="false" --hostname_lookup="true" --http_command_executor="false" --http_credentials="/tmp/Endpoint_SlaveEndpointTest_NoAuthorizer_1_O0oUHB/http_credentials"
--http_heartbeat_interval="30secs" --initialize_driver_logging="true" --isolation="posix/cpu,posix/mem"
--launcher="posix" --launcher_dir="/mesos/build/src" --logbufsecs="0" --logging_level="INFO"
--max_completed_executors_per_framework="150" --oversubscribed_resources_interval="15secs"
--perf_duration="10secs" --perf_interval="1mins" --port="5051" --qos_correction_interval_min="0ns"
--quiet="false" --recover="reconnect" --recovery_timeout="15mins" --registration_backoff_factor="10ms"
--resources="cpus:2;gpus:0;mem:1024;disk:1024;ports:[31000-32000]" --revocable_cpu_low_priority="true"
--runtime_dir="/tmp/Endpoint_SlaveEndpointTest_NoAuthorizer_1_O0oUHB" --sandbox_directory="/mnt/mesos/sandbox"
--strict="true" --switch_user="true" --systemd_enable_support="true" --systemd_runtime_directory="/run/systemd/system"
--version="false" --work_dir="/tmp/Endpoint_SlaveEndpointTest_NoAuthorizer_1_D8jFRX"
I0511 15:54:40.082159  2349 credentials.hpp:86] Loading credential for authentication from
'/tmp/Endpoint_SlaveEndpointTest_NoAuthorizer_1_O0oUHB/credential'
I0511 15:54:40.082250  2349 slave.cpp:258] Agent using credential for: test-principal
I0511 15:54:40.082267  2349 credentials.hpp:37] Loading credentials for authentication from
'/tmp/Endpoint_SlaveEndpointTest_NoAuthorizer_1_O0oUHB/http_credentials'
I0511 15:54:40.082401  2349 http.cpp:975] Creating default 'basic' HTTP authenticator for
realm 'mesos-agent-executor'
I0511 15:54:40.082437  2349 http.cpp:996] Creating default 'jwt' HTTP authenticator for realm
'mesos-agent-executor'
I0511 15:54:40.082474  2349 http.cpp:975] Creating default 'basic' HTTP authenticator for
realm 'mesos-agent-readonly'
I0511 15:54:40.082564  2349 http.cpp:996] Creating default 'jwt' HTTP authenticator for realm
'mesos-agent-readonly'
I0511 15:54:40.082667  2349 http.cpp:975] Creating default 'basic' HTTP authenticator for
realm 'mesos-agent-readwrite'
I0511 15:54:40.082720  2349 http.cpp:996] Creating default 'jwt' HTTP authenticator for realm
'mesos-agent-readwrite'
I0511 15:54:40.083137  2349 slave.cpp:525] Agent resources: cpus(*):2; mem(*):1024; disk(*):1024;
ports(*):[31000-32000]
I0511 15:54:40.083169  2349 slave.cpp:533] Agent attributes: [  ]
I0511 15:54:40.083176  2349 slave.cpp:538] Agent hostname: 8ad86f695bce
I0511 15:54:40.083242  2361 status_update_manager.cpp:177] Pausing sending status updates
I0511 15:54:40.083518  2367 state.cpp:62] Recovering state from '/tmp/Endpoint_SlaveEndpointTest_NoAuthorizer_1_D8jFRX/meta'
I0511 15:54:40.083820  2357 status_update_manager.cpp:203] Recovering status update manager
I0511 15:54:40.084003  2364 containerizer.cpp:608] Recovering containerizer
I0511 15:54:40.084527  2366 provisioner.cpp:410] Provisioner recovery complete
I0511 15:54:40.084695  2351 slave.cpp:5970] Finished recovery
I0511 15:54:40.085005  2351 slave.cpp:6152] Querying resource estimator for oversubscribable
resources
I0511 15:54:40.085080  2366 slave.cpp:6166] Received oversubscribable resources {} from the
resource estimator
I0511 15:54:40.085624  2360 process.cpp:3730] Handling HTTP event for process 'slave(756)'
with path: '/slave(756)/monitor/statistics.json'
I0511 15:54:40.086323  2369 http.cpp:1115] HTTP GET for /slave(756)/monitor/statistics.json
from 172.17.0.3:56068
I0511 15:54:40.086360  2369 http.cpp:936] Authorizing principal 'test-principal' to GET the
'/monitor/statistics.json' endpoint
I0511 15:54:40.087954  2358 slave.cpp:790] Agent terminating
[       OK ] Endpoint/SlaveEndpointTest.NoAuthorizer/1 (12 ms)
[ RUN      ] Endpoint/SlaveEndpointTest.NoAuthorizer/2
I0511 15:54:40.092664 27417 containerizer.cpp:221] Using isolation: posix/cpu,posix/mem,filesystem/posix,network/cni
W0511 15:54:40.092895 27417 backend.cpp:76] Failed to create 'aufs' backend: AufsBackend requires
root privileges
W0511 15:54:40.092931 27417 backend.cpp:76] Failed to create 'bind' backend: BindBackend requires
root privileges
I0511 15:54:40.092944 27417 provisioner.cpp:249] Using default backend 'copy'
I0511 15:54:40.093461 27417 cluster.cpp:448] Creating default 'local' authorizer
I0511 15:54:40.093860  2351 slave.cpp:225] Mesos agent started on (757)@172.17.0.3:41288
I0511 15:54:40.093874  2351 slave.cpp:226] Flags at startup: --acls="" --appc_simple_discovery_uri_prefix="http://"
--appc_store_dir="/tmp/mesos/store/appc" --authenticate_http_executors="true" --authenticate_http_readonly="true"
--authenticate_http_readwrite="true" --authenticatee="crammd5" --authentication_backoff_factor="1secs"
--authorizer="local" --cgroups_cpu_enable_pids_and_tids_count="false" --cgroups_enable_cfs="false"
--cgroups_hierarchy="/sys/fs/cgroup" --cgroups_limit_swap="false" --cgroups_root="mesos" --container_disk_watch_interval="15secs"
--containerizers="mesos" --credential="/tmp/Endpoint_SlaveEndpointTest_NoAuthorizer_2_riJVab/credential"
--default_role="*" --disk_watch_interval="1mins" --docker="docker" --docker_kill_orphans="true"
--docker_registry="https://registry-1.docker.io" --docker_remove_delay="6hrs" --docker_socket="/var/run/docker.sock"
--docker_stop_timeout="0ns" --docker_store_dir="/tmp/mesos/store/docker" --docker_volume_checkpoint_dir="/var/run/mesos/isolators/docker/volume"
--enforce_container_disk_quota="false" --executor_registration_timeout="1mins" --executor_secret_key="/tmp/Endpoint_SlaveEndpointTest_NoAuthorizer_2_riJVab/executor_secret_key"
--executor_shutdown_grace_period="5secs" --fetcher_cache_dir="/tmp/Endpoint_SlaveEndpointTest_NoAuthorizer_2_riJVab/fetch"
--fetcher_cache_size="2GB" --frameworks_home="" --gc_delay="1weeks" --gc_disk_headroom="0.1"
--hadoop_home="" --help="false" --hostname_lookup="true" --http_command_executor="false" --http_credentials="/tmp/Endpoint_SlaveEndpointTest_NoAuthorizer_2_riJVab/http_credentials"
--http_heartbeat_interval="30secs" --initialize_driver_logging="true" --isolation="posix/cpu,posix/mem"
--launcher="posix" --launcher_dir="/mesos/build/src" --logbufsecs="0" --logging_level="INFO"
--max_completed_executors_per_framework="150" --oversubscribed_resources_interval="15secs"
--perf_duration="10secs" --perf_interval="1mins" --port="5051" --qos_correction_interval_min="0ns"
--quiet="false" --recover="reconnect" --recovery_timeout="15mins" --registration_backoff_factor="10ms"
--resources="cpus:2;gpus:0;mem:1024;disk:1024;ports:[31000-32000]" --revocable_cpu_low_priority="true"
--runtime_dir="/tmp/Endpoint_SlaveEndpointTest_NoAuthorizer_2_riJVab" --sandbox_directory="/mnt/mesos/sandbox"
--strict="true" --switch_user="true" --systemd_enable_support="true" --systemd_runtime_directory="/run/systemd/system"
--version="false" --work_dir="/tmp/Endpoint_SlaveEndpointTest_NoAuthorizer_2_3ZATix"
I0511 15:54:40.094069  2351 credentials.hpp:86] Loading credential for authentication from
'/tmp/Endpoint_SlaveEndpointTest_NoAuthorizer_2_riJVab/credential'
I0511 15:54:40.094138  2351 slave.cpp:258] Agent using credential for: test-principal
I0511 15:54:40.094149  2351 credentials.hpp:37] Loading credentials for authentication from
'/tmp/Endpoint_SlaveEndpointTest_NoAuthorizer_2_riJVab/http_credentials'
I0511 15:54:40.094259  2351 http.cpp:975] Creating default 'basic' HTTP authenticator for
realm 'mesos-agent-executor'
I0511 15:54:40.094300  2351 http.cpp:996] Creating default 'jwt' HTTP authenticator for realm
'mesos-agent-executor'
I0511 15:54:40.094421  2351 http.cpp:975] Creating default 'basic' HTTP authenticator for
realm 'mesos-agent-readonly'
I0511 15:54:40.094470  2351 http.cpp:996] Creating default 'jwt' HTTP authenticator for realm
'mesos-agent-readonly'
I0511 15:54:40.094552  2351 http.cpp:975] Creating default 'basic' HTTP authenticator for
realm 'mesos-agent-readwrite'
I0511 15:54:40.094681  2351 http.cpp:996] Creating default 'jwt' HTTP authenticator for realm
'mesos-agent-readwrite'
I0511 15:54:40.095101  2351 slave.cpp:525] Agent resources: cpus(*):2; mem(*):1024; disk(*):1024;
ports(*):[31000-32000]
I0511 15:54:40.095131  2351 slave.cpp:533] Agent attributes: [  ]
I0511 15:54:40.095137  2351 slave.cpp:538] Agent hostname: 8ad86f695bce
I0511 15:54:40.095197  2362 status_update_manager.cpp:177] Pausing sending status updates
I0511 15:54:40.095417  2352 state.cpp:62] Recovering state from '/tmp/Endpoint_SlaveEndpointTest_NoAuthorizer_2_3ZATix/meta'
I0511 15:54:40.095549  2362 status_update_manager.cpp:203] Recovering status update manager
I0511 15:54:40.095638  2366 containerizer.cpp:608] Recovering containerizer
I0511 15:54:40.096071  2351 provisioner.cpp:410] Provisioner recovery complete
I0511 15:54:40.096280  2368 slave.cpp:5970] Finished recovery
I0511 15:54:40.096598  2368 slave.cpp:6152] Querying resource estimator for oversubscribable
resources
I0511 15:54:40.096704  2354 slave.cpp:6166] Received oversubscribable resources {} from the
resource estimator
I0511 15:54:40.097334  2355 process.cpp:3730] Handling HTTP event for process 'slave(757)'
with path: '/slave(757)/containers'
I0511 15:54:40.097918  2362 http.cpp:1115] HTTP GET for /slave(757)/containers from 172.17.0.3:56070
I0511 15:54:40.097956  2362 http.cpp:936] Authorizing principal 'test-principal' to GET the
'/containers' endpoint
I0511 15:54:40.099427  2366 slave.cpp:790] Agent terminating
[       OK ] Endpoint/SlaveEndpointTest.NoAuthorizer/2 (11 ms)
[----------] 9 tests from Endpoint/SlaveEndpointTest (110 ms total)

[----------] Global test environment tear-down
[==========] 1532 tests from 169 test cases ran. (266802 ms total)
[  PASSED  ] 1531 tests.
[  FAILED  ] 1 test, listed below:
[  FAILED  ] MasterTest.RecoveredFramework

 1 FAILED TEST
  YOU HAVE 19 DISABLED TESTS

E0511 15:54:40.146230  2370 process.cpp:950] Failed to accept socket: future discarded
make[3]: *** [CMakeFiles/check] Error 1
make[3]: Leaving directory `/mesos/build'
make[2]: *** [CMakeFiles/check.dir/all] Error 2
make[2]: Leaving directory `/mesos/build'
make[1]: *** [CMakeFiles/check.dir/rule] Error 2
make[1]: Leaving directory `/mesos/build'
make: *** [check] Error 2
+ docker rmi mesos-1494515543-17187
Untagged: mesos-1494515543-17187:latest
Deleted: sha256:1745d93854110f264ced16c174ae60b419853076cc91b8fbd81150354574dec0
Deleted: sha256:04ef8bf7e434c04ee79f4f54654f9f8c8a3277b73249868f2af4ef0b3c577285
Deleted: sha256:76833d28f6b64438632682aeaf4f6f0cb68d16f3f152cfa4c9903164c84acd56
Deleted: sha256:220e744b41666ed533ae207ca6fec1d18feb43e2b8f3b9a70697d47dfdcc4e34
Deleted: sha256:abd7fdf8f66276d9e06f2ad195f9546a751271cb707541f9af330d218d604110
Deleted: sha256:490bee0bd2831aeda1f8edbf79c88198919be4b8e118e2bf6b7df335c3a6a3bf
Deleted: sha256:b98a8ae23c49747a3a82bd4f1a24a09f174df1df8f7aee8731be02d374c29fc6
Deleted: sha256:b7f93531305bac9967a50993c1ede67ebcc31e56db4d72e20260e9484155735d
Deleted: sha256:fa5767012f5ee94704d0b35930776cc631c6b5c3fff7056e1686d29bfecde0ef
Deleted: sha256:29ac44b054a71425f2598e04deaf7f31ea85cb7bb66cfbf10c07ae108f964769
Deleted: sha256:7309dc518e2822a71bc3d79c97c4bd7f3758b971b89536d9e27e9b556346ddb9
Deleted: sha256:b2a559f6e8f096146d1e1d2f5a6308657de407e3e05a9e0075efe27ac61cd5fa
Deleted: sha256:a70c1cc57d564e7ba55c1c8a15331e689d652a0cb3384604ff644bbe7a5831fd
Deleted: sha256:adea234baa47eaec8e2945701accd5307d92c9395b996c876d22d9728ef6a7f7
Deleted: sha256:f3badd2cee663730acda9b3c3e05ca3589e33c768a202995a0ed5d64a1d2c01d
Deleted: sha256:0b70599ff01bbdbdadbbde853f912629248c7b9f625601d65557ef2ec8ab22bd
Deleted: sha256:d80410b51c58ae5c03f92e2fd015330c9812be06cad87da686d379fef3ff7ff6
Deleted: sha256:afd3bd5d82ec54a71d214f6428d9e83574bab5335c80efa73d4aa4b748681920
Deleted: sha256:08dd18b6253f3311d48871e1519c857658cddb33f5ae30c89d631e226a6b685e
Deleted: sha256:db21aab6b67dcc4c4f0380a57ad1cb04c169264098c3c22f949de27579c25059
Deleted: sha256:55b4f7caa24a13f1beaa50d18dc2ca8ee6ae7370130abcda58c6d110a2512229
Deleted: sha256:3694c206882c158592f84660e7aa0916e89cdc776cdaa0893555599c1df3b57d
Deleted: sha256:5cfd2560f94311d3a0663a227ea22384491c0e0c2557274d684accd2cb2944b2
Deleted: sha256:73a0bb970b84ef6d9f931db468d9ba53ffd3bd6387557a4d08028cabbd5c1ff4
Deleted: sha256:5f7decbc069833aaa7cb0f769b1998ab1c08768c3ce61b9ecb2efd0b45591fd0
Build step 'Execute shell' marked build as failure

Mime
View raw message