mesos-builds mailing list archives

Site index · List index
Message view « Date » · « Thread »
Top « Date » · « Thread »
From Apache Jenkins Server <jenk...@builds.apache.org>
Subject Build failed in Jenkins: Mesos-Buildbot » autotools,clang,--verbose --enable-libevent --enable-ssl,GLOG_v=1 MESOS_VERBOSE=1,ubuntu:14.04,(docker||Hadoop)&&(!ubuntu-us1)&&(!ubuntu-eu2) #3682
Date Tue, 16 May 2017 07:17:15 GMT
See <https://builds.apache.org/job/Mesos-Buildbot/BUILDTOOL=autotools,COMPILER=clang,CONFIGURATION=--verbose%20--enable-libevent%20--enable-ssl,ENVIRONMENT=GLOG_v=1%20MESOS_VERBOSE=1,OS=ubuntu%3A14.04,label_exp=(docker%7C%7CHadoop)&&(!ubuntu-us1)&&(!ubuntu-eu2)/3682/display/redirect?page=changes>

Changes:

[yujie.jay] Supported GCE container registry.

[yujie.jay] Added MESOS-7431 to 1.3.0 CHANGELOG.

------------------------------------------
[...truncated 28.35 MB...]
I0516 07:17:11.267591 19565 process.cpp:3731] Handling HTTP event for process 'slave(751)'
with path: '/slave(751)/containers'
I0516 07:17:11.269057 19569 http.cpp:1115] HTTP GET for /slave(751)/containers from 172.17.0.3:46622
I0516 07:17:11.269129 19569 http.cpp:936] Authorizing principal 'test-principal' to GET the
'/containers' endpoint
I0516 07:17:11.271966 19550 slave.cpp:790] Agent terminating
[       OK ] Endpoint/SlaveEndpointTest.AuthorizedRequest/2 (25 ms)
[ RUN      ] Endpoint/SlaveEndpointTest.UnauthorizedRequest/0
I0516 07:17:11.281466 32146 containerizer.cpp:221] Using isolation: posix/cpu,posix/mem,filesystem/posix,network/cni
W0516 07:17:11.281954 32146 backend.cpp:76] Failed to create 'aufs' backend: AufsBackend requires
root privileges
W0516 07:17:11.282063 32146 backend.cpp:76] Failed to create 'bind' backend: BindBackend requires
root privileges
I0516 07:17:11.282109 32146 provisioner.cpp:249] Using default backend 'copy'
I0516 07:17:11.284875 19550 slave.cpp:225] Mesos agent started on (752)@172.17.0.3:37191
I0516 07:17:11.284916 19550 slave.cpp:226] Flags at startup: --acls="" --appc_simple_discovery_uri_prefix="http://"
--appc_store_dir="/tmp/mesos/store/appc" --authenticate_http_executors="true" --authenticate_http_readonly="true"
--authenticate_http_readwrite="true" --authenticatee="crammd5" --authentication_backoff_factor="1secs"
--authorizer="local" --cgroups_cpu_enable_pids_and_tids_count="false" --cgroups_enable_cfs="false"
--cgroups_hierarchy="/sys/fs/cgroup" --cgroups_limit_swap="false" --cgroups_root="mesos" --container_disk_watch_interval="15secs"
--containerizers="mesos" --credential="/tmp/Endpoint_SlaveEndpointTest_UnauthorizedRequest_0_25s6Hf/credential"
--default_role="*" --disk_watch_interval="1mins" --docker="docker" --docker_kill_orphans="true"
--docker_registry="https://registry-1.docker.io" --docker_remove_delay="6hrs" --docker_socket="/var/run/docker.sock"
--docker_stop_timeout="0ns" --docker_store_dir="/tmp/mesos/store/docker" --docker_volume_checkpoint_dir="/var/run/mesos/isolators/docker/volume"
--enforce_container_disk_quota="false" --executor_registration_timeout="1mins" --executor_secret_key="/tmp/Endpoint_SlaveEndpointTest_UnauthorizedRequest_0_25s6Hf/executor_secret_key"
--executor_shutdown_grace_period="5secs" --fetcher_cache_dir="/tmp/Endpoint_SlaveEndpointTest_UnauthorizedRequest_0_25s6Hf/fetch"
--fetcher_cache_size="2GB" --frameworks_home="" --gc_delay="1weeks" --gc_disk_headroom="0.1"
--hadoop_home="" --help="false" --hostname_lookup="true" --http_command_executor="false" --http_credentials="/tmp/Endpoint_SlaveEndpointTest_UnauthorizedRequest_0_25s6Hf/http_credentials"
--http_heartbeat_interval="30secs" --initialize_driver_logging="true" --isolation="posix/cpu,posix/mem"
--launcher="posix" --launcher_dir="/mesos/mesos-1.3.0/_build/src" --logbufsecs="0" --logging_level="INFO"
--max_completed_executors_per_framework="150" --oversubscribed_resources_interval="15secs"
--perf_duration="10secs" --perf_interval="1mins" --port="5051" --qos_correction_interval_min="0ns"
--quiet="false" --recover="reconnect" --recovery_timeout="15mins" --registration_backoff_factor="10ms"
--resources="cpus:2;gpus:0;mem:1024;disk:1024;ports:[31000-32000]" --revocable_cpu_low_priority="true"
--runtime_dir="/tmp/Endpoint_SlaveEndpointTest_UnauthorizedRequest_0_25s6Hf" --sandbox_directory="/mnt/mesos/sandbox"
--strict="true" --switch_user="true" --systemd_enable_support="true" --systemd_runtime_directory="/run/systemd/system"
--version="false" --work_dir="/tmp/Endpoint_SlaveEndpointTest_UnauthorizedRequest_0_kv44GR"
I0516 07:17:11.285344 19550 credentials.hpp:86] Loading credential for authentication from
'/tmp/Endpoint_SlaveEndpointTest_UnauthorizedRequest_0_25s6Hf/credential'
I0516 07:17:11.285491 19550 slave.cpp:258] Agent using credential for: test-principal
I0516 07:17:11.285512 19550 credentials.hpp:37] Loading credentials for authentication from
'/tmp/Endpoint_SlaveEndpointTest_UnauthorizedRequest_0_25s6Hf/http_credentials'
I0516 07:17:11.285784 19550 http.cpp:975] Creating default 'basic' HTTP authenticator for
realm 'mesos-agent-executor'
I0516 07:17:11.285895 19550 http.cpp:996] Creating default 'jwt' HTTP authenticator for realm
'mesos-agent-executor'
I0516 07:17:11.286084 19550 http.cpp:975] Creating default 'basic' HTTP authenticator for
realm 'mesos-agent-readonly'
I0516 07:17:11.286177 19550 http.cpp:996] Creating default 'jwt' HTTP authenticator for realm
'mesos-agent-readonly'
I0516 07:17:11.286453 19550 http.cpp:975] Creating default 'basic' HTTP authenticator for
realm 'mesos-agent-readwrite'
I0516 07:17:11.286689 19550 http.cpp:996] Creating default 'jwt' HTTP authenticator for realm
'mesos-agent-readwrite'
I0516 07:17:11.288111 19550 slave.cpp:525] Agent resources: cpus(*):2; mem(*):1024; disk(*):1024;
ports(*):[31000-32000]
I0516 07:17:11.288195 19550 slave.cpp:533] Agent attributes: [  ]
I0516 07:17:11.288208 19550 slave.cpp:538] Agent hostname: 8c2a5920be4f
I0516 07:17:11.288344 19564 status_update_manager.cpp:177] Pausing sending status updates
I0516 07:17:11.289897 19561 state.cpp:62] Recovering state from '/tmp/Endpoint_SlaveEndpointTest_UnauthorizedRequest_0_kv44GR/meta'
I0516 07:17:11.290200 19556 status_update_manager.cpp:203] Recovering status update manager
I0516 07:17:11.290428 19549 containerizer.cpp:608] Recovering containerizer
I0516 07:17:11.291738 19560 provisioner.cpp:410] Provisioner recovery complete
I0516 07:17:11.292098 19553 slave.cpp:5970] Finished recovery
I0516 07:17:11.292671 19553 slave.cpp:6152] Querying resource estimator for oversubscribable
resources
I0516 07:17:11.293023 19559 slave.cpp:6166] Received oversubscribable resources {} from the
resource estimator
I0516 07:17:11.295181 19556 process.cpp:3731] Handling HTTP event for process 'slave(752)'
with path: '/slave(752)/monitor/statistics'
I0516 07:17:11.296864 19566 http.cpp:1115] HTTP GET for /slave(752)/monitor/statistics from
172.17.0.3:46624
I0516 07:17:11.296949 19566 http.cpp:936] Authorizing principal 'test-principal' to GET the
'/monitor/statistics' endpoint
I0516 07:17:11.298910 19561 slave.cpp:790] Agent terminating
[       OK ] Endpoint/SlaveEndpointTest.UnauthorizedRequest/0 (27 ms)
[ RUN      ] Endpoint/SlaveEndpointTest.UnauthorizedRequest/1
I0516 07:17:11.308944 32146 containerizer.cpp:221] Using isolation: posix/cpu,posix/mem,filesystem/posix,network/cni
W0516 07:17:11.309643 32146 backend.cpp:76] Failed to create 'aufs' backend: AufsBackend requires
root privileges
W0516 07:17:11.309790 32146 backend.cpp:76] Failed to create 'bind' backend: BindBackend requires
root privileges
I0516 07:17:11.309869 32146 provisioner.cpp:249] Using default backend 'copy'
I0516 07:17:11.314791 19548 slave.cpp:225] Mesos agent started on (753)@172.17.0.3:37191
I0516 07:17:11.314833 19548 slave.cpp:226] Flags at startup: --acls="" --appc_simple_discovery_uri_prefix="http://"
--appc_store_dir="/tmp/mesos/store/appc" --authenticate_http_executors="true" --authenticate_http_readonly="true"
--authenticate_http_readwrite="true" --authenticatee="crammd5" --authentication_backoff_factor="1secs"
--authorizer="local" --cgroups_cpu_enable_pids_and_tids_count="false" --cgroups_enable_cfs="false"
--cgroups_hierarchy="/sys/fs/cgroup" --cgroups_limit_swap="false" --cgroups_root="mesos" --container_disk_watch_interval="15secs"
--containerizers="mesos" --credential="/tmp/Endpoint_SlaveEndpointTest_UnauthorizedRequest_1_78C6ZN/credential"
--default_role="*" --disk_watch_interval="1mins" --docker="docker" --docker_kill_orphans="true"
--docker_registry="https://registry-1.docker.io" --docker_remove_delay="6hrs" --docker_socket="/var/run/docker.sock"
--docker_stop_timeout="0ns" --docker_store_dir="/tmp/mesos/store/docker" --docker_volume_checkpoint_dir="/var/run/mesos/isolators/docker/volume"
--enforce_container_disk_quota="false" --executor_registration_timeout="1mins" --executor_secret_key="/tmp/Endpoint_SlaveEndpointTest_UnauthorizedRequest_1_78C6ZN/executor_secret_key"
--executor_shutdown_grace_period="5secs" --fetcher_cache_dir="/tmp/Endpoint_SlaveEndpointTest_UnauthorizedRequest_1_78C6ZN/fetch"
--fetcher_cache_size="2GB" --frameworks_home="" --gc_delay="1weeks" --gc_disk_headroom="0.1"
--hadoop_home="" --help="false" --hostname_lookup="true" --http_command_executor="false" --http_credentials="/tmp/Endpoint_SlaveEndpointTest_UnauthorizedRequest_1_78C6ZN/http_credentials"
--http_heartbeat_interval="30secs" --initialize_driver_logging="true" --isolation="posix/cpu,posix/mem"
--launcher="posix" --launcher_dir="/mesos/mesos-1.3.0/_build/src" --logbufsecs="0" --logging_level="INFO"
--max_completed_executors_per_framework="150" --oversubscribed_resources_interval="15secs"
--perf_duration="10secs" --perf_interval="1mins" --port="5051" --qos_correction_interval_min="0ns"
--quiet="false" --recover="reconnect" --recovery_timeout="15mins" --registration_backoff_factor="10ms"
--resources="cpus:2;gpus:0;mem:1024;disk:1024;ports:[31000-32000]" --revocable_cpu_low_priority="true"
--runtime_dir="/tmp/Endpoint_SlaveEndpointTest_UnauthorizedRequest_1_78C6ZN" --sandbox_directory="/mnt/mesos/sandbox"
--strict="true" --switch_user="true" --systemd_enable_support="true" --systemd_runtime_directory="/run/systemd/system"
--version="false" --work_dir="/tmp/Endpoint_SlaveEndpointTest_UnauthorizedRequest_1_9er0Up"
I0516 07:17:11.315348 19548 credentials.hpp:86] Loading credential for authentication from
'/tmp/Endpoint_SlaveEndpointTest_UnauthorizedRequest_1_78C6ZN/credential'
I0516 07:17:11.315546 19548 slave.cpp:258] Agent using credential for: test-principal
I0516 07:17:11.315567 19548 credentials.hpp:37] Loading credentials for authentication from
'/tmp/Endpoint_SlaveEndpointTest_UnauthorizedRequest_1_78C6ZN/http_credentials'
I0516 07:17:11.315836 19548 http.cpp:975] Creating default 'basic' HTTP authenticator for
realm 'mesos-agent-executor'
I0516 07:17:11.315978 19548 http.cpp:996] Creating default 'jwt' HTTP authenticator for realm
'mesos-agent-executor'
I0516 07:17:11.316190 19548 http.cpp:975] Creating default 'basic' HTTP authenticator for
realm 'mesos-agent-readonly'
I0516 07:17:11.316292 19548 http.cpp:996] Creating default 'jwt' HTTP authenticator for realm
'mesos-agent-readonly'
I0516 07:17:11.316471 19548 http.cpp:975] Creating default 'basic' HTTP authenticator for
realm 'mesos-agent-readwrite'
I0516 07:17:11.316560 19548 http.cpp:996] Creating default 'jwt' HTTP authenticator for realm
'mesos-agent-readwrite'
I0516 07:17:11.317867 19548 slave.cpp:525] Agent resources: cpus(*):2; mem(*):1024; disk(*):1024;
ports(*):[31000-32000]
I0516 07:17:11.317945 19548 slave.cpp:533] Agent attributes: [  ]
I0516 07:17:11.317960 19548 slave.cpp:538] Agent hostname: 8c2a5920be4f
I0516 07:17:11.318078 19564 status_update_manager.cpp:177] Pausing sending status updates
I0516 07:17:11.319499 19565 state.cpp:62] Recovering state from '/tmp/Endpoint_SlaveEndpointTest_UnauthorizedRequest_1_9er0Up/meta'
I0516 07:17:11.319797 19566 status_update_manager.cpp:203] Recovering status update manager
I0516 07:17:11.320000 19546 containerizer.cpp:608] Recovering containerizer
I0516 07:17:11.321385 19554 provisioner.cpp:410] Provisioner recovery complete
I0516 07:17:11.321755 19569 slave.cpp:5970] Finished recovery
I0516 07:17:11.322350 19569 slave.cpp:6152] Querying resource estimator for oversubscribable
resources
I0516 07:17:11.322600 19557 slave.cpp:6166] Received oversubscribable resources {} from the
resource estimator
I0516 07:17:11.324935 19556 process.cpp:3731] Handling HTTP event for process 'slave(753)'
with path: '/slave(753)/monitor/statistics.json'
I0516 07:17:11.326619 19547 http.cpp:1115] HTTP GET for /slave(753)/monitor/statistics.json
from 172.17.0.3:46626
I0516 07:17:11.326689 19547 http.cpp:936] Authorizing principal 'test-principal' to GET the
'/monitor/statistics.json' endpoint
I0516 07:17:11.329330 19548 slave.cpp:790] Agent terminating
[       OK ] Endpoint/SlaveEndpointTest.UnauthorizedRequest/1 (30 ms)
[ RUN      ] Endpoint/SlaveEndpointTest.UnauthorizedRequest/2
I0516 07:17:11.339118 32146 containerizer.cpp:221] Using isolation: posix/cpu,posix/mem,filesystem/posix,network/cni
W0516 07:17:11.339673 32146 backend.cpp:76] Failed to create 'aufs' backend: AufsBackend requires
root privileges
W0516 07:17:11.339787 32146 backend.cpp:76] Failed to create 'bind' backend: BindBackend requires
root privileges
I0516 07:17:11.339833 32146 provisioner.cpp:249] Using default backend 'copy'
I0516 07:17:11.343322 19560 slave.cpp:225] Mesos agent started on (754)@172.17.0.3:37191
I0516 07:17:11.343363 19560 slave.cpp:226] Flags at startup: --acls="" --appc_simple_discovery_uri_prefix="http://"
--appc_store_dir="/tmp/mesos/store/appc" --authenticate_http_executors="true" --authenticate_http_readonly="true"
--authenticate_http_readwrite="true" --authenticatee="crammd5" --authentication_backoff_factor="1secs"
--authorizer="local" --cgroups_cpu_enable_pids_and_tids_count="false" --cgroups_enable_cfs="false"
--cgroups_hierarchy="/sys/fs/cgroup" --cgroups_limit_swap="false" --cgroups_root="mesos" --container_disk_watch_interval="15secs"
--containerizers="mesos" --credential="/tmp/Endpoint_SlaveEndpointTest_UnauthorizedRequest_2_hLnVzm/credential"
--default_role="*" --disk_watch_interval="1mins" --docker="docker" --docker_kill_orphans="true"
--docker_registry="https://registry-1.docker.io" --docker_remove_delay="6hrs" --docker_socket="/var/run/docker.sock"
--docker_stop_timeout="0ns" --docker_store_dir="/tmp/mesos/store/docker" --docker_volume_checkpoint_dir="/var/run/mesos/isolators/docker/volume"
--enforce_container_disk_quota="false" --executor_registration_timeout="1mins" --executor_secret_key="/tmp/Endpoint_SlaveEndpointTest_UnauthorizedRequest_2_hLnVzm/executor_secret_key"
--executor_shutdown_grace_period="5secs" --fetcher_cache_dir="/tmp/Endpoint_SlaveEndpointTest_UnauthorizedRequest_2_hLnVzm/fetch"
--fetcher_cache_size="2GB" --frameworks_home="" --gc_delay="1weeks" --gc_disk_headroom="0.1"
--hadoop_home="" --help="false" --hostname_lookup="true" --http_command_executor="false" --http_credentials="/tmp/Endpoint_SlaveEndpointTest_UnauthorizedRequest_2_hLnVzm/http_credentials"
--http_heartbeat_interval="30secs" --initialize_driver_logging="true" --isolation="posix/cpu,posix/mem"
--launcher="posix" --launcher_dir="/mesos/mesos-1.3.0/_build/src" --logbufsecs="0" --logging_level="INFO"
--max_completed_executors_per_framework="150" --oversubscribed_resources_interval="15secs"
--perf_duration="10secs" --perf_interval="1mins" --port="5051" --qos_correction_interval_min="0ns"
--quiet="false" --recover="reconnect" --recovery_timeout="15mins" --registration_backoff_factor="10ms"
--resources="cpus:2;gpus:0;mem:1024;disk:1024;ports:[31000-32000]" --revocable_cpu_low_priority="true"
--runtime_dir="/tmp/Endpoint_SlaveEndpointTest_UnauthorizedRequest_2_hLnVzm" --sandbox_directory="/mnt/mesos/sandbox"
--strict="true" --switch_user="true" --systemd_enable_support="true" --systemd_runtime_directory="/run/systemd/system"
--version="false" --work_dir="/tmp/Endpoint_SlaveEndpointTest_UnauthorizedRequest_2_vKlmqY"
I0516 07:17:11.343755 19560 credentials.hpp:86] Loading credential for authentication from
'/tmp/Endpoint_SlaveEndpointTest_UnauthorizedRequest_2_hLnVzm/credential'
I0516 07:17:11.343925 19560 slave.cpp:258] Agent using credential for: test-principal
I0516 07:17:11.343943 19560 credentials.hpp:37] Loading credentials for authentication from
'/tmp/Endpoint_SlaveEndpointTest_UnauthorizedRequest_2_hLnVzm/http_credentials'
I0516 07:17:11.344185 19560 http.cpp:975] Creating default 'basic' HTTP authenticator for
realm 'mesos-agent-executor'
I0516 07:17:11.344285 19560 http.cpp:996] Creating default 'jwt' HTTP authenticator for realm
'mesos-agent-executor'
I0516 07:17:11.344513 19560 http.cpp:975] Creating default 'basic' HTTP authenticator for
realm 'mesos-agent-readonly'
I0516 07:17:11.344597 19560 http.cpp:996] Creating default 'jwt' HTTP authenticator for realm
'mesos-agent-readonly'
I0516 07:17:11.344915 19560 http.cpp:975] Creating default 'basic' HTTP authenticator for
realm 'mesos-agent-readwrite'
I0516 07:17:11.345022 19560 http.cpp:996] Creating default 'jwt' HTTP authenticator for realm
'mesos-agent-readwrite'
I0516 07:17:11.346422 19560 slave.cpp:525] Agent resources: cpus(*):2; mem(*):1024; disk(*):1024;
ports(*):[31000-32000]
I0516 07:17:11.346503 19560 slave.cpp:533] Agent attributes: [  ]
I0516 07:17:11.346515 19560 slave.cpp:538] Agent hostname: 8c2a5920be4f
I0516 07:17:11.346643 19546 status_update_manager.cpp:177] Pausing sending status updates
I0516 07:17:11.347831 19551 state.cpp:62] Recovering state from '/tmp/Endpoint_SlaveEndpointTest_UnauthorizedRequest_2_vKlmqY/meta'
I0516 07:17:11.348095 19562 status_update_manager.cpp:203] Recovering status update manager
I0516 07:17:11.348392 19547 containerizer.cpp:608] Recovering containerizer
I0516 07:17:11.349629 19556 provisioner.cpp:410] Provisioner recovery complete
I0516 07:17:11.350073 19566 slave.cpp:5970] Finished recovery
I0516 07:17:11.350481 19566 slave.cpp:6152] Querying resource estimator for oversubscribable
resources
I0516 07:17:11.350745 19553 slave.cpp:6166] Received oversubscribable resources {} from the
resource estimator
I0516 07:17:11.352571 19550 process.cpp:3731] Handling HTTP event for process 'slave(754)'
with path: '/slave(754)/containers'
I0516 07:17:11.354159 19568 http.cpp:1115] HTTP GET for /slave(754)/containers from 172.17.0.3:46628
I0516 07:17:11.354233 19568 http.cpp:936] Authorizing principal 'test-principal' to GET the
'/containers' endpoint
I0516 07:17:11.356647 19567 slave.cpp:790] Agent terminating
[       OK ] Endpoint/SlaveEndpointTest.UnauthorizedRequest/2 (27 ms)
[ RUN      ] Endpoint/SlaveEndpointTest.NoAuthorizer/0
I0516 07:17:11.366031 32146 containerizer.cpp:221] Using isolation: posix/cpu,posix/mem,filesystem/posix,network/cni
W0516 07:17:11.366467 32146 backend.cpp:76] Failed to create 'aufs' backend: AufsBackend requires
root privileges
W0516 07:17:11.366559 32146 backend.cpp:76] Failed to create 'bind' backend: BindBackend requires
root privileges
I0516 07:17:11.366588 32146 provisioner.cpp:249] Using default backend 'copy'
I0516 07:17:11.367998 32146 cluster.cpp:448] Creating default 'local' authorizer
I0516 07:17:11.369503 19548 slave.cpp:225] Mesos agent started on (755)@172.17.0.3:37191
I0516 07:17:11.369539 19548 slave.cpp:226] Flags at startup: --acls="" --appc_simple_discovery_uri_prefix="http://"
--appc_store_dir="/tmp/mesos/store/appc" --authenticate_http_executors="true" --authenticate_http_readonly="true"
--authenticate_http_readwrite="true" --authenticatee="crammd5" --authentication_backoff_factor="1secs"
--authorizer="local" --cgroups_cpu_enable_pids_and_tids_count="false" --cgroups_enable_cfs="false"
--cgroups_hierarchy="/sys/fs/cgroup" --cgroups_limit_swap="false" --cgroups_root="mesos" --container_disk_watch_interval="15secs"
--containerizers="mesos" --credential="/tmp/Endpoint_SlaveEndpointTest_NoAuthorizer_0_Jfc0pV/credential"
--default_role="*" --disk_watch_interval="1mins" --docker="docker" --docker_kill_orphans="true"
--docker_registry="https://registry-1.docker.io" --docker_remove_delay="6hrs" --docker_socket="/var/run/docker.sock"
--docker_stop_timeout="0ns" --docker_store_dir="/tmp/mesos/store/docker" --docker_volume_checkpoint_dir="/var/run/mesos/isolators/docker/volume"
--enforce_container_disk_quota="false" --executor_registration_timeout="1mins" --executor_secret_key="/tmp/Endpoint_SlaveEndpointTest_NoAuthorizer_0_Jfc0pV/executor_secret_key"
--executor_shutdown_grace_period="5secs" --fetcher_cache_dir="/tmp/Endpoint_SlaveEndpointTest_NoAuthorizer_0_Jfc0pV/fetch"
--fetcher_cache_size="2GB" --frameworks_home="" --gc_delay="1weeks" --gc_disk_headroom="0.1"
--hadoop_home="" --help="false" --hostname_lookup="true" --http_command_executor="false" --http_credentials="/tmp/Endpoint_SlaveEndpointTest_NoAuthorizer_0_Jfc0pV/http_credentials"
--http_heartbeat_interval="30secs" --initialize_driver_logging="true" --isolation="posix/cpu,posix/mem"
--launcher="posix" --launcher_dir="/mesos/mesos-1.3.0/_build/src" --logbufsecs="0" --logging_level="INFO"
--max_completed_executors_per_framework="150" --oversubscribed_resources_interval="15secs"
--perf_duration="10secs" --perf_interval="1mins" --port="5051" --qos_correction_interval_min="0ns"
--quiet="false" --recover="reconnect" --recovery_timeout="15mins" --registration_backoff_factor="10ms"
--resources="cpus:2;gpus:0;mem:1024;disk:1024;ports:[31000-32000]" --revocable_cpu_low_priority="true"
--runtime_dir="/tmp/Endpoint_SlaveEndpointTest_NoAuthorizer_0_Jfc0pV" --sandbox_directory="/mnt/mesos/sandbox"
--strict="true" --switch_user="true" --systemd_enable_support="true" --systemd_runtime_directory="/run/systemd/system"
--version="false" --work_dir="/tmp/Endpoint_SlaveEndpointTest_NoAuthorizer_0_Dxfqcx"
I0516 07:17:11.369875 19548 credentials.hpp:86] Loading credential for authentication from
'/tmp/Endpoint_SlaveEndpointTest_NoAuthorizer_0_Jfc0pV/credential'
I0516 07:17:11.370029 19548 slave.cpp:258] Agent using credential for: test-principal
I0516 07:17:11.370051 19548 credentials.hpp:37] Loading credentials for authentication from
'/tmp/Endpoint_SlaveEndpointTest_NoAuthorizer_0_Jfc0pV/http_credentials'
I0516 07:17:11.370318 19548 http.cpp:975] Creating default 'basic' HTTP authenticator for
realm 'mesos-agent-executor'
I0516 07:17:11.370417 19548 http.cpp:996] Creating default 'jwt' HTTP authenticator for realm
'mesos-agent-executor'
I0516 07:17:11.370695 19548 http.cpp:975] Creating default 'basic' HTTP authenticator for
realm 'mesos-agent-readonly'
I0516 07:17:11.370822 19548 http.cpp:996] Creating default 'jwt' HTTP authenticator for realm
'mesos-agent-readonly'
I0516 07:17:11.371227 19548 http.cpp:975] Creating default 'basic' HTTP authenticator for
realm 'mesos-agent-readwrite'
I0516 07:17:11.371366 19548 http.cpp:996] Creating default 'jwt' HTTP authenticator for realm
'mesos-agent-readwrite'
I0516 07:17:11.372668 19548 slave.cpp:525] Agent resources: cpus(*):2; mem(*):1024; disk(*):1024;
ports(*):[31000-32000]
I0516 07:17:11.372747 19548 slave.cpp:533] Agent attributes: [  ]
I0516 07:17:11.372761 19548 slave.cpp:538] Agent hostname: 8c2a5920be4f
I0516 07:17:11.372895 19560 status_update_manager.cpp:177] Pausing sending status updates
I0516 07:17:11.374508 19557 state.cpp:62] Recovering state from '/tmp/Endpoint_SlaveEndpointTest_NoAuthorizer_0_Dxfqcx/meta'
I0516 07:17:11.374718 19567 status_update_manager.cpp:203] Recovering status update manager
I0516 07:17:11.375102 19554 containerizer.cpp:608] Recovering containerizer
I0516 07:17:11.376440 19552 provisioner.cpp:410] Provisioner recovery complete
I0516 07:17:11.376777 19567 slave.cpp:5970] Finished recovery
I0516 07:17:11.377239 19567 slave.cpp:6152] Querying resource estimator for oversubscribable
resources
I0516 07:17:11.377548 19549 slave.cpp:6166] Received oversubscribable resources {} from the
resource estimator
I0516 07:17:11.379197 19560 process.cpp:3731] Handling HTTP event for process 'slave(755)'
with path: '/slave(755)/monitor/statistics'
I0516 07:17:11.380656 19547 http.cpp:1115] HTTP GET for /slave(755)/monitor/statistics from
172.17.0.3:46630
I0516 07:17:11.380714 19547 http.cpp:936] Authorizing principal 'test-principal' to GET the
'/monitor/statistics' endpoint
I0516 07:17:11.383803 19561 slave.cpp:790] Agent terminating
[       OK ] Endpoint/SlaveEndpointTest.NoAuthorizer/0 (27 ms)
[ RUN      ] Endpoint/SlaveEndpointTest.NoAuthorizer/1
I0516 07:17:11.393338 32146 containerizer.cpp:221] Using isolation: posix/cpu,posix/mem,filesystem/posix,network/cni
W0516 07:17:11.393790 32146 backend.cpp:76] Failed to create 'aufs' backend: AufsBackend requires
root privileges
W0516 07:17:11.393894 32146 backend.cpp:76] Failed to create 'bind' backend: BindBackend requires
root privileges
I0516 07:17:11.393930 32146 provisioner.cpp:249] Using default backend 'copy'
I0516 07:17:11.395285 32146 cluster.cpp:448] Creating default 'local' authorizer
I0516 07:17:11.396652 19568 slave.cpp:225] Mesos agent started on (756)@172.17.0.3:37191
I0516 07:17:11.396687 19568 slave.cpp:226] Flags at startup: --acls="" --appc_simple_discovery_uri_prefix="http://"
--appc_store_dir="/tmp/mesos/store/appc" --authenticate_http_executors="true" --authenticate_http_readonly="true"
--authenticate_http_readwrite="true" --authenticatee="crammd5" --authentication_backoff_factor="1secs"
--authorizer="local" --cgroups_cpu_enable_pids_and_tids_count="false" --cgroups_enable_cfs="false"
--cgroups_hierarchy="/sys/fs/cgroup" --cgroups_limit_swap="false" --cgroups_root="mesos" --container_disk_watch_interval="15secs"
--containerizers="mesos" --credential="/tmp/Endpoint_SlaveEndpointTest_NoAuthorizer_1_LKOgwu/credential"
--default_role="*" --disk_watch_interval="1mins" --docker="docker" --docker_kill_orphans="true"
--docker_registry="https://registry-1.docker.io" --docker_remove_delay="6hrs" --docker_socket="/var/run/docker.sock"
--docker_stop_timeout="0ns" --docker_store_dir="/tmp/mesos/store/docker" --docker_volume_checkpoint_dir="/var/run/mesos/isolators/docker/volume"
--enforce_container_disk_quota="false" --executor_registration_timeout="1mins" --executor_secret_key="/tmp/Endpoint_SlaveEndpointTest_NoAuthorizer_1_LKOgwu/executor_secret_key"
--executor_shutdown_grace_period="5secs" --fetcher_cache_dir="/tmp/Endpoint_SlaveEndpointTest_NoAuthorizer_1_LKOgwu/fetch"
--fetcher_cache_size="2GB" --frameworks_home="" --gc_delay="1weeks" --gc_disk_headroom="0.1"
--hadoop_home="" --help="false" --hostname_lookup="true" --http_command_executor="false" --http_credentials="/tmp/Endpoint_SlaveEndpointTest_NoAuthorizer_1_LKOgwu/http_credentials"
--http_heartbeat_interval="30secs" --initialize_driver_logging="true" --isolation="posix/cpu,posix/mem"
--launcher="posix" --launcher_dir="/mesos/mesos-1.3.0/_build/src" --logbufsecs="0" --logging_level="INFO"
--max_completed_executors_per_framework="150" --oversubscribed_resources_interval="15secs"
--perf_duration="10secs" --perf_interval="1mins" --port="5051" --qos_correction_interval_min="0ns"
--quiet="false" --recover="reconnect" --recovery_timeout="15mins" --registration_backoff_factor="10ms"
--resources="cpus:2;gpus:0;mem:1024;disk:1024;ports:[31000-32000]" --revocable_cpu_low_priority="true"
--runtime_dir="/tmp/Endpoint_SlaveEndpointTest_NoAuthorizer_1_LKOgwu" --sandbox_directory="/mnt/mesos/sandbox"
--strict="true" --switch_user="true" --systemd_enable_support="true" --systemd_runtime_directory="/run/systemd/system"
--version="false" --work_dir="/tmp/Endpoint_SlaveEndpointTest_NoAuthorizer_1_TxyCe6"
I0516 07:17:11.397063 19568 credentials.hpp:86] Loading credential for authentication from
'/tmp/Endpoint_SlaveEndpointTest_NoAuthorizer_1_LKOgwu/credential'
I0516 07:17:11.397214 19568 slave.cpp:258] Agent using credential for: test-principal
I0516 07:17:11.397236 19568 credentials.hpp:37] Loading credentials for authentication from
'/tmp/Endpoint_SlaveEndpointTest_NoAuthorizer_1_LKOgwu/http_credentials'
I0516 07:17:11.397492 19568 http.cpp:975] Creating default 'basic' HTTP authenticator for
realm 'mesos-agent-executor'
I0516 07:17:11.397593 19568 http.cpp:996] Creating default 'jwt' HTTP authenticator for realm
'mesos-agent-executor'
I0516 07:17:11.397774 19568 http.cpp:975] Creating default 'basic' HTTP authenticator for
realm 'mesos-agent-readonly'
I0516 07:17:11.397948 19568 http.cpp:996] Creating default 'jwt' HTTP authenticator for realm
'mesos-agent-readonly'
I0516 07:17:11.398121 19568 http.cpp:975] Creating default 'basic' HTTP authenticator for
realm 'mesos-agent-readwrite'
I0516 07:17:11.398216 19568 http.cpp:996] Creating default 'jwt' HTTP authenticator for realm
'mesos-agent-readwrite'
I0516 07:17:11.399564 19568 slave.cpp:525] Agent resources: cpus(*):2; mem(*):1024; disk(*):1024;
ports(*):[31000-32000]
I0516 07:17:11.399642 19568 slave.cpp:533] Agent attributes: [  ]
I0516 07:17:11.399655 19568 slave.cpp:538] Agent hostname: 8c2a5920be4f
I0516 07:17:11.399775 19551 status_update_manager.cpp:177] Pausing sending status updates
I0516 07:17:11.401134 19565 state.cpp:62] Recovering state from '/tmp/Endpoint_SlaveEndpointTest_NoAuthorizer_1_TxyCe6/meta'
I0516 07:17:11.401494 19569 status_update_manager.cpp:203] Recovering status update manager
I0516 07:17:11.401671 19563 containerizer.cpp:608] Recovering containerizer
I0516 07:17:11.402992 19547 provisioner.cpp:410] Provisioner recovery complete
I0516 07:17:11.403369 19550 slave.cpp:5970] Finished recovery
I0516 07:17:11.403748 19550 slave.cpp:6152] Querying resource estimator for oversubscribable
resources
I0516 07:17:11.403949 19558 slave.cpp:6166] Received oversubscribable resources {} from the
resource estimator
I0516 07:17:11.405539 19554 process.cpp:3731] Handling HTTP event for process 'slave(756)'
with path: '/slave(756)/monitor/statistics.json'
I0516 07:17:11.406996 19546 http.cpp:1115] HTTP GET for /slave(756)/monitor/statistics.json
from 172.17.0.3:46632
I0516 07:17:11.407055 19546 http.cpp:936] Authorizing principal 'test-principal' to GET the
'/monitor/statistics.json' endpoint
I0516 07:17:11.410032 19549 slave.cpp:790] Agent terminating
[       OK ] Endpoint/SlaveEndpointTest.NoAuthorizer/1 (26 ms)
[ RUN      ] Endpoint/SlaveEndpointTest.NoAuthorizer/2
I0516 07:17:11.419875 32146 containerizer.cpp:221] Using isolation: posix/cpu,posix/mem,filesystem/posix,network/cni
W0516 07:17:11.420316 32146 backend.cpp:76] Failed to create 'aufs' backend: AufsBackend requires
root privileges
W0516 07:17:11.420409 32146 backend.cpp:76] Failed to create 'bind' backend: BindBackend requires
root privileges
I0516 07:17:11.420440 32146 provisioner.cpp:249] Using default backend 'copy'
I0516 07:17:11.421870 32146 cluster.cpp:448] Creating default 'local' authorizer
I0516 07:17:11.423338 19559 slave.cpp:225] Mesos agent started on (757)@172.17.0.3:37191
I0516 07:17:11.423370 19559 slave.cpp:226] Flags at startup: --acls="" --appc_simple_discovery_uri_prefix="http://"
--appc_store_dir="/tmp/mesos/store/appc" --authenticate_http_executors="true" --authenticate_http_readonly="true"
--authenticate_http_readwrite="true" --authenticatee="crammd5" --authentication_backoff_factor="1secs"
--authorizer="local" --cgroups_cpu_enable_pids_and_tids_count="false" --cgroups_enable_cfs="false"
--cgroups_hierarchy="/sys/fs/cgroup" --cgroups_limit_swap="false" --cgroups_root="mesos" --container_disk_watch_interval="15secs"
--containerizers="mesos" --credential="/tmp/Endpoint_SlaveEndpointTest_NoAuthorizer_2_flmiS3/credential"
--default_role="*" --disk_watch_interval="1mins" --docker="docker" --docker_kill_orphans="true"
--docker_registry="https://registry-1.docker.io" --docker_remove_delay="6hrs" --docker_socket="/var/run/docker.sock"
--docker_stop_timeout="0ns" --docker_store_dir="/tmp/mesos/store/docker" --docker_volume_checkpoint_dir="/var/run/mesos/isolators/docker/volume"
--enforce_container_disk_quota="false" --executor_registration_timeout="1mins" --executor_secret_key="/tmp/Endpoint_SlaveEndpointTest_NoAuthorizer_2_flmiS3/executor_secret_key"
--executor_shutdown_grace_period="5secs" --fetcher_cache_dir="/tmp/Endpoint_SlaveEndpointTest_NoAuthorizer_2_flmiS3/fetch"
--fetcher_cache_size="2GB" --frameworks_home="" --gc_delay="1weeks" --gc_disk_headroom="0.1"
--hadoop_home="" --help="false" --hostname_lookup="true" --http_command_executor="false" --http_credentials="/tmp/Endpoint_SlaveEndpointTest_NoAuthorizer_2_flmiS3/http_credentials"
--http_heartbeat_interval="30secs" --initialize_driver_logging="true" --isolation="posix/cpu,posix/mem"
--launcher="posix" --launcher_dir="/mesos/mesos-1.3.0/_build/src" --logbufsecs="0" --logging_level="INFO"
--max_completed_executors_per_framework="150" --oversubscribed_resources_interval="15secs"
--perf_duration="10secs" --perf_interval="1mins" --port="5051" --qos_correction_interval_min="0ns"
--quiet="false" --recover="reconnect" --recovery_timeout="15mins" --registration_backoff_factor="10ms"
--resources="cpus:2;gpus:0;mem:1024;disk:1024;ports:[31000-32000]" --revocable_cpu_low_priority="true"
--runtime_dir="/tmp/Endpoint_SlaveEndpointTest_NoAuthorizer_2_flmiS3" --sandbox_directory="/mnt/mesos/sandbox"
--strict="true" --switch_user="true" --systemd_enable_support="true" --systemd_runtime_directory="/run/systemd/system"
--version="false" --work_dir="/tmp/Endpoint_SlaveEndpointTest_NoAuthorizer_2_d7gIwF"
I0516 07:17:11.423709 19559 credentials.hpp:86] Loading credential for authentication from
'/tmp/Endpoint_SlaveEndpointTest_NoAuthorizer_2_flmiS3/credential'
I0516 07:17:11.423883 19559 slave.cpp:258] Agent using credential for: test-principal
I0516 07:17:11.423910 19559 credentials.hpp:37] Loading credentials for authentication from
'/tmp/Endpoint_SlaveEndpointTest_NoAuthorizer_2_flmiS3/http_credentials'
I0516 07:17:11.424176 19559 http.cpp:975] Creating default 'basic' HTTP authenticator for
realm 'mesos-agent-executor'
I0516 07:17:11.424278 19559 http.cpp:996] Creating default 'jwt' HTTP authenticator for realm
'mesos-agent-executor'
I0516 07:17:11.424506 19559 http.cpp:975] Creating default 'basic' HTTP authenticator for
realm 'mesos-agent-readonly'
I0516 07:17:11.424623 19559 http.cpp:996] Creating default 'jwt' HTTP authenticator for realm
'mesos-agent-readonly'
I0516 07:17:11.424808 19559 http.cpp:975] Creating default 'basic' HTTP authenticator for
realm 'mesos-agent-readwrite'
I0516 07:17:11.424914 19559 http.cpp:996] Creating default 'jwt' HTTP authenticator for realm
'mesos-agent-readwrite'
I0516 07:17:11.426365 19559 slave.cpp:525] Agent resources: cpus(*):2; mem(*):1024; disk(*):1024;
ports(*):[31000-32000]
I0516 07:17:11.426450 19559 slave.cpp:533] Agent attributes: [  ]
I0516 07:17:11.426462 19559 slave.cpp:538] Agent hostname: 8c2a5920be4f
I0516 07:17:11.426584 19556 status_update_manager.cpp:177] Pausing sending status updates
I0516 07:17:11.427747 19551 state.cpp:62] Recovering state from '/tmp/Endpoint_SlaveEndpointTest_NoAuthorizer_2_d7gIwF/meta'
I0516 07:17:11.427981 19567 status_update_manager.cpp:203] Recovering status update manager
I0516 07:17:11.428253 19565 containerizer.cpp:608] Recovering containerizer
I0516 07:17:11.429554 19565 provisioner.cpp:410] Provisioner recovery complete
I0516 07:17:11.429929 19559 slave.cpp:5970] Finished recovery
I0516 07:17:11.430384 19559 slave.cpp:6152] Querying resource estimator for oversubscribable
resources
I0516 07:17:11.430613 19548 slave.cpp:6166] Received oversubscribable resources {} from the
resource estimator
I0516 07:17:11.432250 19564 process.cpp:3731] Handling HTTP event for process 'slave(757)'
with path: '/slave(757)/containers'
I0516 07:17:11.433786 19557 http.cpp:1115] HTTP GET for /slave(757)/containers from 172.17.0.3:46634
I0516 07:17:11.433850 19557 http.cpp:936] Authorizing principal 'test-principal' to GET the
'/containers' endpoint
I0516 07:17:11.436846 19558 slave.cpp:790] Agent terminating
[       OK ] Endpoint/SlaveEndpointTest.NoAuthorizer/2 (26 ms)
[----------] 9 tests from Endpoint/SlaveEndpointTest (246 ms total)

[----------] Global test environment tear-down
[==========] 1579 tests from 177 test cases ran. (481973 ms total)
[  PASSED  ] 1578 tests.
[  FAILED  ] 1 test, listed below:
[  FAILED  ] RegisterSlaveValidationTest.DropInvalidReregistration

 1 FAILED TEST
  YOU HAVE 19 DISABLED TESTS

E0516 07:17:11.508271 19570 process.cpp:951] Failed to accept socket: future discarded
make[4]: *** [check-local] Error 1
make[4]: Leaving directory `/mesos/mesos-1.3.0/_build/src'
make[3]: *** [check-am] Error 2
make[3]: Leaving directory `/mesos/mesos-1.3.0/_build/src'
make[2]: *** [check] Error 2
make[2]: Leaving directory `/mesos/mesos-1.3.0/_build/src'
make[1]: *** [check-recursive] Error 1
make[1]: Leaving directory `/mesos/mesos-1.3.0/_build'
make: *** [distcheck] Error 1
+ docker rmi mesos-1494916454-32557
Untagged: mesos-1494916454-32557:latest
Deleted: sha256:2314f0dff70c41b9d155f87079e05b7d8a945030d99259bc6d6b56a4ca47e090
Deleted: sha256:3370740a9eb70569f73540f60e5528f99714fa90e051db25d48678914f0eea72
Deleted: sha256:c78245a259903713e5c0cd2bc0b6a89ab7433895036ba02160325e2b9bfaf6c2
Deleted: sha256:0463217e04e2d658b4328cf0f0f2c23d4ca4ea587e144591866683a7e511701b
Deleted: sha256:41260e11b0f1aead60beccbd6dc84ad2c045de4220ab4d3d96a4b95338aaa727
Deleted: sha256:dc3e3f66bf792e5c675990479e9a9a4ea4a660168a149bce3028883f9b7e039b
Deleted: sha256:5bf9d6397d12c22f5a119b994d9d65673da3e9e055c6a0b0738ea80ae141c929
Deleted: sha256:68cc67a3d3ffef17f0d8342cdbd1e262491fdc73995a8a3f991bdf3732741c9d
Deleted: sha256:79f200e9e92952e90ad0318e324e16b28d9be003d6c175bf48dae46dbb51f4f9
Deleted: sha256:18c865bb8af6e3a8fe438b836f616ce9a3694e5db08a8f91cb3391006a31c68b
Deleted: sha256:8d0155d380914585df83338d21ccbf68255186f8efe3e9392b906e0881b4c161
Deleted: sha256:5a16feefb1d2bab292072cb1b443384f9999897a5130737d44a04ff985ec1c8a
Deleted: sha256:e58d7e22a7d22b06cc5daa2e7b898bf2ae10c8d6fa70e301c705514bec43e139
Deleted: sha256:c8d6f125c0acb7f119cb9b26ab340056194d9c068d1ead3b14a571c8925f41ff
Deleted: sha256:b57ed67f4443b61d6679a34d8416c35f55f281fca898b1623beceb604bfb7d16
Deleted: sha256:e2f1e690e82aff8f54230d14fd26841017be3b88d900762b25af03f16e71905f
Deleted: sha256:6ce87a05d6d83e648f30566f8e899c794e321c7c0ab99c39ba0d0e92fd24c134
Deleted: sha256:89bea7333fcced5b842503ea103b7a837d41534c5b7724274398b070e876fd6b
Deleted: sha256:1b7491669453b65e916bcb39ced4f6ea6f23e2b66dcb10dfaecbb742112c92d9
Deleted: sha256:6ee909f65678b8884c7237f25162102747dc7b9ef37dfef03fc16f4730533e29
Deleted: sha256:e5c263f60e2a5030725fef0f8e59da035a27aada78c408d15c20a0600dcb4875
Deleted: sha256:a43a811f615012dd10ef1e577bf4e07c2134ba807ba51ec44592aaa4df1815b7
Deleted: sha256:88b6c3d6b72dd4dd2762c30d78490a99a84a0315105ec89536e81beebf77bd2b
Deleted: sha256:619456a22fcdd3d224d2c34d0f9a2b2968e6d1924ce9137681c62f8955cae80e
Build step 'Execute shell' marked build as failure
Not sending mail to unregistered user yujie.jay@gmail.com

Mime
View raw message