mesos-builds mailing list archives

Site index · List index
Message view « Date » · « Thread »
Top « Date » · « Thread »
From Apache Jenkins Server <jenk...@builds.apache.org>
Subject Build failed in Jenkins: Mesos-Buildbot » autotools,clang,--verbose --enable-libevent --enable-ssl,GLOG_v=1 MESOS_VERBOSE=1,ubuntu:14.04,(docker||Hadoop)&&(!ubuntu-us1)&&(!ubuntu-eu2) #3731
Date Fri, 26 May 2017 21:38:59 GMT
See <https://builds.apache.org/job/Mesos-Buildbot/BUILDTOOL=autotools,COMPILER=clang,CONFIGURATION=--verbose%20--enable-libevent%20--enable-ssl,ENVIRONMENT=GLOG_v=1%20MESOS_VERBOSE=1,OS=ubuntu%3A14.04,label_exp=(docker%7C%7CHadoop)&&(!ubuntu-us1)&&(!ubuntu-eu2)/3731/display/redirect?page=changes>

Changes:

[anand] Update vendored protobuf tar.gz to 3.3.0.

[anand] Remove unnecessary patch after protobuf upgrade to 3.3.0.

[anand] Update 3rdparty build to support protobuf 3.3.0.

[anand] Update related tests in stout to support protobuf 3.3.0.

[anand] Updated Mesos build library to use protobuf 3.3.0.

[anand] Added a test for evolving large protobuf message.

[anand] Updated LICENSE information for protobuf 3.3.0.

------------------------------------------
[...truncated 28.64 MB...]
I0526 21:38:44.603987 23230 slave.cpp:6269] Received oversubscribable resources {} from the
resource estimator
I0526 21:38:44.606464 23227 process.cpp:3730] Handling HTTP event for process 'slave(753)'
with path: '/slave(753)/containers'
I0526 21:38:44.608240 23235 http.cpp:1115] HTTP GET for /slave(753)/containers from 172.17.0.2:39707
I0526 21:38:44.608345 23235 http.cpp:936] Authorizing principal 'test-principal' to GET the
'/containers' endpoint
I0526 21:38:44.612035 23232 slave.cpp:801] Agent terminating
[       OK ] Endpoint/SlaveEndpointTest.AuthorizedRequest/2 (31 ms)
[ RUN      ] Endpoint/SlaveEndpointTest.UnauthorizedRequest/0
I0526 21:38:44.626579  5172 containerizer.cpp:230] Using isolation: posix/cpu,posix/mem,filesystem/posix,network/cni,environment_secret
W0526 21:38:44.627282  5172 backend.cpp:76] Failed to create 'aufs' backend: AufsBackend requires
root privileges
W0526 21:38:44.627411  5172 backend.cpp:76] Failed to create 'bind' backend: BindBackend requires
root privileges
I0526 21:38:44.627586  5172 provisioner.cpp:255] Using default backend 'copy'
I0526 21:38:44.631264 23224 slave.cpp:232] Mesos agent started on (754)@172.17.0.2:59622
I0526 21:38:44.631317 23224 slave.cpp:233] Flags at startup: --acls="" --appc_simple_discovery_uri_prefix="http://"
--appc_store_dir="/tmp/mesos/store/appc" --authenticate_http_executors="true" --authenticate_http_readonly="true"
--authenticate_http_readwrite="true" --authenticatee="crammd5" --authentication_backoff_factor="1secs"
--authorizer="local" --cgroups_cpu_enable_pids_and_tids_count="false" --cgroups_enable_cfs="false"
--cgroups_hierarchy="/sys/fs/cgroup" --cgroups_limit_swap="false" --cgroups_root="mesos" --container_disk_watch_interval="15secs"
--containerizers="mesos" --credential="/tmp/Endpoint_SlaveEndpointTest_UnauthorizedRequest_0_KVGp3O/credential"
--default_role="*" --disk_watch_interval="1mins" --docker="docker" --docker_kill_orphans="true"
--docker_registry="https://registry-1.docker.io" --docker_remove_delay="6hrs" --docker_socket="/var/run/docker.sock"
--docker_stop_timeout="0ns" --docker_store_dir="/tmp/mesos/store/docker" --docker_volume_checkpoint_dir="/var/run/mesos/isolators/docker/volume"
--enforce_container_disk_quota="false" --executor_registration_timeout="1mins" --executor_reregistration_timeout="2secs"
--executor_secret_key="/tmp/Endpoint_SlaveEndpointTest_UnauthorizedRequest_0_KVGp3O/executor_secret_key"
--executor_shutdown_grace_period="5secs" --fetcher_cache_dir="/tmp/Endpoint_SlaveEndpointTest_UnauthorizedRequest_0_KVGp3O/fetch"
--fetcher_cache_size="2GB" --frameworks_home="" --gc_delay="1weeks" --gc_disk_headroom="0.1"
--hadoop_home="" --help="false" --hostname_lookup="true" --http_command_executor="false" --http_credentials="/tmp/Endpoint_SlaveEndpointTest_UnauthorizedRequest_0_KVGp3O/http_credentials"
--http_heartbeat_interval="30secs" --initialize_driver_logging="true" --isolation="posix/cpu,posix/mem"
--launcher="posix" --launcher_dir="/mesos/mesos-1.4.0/_build/src" --logbufsecs="0" --logging_level="INFO"
--max_completed_executors_per_framework="150" --oversubscribed_resources_interval="15secs"
--perf_duration="10secs" --perf_interval="1mins" --port="5051" --qos_correction_interval_min="0ns"
--quiet="false" --recover="reconnect" --recovery_timeout="15mins" --registration_backoff_factor="10ms"
--resources="cpus:2;gpus:0;mem:1024;disk:1024;ports:[31000-32000]" --revocable_cpu_low_priority="true"
--runtime_dir="/tmp/Endpoint_SlaveEndpointTest_UnauthorizedRequest_0_KVGp3O" --sandbox_directory="/mnt/mesos/sandbox"
--strict="true" --switch_user="true" --systemd_enable_support="true" --systemd_runtime_directory="/run/systemd/system"
--version="false" --work_dir="/tmp/Endpoint_SlaveEndpointTest_UnauthorizedRequest_0_dxFk87"
I0526 21:38:44.631925 23224 credentials.hpp:86] Loading credential for authentication from
'/tmp/Endpoint_SlaveEndpointTest_UnauthorizedRequest_0_KVGp3O/credential'
I0526 21:38:44.632170 23224 slave.cpp:265] Agent using credential for: test-principal
I0526 21:38:44.632199 23224 credentials.hpp:37] Loading credentials for authentication from
'/tmp/Endpoint_SlaveEndpointTest_UnauthorizedRequest_0_KVGp3O/http_credentials'
I0526 21:38:44.632603 23224 http.cpp:975] Creating default 'basic' HTTP authenticator for
realm 'mesos-agent-executor'
I0526 21:38:44.632756 23224 http.cpp:996] Creating default 'jwt' HTTP authenticator for realm
'mesos-agent-executor'
I0526 21:38:44.632977 23224 http.cpp:975] Creating default 'basic' HTTP authenticator for
realm 'mesos-agent-readonly'
I0526 21:38:44.633062 23224 http.cpp:996] Creating default 'jwt' HTTP authenticator for realm
'mesos-agent-readonly'
I0526 21:38:44.633225 23224 http.cpp:975] Creating default 'basic' HTTP authenticator for
realm 'mesos-agent-readwrite'
I0526 21:38:44.633322 23224 http.cpp:996] Creating default 'jwt' HTTP authenticator for realm
'mesos-agent-readwrite'
I0526 21:38:44.634544 23224 slave.cpp:536] Agent resources: cpus(*):2; mem(*):1024; disk(*):1024;
ports(*):[31000-32000]
I0526 21:38:44.634615 23224 slave.cpp:544] Agent attributes: [  ]
I0526 21:38:44.634629 23224 slave.cpp:549] Agent hostname: cc6437e360db
I0526 21:38:44.634804 23223 status_update_manager.cpp:177] Pausing sending status updates
I0526 21:38:44.636140 23225 state.cpp:62] Recovering state from '/tmp/Endpoint_SlaveEndpointTest_UnauthorizedRequest_0_dxFk87/meta'
I0526 21:38:44.636800 23231 status_update_manager.cpp:203] Recovering status update manager
I0526 21:38:44.636992 23228 containerizer.cpp:582] Recovering containerizer
I0526 21:38:44.638579 23226 provisioner.cpp:416] Provisioner recovery complete
I0526 21:38:44.639026 23234 slave.cpp:6073] Finished recovery
I0526 21:38:44.639662 23234 slave.cpp:6255] Querying resource estimator for oversubscribable
resources
I0526 21:38:44.639957 23232 slave.cpp:6269] Received oversubscribable resources {} from the
resource estimator
I0526 21:38:44.642459 23235 process.cpp:3730] Handling HTTP event for process 'slave(754)'
with path: '/slave(754)/monitor/statistics'
I0526 21:38:44.646273 23229 http.cpp:1115] HTTP GET for /slave(754)/monitor/statistics from
172.17.0.2:39708
I0526 21:38:44.646366 23229 http.cpp:936] Authorizing principal 'test-principal' to GET the
'/monitor/statistics' endpoint
I0526 21:38:44.649624 23221 slave.cpp:801] Agent terminating
[       OK ] Endpoint/SlaveEndpointTest.UnauthorizedRequest/0 (36 ms)
[ RUN      ] Endpoint/SlaveEndpointTest.UnauthorizedRequest/1
I0526 21:38:44.661866  5172 containerizer.cpp:230] Using isolation: posix/cpu,posix/mem,filesystem/posix,network/cni,environment_secret
W0526 21:38:44.662482  5172 backend.cpp:76] Failed to create 'aufs' backend: AufsBackend requires
root privileges
W0526 21:38:44.662600  5172 backend.cpp:76] Failed to create 'bind' backend: BindBackend requires
root privileges
I0526 21:38:44.662642  5172 provisioner.cpp:255] Using default backend 'copy'
I0526 21:38:44.666573 23231 slave.cpp:232] Mesos agent started on (755)@172.17.0.2:59622
I0526 21:38:44.666640 23231 slave.cpp:233] Flags at startup: --acls="" --appc_simple_discovery_uri_prefix="http://"
--appc_store_dir="/tmp/mesos/store/appc" --authenticate_http_executors="true" --authenticate_http_readonly="true"
--authenticate_http_readwrite="true" --authenticatee="crammd5" --authentication_backoff_factor="1secs"
--authorizer="local" --cgroups_cpu_enable_pids_and_tids_count="false" --cgroups_enable_cfs="false"
--cgroups_hierarchy="/sys/fs/cgroup" --cgroups_limit_swap="false" --cgroups_root="mesos" --container_disk_watch_interval="15secs"
--containerizers="mesos" --credential="/tmp/Endpoint_SlaveEndpointTest_UnauthorizedRequest_1_cTRx3A/credential"
--default_role="*" --disk_watch_interval="1mins" --docker="docker" --docker_kill_orphans="true"
--docker_registry="https://registry-1.docker.io" --docker_remove_delay="6hrs" --docker_socket="/var/run/docker.sock"
--docker_stop_timeout="0ns" --docker_store_dir="/tmp/mesos/store/docker" --docker_volume_checkpoint_dir="/var/run/mesos/isolators/docker/volume"
--enforce_container_disk_quota="false" --executor_registration_timeout="1mins" --executor_reregistration_timeout="2secs"
--executor_secret_key="/tmp/Endpoint_SlaveEndpointTest_UnauthorizedRequest_1_cTRx3A/executor_secret_key"
--executor_shutdown_grace_period="5secs" --fetcher_cache_dir="/tmp/Endpoint_SlaveEndpointTest_UnauthorizedRequest_1_cTRx3A/fetch"
--fetcher_cache_size="2GB" --frameworks_home="" --gc_delay="1weeks" --gc_disk_headroom="0.1"
--hadoop_home="" --help="false" --hostname_lookup="true" --http_command_executor="false" --http_credentials="/tmp/Endpoint_SlaveEndpointTest_UnauthorizedRequest_1_cTRx3A/http_credentials"
--http_heartbeat_interval="30secs" --initialize_driver_logging="true" --isolation="posix/cpu,posix/mem"
--launcher="posix" --launcher_dir="/mesos/mesos-1.4.0/_build/src" --logbufsecs="0" --logging_level="INFO"
--max_completed_executors_per_framework="150" --oversubscribed_resources_interval="15secs"
--perf_duration="10secs" --perf_interval="1mins" --port="5051" --qos_correction_interval_min="0ns"
--quiet="false" --recover="reconnect" --recovery_timeout="15mins" --registration_backoff_factor="10ms"
--resources="cpus:2;gpus:0;mem:1024;disk:1024;ports:[31000-32000]" --revocable_cpu_low_priority="true"
--runtime_dir="/tmp/Endpoint_SlaveEndpointTest_UnauthorizedRequest_1_cTRx3A" --sandbox_directory="/mnt/mesos/sandbox"
--strict="true" --switch_user="true" --systemd_enable_support="true" --systemd_runtime_directory="/run/systemd/system"
--version="false" --work_dir="/tmp/Endpoint_SlaveEndpointTest_UnauthorizedRequest_1_lJKC2T"
I0526 21:38:44.667208 23231 credentials.hpp:86] Loading credential for authentication from
'/tmp/Endpoint_SlaveEndpointTest_UnauthorizedRequest_1_cTRx3A/credential'
I0526 21:38:44.667441 23231 slave.cpp:265] Agent using credential for: test-principal
I0526 21:38:44.667470 23231 credentials.hpp:37] Loading credentials for authentication from
'/tmp/Endpoint_SlaveEndpointTest_UnauthorizedRequest_1_cTRx3A/http_credentials'
I0526 21:38:44.667816 23231 http.cpp:975] Creating default 'basic' HTTP authenticator for
realm 'mesos-agent-executor'
I0526 21:38:44.667971 23231 http.cpp:996] Creating default 'jwt' HTTP authenticator for realm
'mesos-agent-executor'
I0526 21:38:44.668197 23231 http.cpp:975] Creating default 'basic' HTTP authenticator for
realm 'mesos-agent-readonly'
I0526 21:38:44.668303 23231 http.cpp:996] Creating default 'jwt' HTTP authenticator for realm
'mesos-agent-readonly'
I0526 21:38:44.668506 23231 http.cpp:975] Creating default 'basic' HTTP authenticator for
realm 'mesos-agent-readwrite'
I0526 21:38:44.668661 23231 http.cpp:996] Creating default 'jwt' HTTP authenticator for realm
'mesos-agent-readwrite'
I0526 21:38:44.670094 23231 slave.cpp:536] Agent resources: cpus(*):2; mem(*):1024; disk(*):1024;
ports(*):[31000-32000]
I0526 21:38:44.670166 23231 slave.cpp:544] Agent attributes: [  ]
I0526 21:38:44.670182 23231 slave.cpp:549] Agent hostname: cc6437e360db
I0526 21:38:44.670321 23222 status_update_manager.cpp:177] Pausing sending status updates
I0526 21:38:44.671744 23223 state.cpp:62] Recovering state from '/tmp/Endpoint_SlaveEndpointTest_UnauthorizedRequest_1_lJKC2T/meta'
I0526 21:38:44.672127 23221 status_update_manager.cpp:203] Recovering status update manager
I0526 21:38:44.672428 23220 containerizer.cpp:582] Recovering containerizer
I0526 21:38:44.673979 23234 provisioner.cpp:416] Provisioner recovery complete
I0526 21:38:44.674409 23223 slave.cpp:6073] Finished recovery
I0526 21:38:44.675060 23223 slave.cpp:6255] Querying resource estimator for oversubscribable
resources
I0526 21:38:44.675465 23226 slave.cpp:6269] Received oversubscribable resources {} from the
resource estimator
I0526 21:38:44.677985 23235 process.cpp:3730] Handling HTTP event for process 'slave(755)'
with path: '/slave(755)/monitor/statistics.json'
I0526 21:38:44.679826 23230 http.cpp:1115] HTTP GET for /slave(755)/monitor/statistics.json
from 172.17.0.2:39709
I0526 21:38:44.679911 23230 http.cpp:936] Authorizing principal 'test-principal' to GET the
'/monitor/statistics.json' endpoint
I0526 21:38:44.682411 23235 slave.cpp:801] Agent terminating
[       OK ] Endpoint/SlaveEndpointTest.UnauthorizedRequest/1 (32 ms)
[ RUN      ] Endpoint/SlaveEndpointTest.UnauthorizedRequest/2
I0526 21:38:44.696285  5172 containerizer.cpp:230] Using isolation: posix/cpu,posix/mem,filesystem/posix,network/cni,environment_secret
W0526 21:38:44.696807  5172 backend.cpp:76] Failed to create 'aufs' backend: AufsBackend requires
root privileges
W0526 21:38:44.696931  5172 backend.cpp:76] Failed to create 'bind' backend: BindBackend requires
root privileges
I0526 21:38:44.696980  5172 provisioner.cpp:255] Using default backend 'copy'
I0526 21:38:44.700208 23223 slave.cpp:232] Mesos agent started on (756)@172.17.0.2:59622
I0526 21:38:44.700271 23223 slave.cpp:233] Flags at startup: --acls="" --appc_simple_discovery_uri_prefix="http://"
--appc_store_dir="/tmp/mesos/store/appc" --authenticate_http_executors="true" --authenticate_http_readonly="true"
--authenticate_http_readwrite="true" --authenticatee="crammd5" --authentication_backoff_factor="1secs"
--authorizer="local" --cgroups_cpu_enable_pids_and_tids_count="false" --cgroups_enable_cfs="false"
--cgroups_hierarchy="/sys/fs/cgroup" --cgroups_limit_swap="false" --cgroups_root="mesos" --container_disk_watch_interval="15secs"
--containerizers="mesos" --credential="/tmp/Endpoint_SlaveEndpointTest_UnauthorizedRequest_2_BZADqn/credential"
--default_role="*" --disk_watch_interval="1mins" --docker="docker" --docker_kill_orphans="true"
--docker_registry="https://registry-1.docker.io" --docker_remove_delay="6hrs" --docker_socket="/var/run/docker.sock"
--docker_stop_timeout="0ns" --docker_store_dir="/tmp/mesos/store/docker" --docker_volume_checkpoint_dir="/var/run/mesos/isolators/docker/volume"
--enforce_container_disk_quota="false" --executor_registration_timeout="1mins" --executor_reregistration_timeout="2secs"
--executor_secret_key="/tmp/Endpoint_SlaveEndpointTest_UnauthorizedRequest_2_BZADqn/executor_secret_key"
--executor_shutdown_grace_period="5secs" --fetcher_cache_dir="/tmp/Endpoint_SlaveEndpointTest_UnauthorizedRequest_2_BZADqn/fetch"
--fetcher_cache_size="2GB" --frameworks_home="" --gc_delay="1weeks" --gc_disk_headroom="0.1"
--hadoop_home="" --help="false" --hostname_lookup="true" --http_command_executor="false" --http_credentials="/tmp/Endpoint_SlaveEndpointTest_UnauthorizedRequest_2_BZADqn/http_credentials"
--http_heartbeat_interval="30secs" --initialize_driver_logging="true" --isolation="posix/cpu,posix/mem"
--launcher="posix" --launcher_dir="/mesos/mesos-1.4.0/_build/src" --logbufsecs="0" --logging_level="INFO"
--max_completed_executors_per_framework="150" --oversubscribed_resources_interval="15secs"
--perf_duration="10secs" --perf_interval="1mins" --port="5051" --qos_correction_interval_min="0ns"
--quiet="false" --recover="reconnect" --recovery_timeout="15mins" --registration_backoff_factor="10ms"
--resources="cpus:2;gpus:0;mem:1024;disk:1024;ports:[31000-32000]" --revocable_cpu_low_priority="true"
--runtime_dir="/tmp/Endpoint_SlaveEndpointTest_UnauthorizedRequest_2_BZADqn" --sandbox_directory="/mnt/mesos/sandbox"
--strict="true" --switch_user="true" --systemd_enable_support="true" --systemd_runtime_directory="/run/systemd/system"
--version="false" --work_dir="/tmp/Endpoint_SlaveEndpointTest_UnauthorizedRequest_2_gtJZjG"
I0526 21:38:44.700937 23223 credentials.hpp:86] Loading credential for authentication from
'/tmp/Endpoint_SlaveEndpointTest_UnauthorizedRequest_2_BZADqn/credential'
I0526 21:38:44.701180 23223 slave.cpp:265] Agent using credential for: test-principal
I0526 21:38:44.701206 23223 credentials.hpp:37] Loading credentials for authentication from
'/tmp/Endpoint_SlaveEndpointTest_UnauthorizedRequest_2_BZADqn/http_credentials'
I0526 21:38:44.701501 23223 http.cpp:975] Creating default 'basic' HTTP authenticator for
realm 'mesos-agent-executor'
I0526 21:38:44.701655 23223 http.cpp:996] Creating default 'jwt' HTTP authenticator for realm
'mesos-agent-executor'
I0526 21:38:44.701876 23223 http.cpp:975] Creating default 'basic' HTTP authenticator for
realm 'mesos-agent-readonly'
I0526 21:38:44.702072 23223 http.cpp:996] Creating default 'jwt' HTTP authenticator for realm
'mesos-agent-readonly'
I0526 21:38:44.702324 23223 http.cpp:975] Creating default 'basic' HTTP authenticator for
realm 'mesos-agent-readwrite'
I0526 21:38:44.702442 23223 http.cpp:996] Creating default 'jwt' HTTP authenticator for realm
'mesos-agent-readwrite'
I0526 21:38:44.703800 23223 slave.cpp:536] Agent resources: cpus(*):2; mem(*):1024; disk(*):1024;
ports(*):[31000-32000]
I0526 21:38:44.703876 23223 slave.cpp:544] Agent attributes: [  ]
I0526 21:38:44.703893 23223 slave.cpp:549] Agent hostname: cc6437e360db
I0526 21:38:44.704040 23235 status_update_manager.cpp:177] Pausing sending status updates
I0526 21:38:44.705560 23221 state.cpp:62] Recovering state from '/tmp/Endpoint_SlaveEndpointTest_UnauthorizedRequest_2_gtJZjG/meta'
I0526 21:38:44.705957 23223 status_update_manager.cpp:203] Recovering status update manager
I0526 21:38:44.706140 23230 containerizer.cpp:582] Recovering containerizer
I0526 21:38:44.707629 23234 provisioner.cpp:416] Provisioner recovery complete
I0526 21:38:44.707988 23223 slave.cpp:6073] Finished recovery
I0526 21:38:44.708544 23223 slave.cpp:6255] Querying resource estimator for oversubscribable
resources
I0526 21:38:44.708946 23231 slave.cpp:6269] Received oversubscribable resources {} from the
resource estimator
I0526 21:38:44.711518 23223 process.cpp:3730] Handling HTTP event for process 'slave(756)'
with path: '/slave(756)/containers'
I0526 21:38:44.713369 23228 http.cpp:1115] HTTP GET for /slave(756)/containers from 172.17.0.2:39710
I0526 21:38:44.713464 23228 http.cpp:936] Authorizing principal 'test-principal' to GET the
'/containers' endpoint
I0526 21:38:44.716075 23220 slave.cpp:801] Agent terminating
[       OK ] Endpoint/SlaveEndpointTest.UnauthorizedRequest/2 (30 ms)
[ RUN      ] Endpoint/SlaveEndpointTest.NoAuthorizer/0
I0526 21:38:44.729755  5172 containerizer.cpp:230] Using isolation: posix/cpu,posix/mem,filesystem/posix,network/cni,environment_secret
W0526 21:38:44.730285  5172 backend.cpp:76] Failed to create 'aufs' backend: AufsBackend requires
root privileges
W0526 21:38:44.730406  5172 backend.cpp:76] Failed to create 'bind' backend: BindBackend requires
root privileges
I0526 21:38:44.730453  5172 provisioner.cpp:255] Using default backend 'copy'
I0526 21:38:44.732252  5172 cluster.cpp:448] Creating default 'local' authorizer
I0526 21:38:44.733923 23230 slave.cpp:232] Mesos agent started on (757)@172.17.0.2:59622
I0526 21:38:44.733961 23230 slave.cpp:233] Flags at startup: --acls="" --appc_simple_discovery_uri_prefix="http://"
--appc_store_dir="/tmp/mesos/store/appc" --authenticate_http_executors="true" --authenticate_http_readonly="true"
--authenticate_http_readwrite="true" --authenticatee="crammd5" --authentication_backoff_factor="1secs"
--authorizer="local" --cgroups_cpu_enable_pids_and_tids_count="false" --cgroups_enable_cfs="false"
--cgroups_hierarchy="/sys/fs/cgroup" --cgroups_limit_swap="false" --cgroups_root="mesos" --container_disk_watch_interval="15secs"
--containerizers="mesos" --credential="/tmp/Endpoint_SlaveEndpointTest_NoAuthorizer_0_KtWk99/credential"
--default_role="*" --disk_watch_interval="1mins" --docker="docker" --docker_kill_orphans="true"
--docker_registry="https://registry-1.docker.io" --docker_remove_delay="6hrs" --docker_socket="/var/run/docker.sock"
--docker_stop_timeout="0ns" --docker_store_dir="/tmp/mesos/store/docker" --docker_volume_checkpoint_dir="/var/run/mesos/isolators/docker/volume"
--enforce_container_disk_quota="false" --executor_registration_timeout="1mins" --executor_reregistration_timeout="2secs"
--executor_secret_key="/tmp/Endpoint_SlaveEndpointTest_NoAuthorizer_0_KtWk99/executor_secret_key"
--executor_shutdown_grace_period="5secs" --fetcher_cache_dir="/tmp/Endpoint_SlaveEndpointTest_NoAuthorizer_0_KtWk99/fetch"
--fetcher_cache_size="2GB" --frameworks_home="" --gc_delay="1weeks" --gc_disk_headroom="0.1"
--hadoop_home="" --help="false" --hostname_lookup="true" --http_command_executor="false" --http_credentials="/tmp/Endpoint_SlaveEndpointTest_NoAuthorizer_0_KtWk99/http_credentials"
--http_heartbeat_interval="30secs" --initialize_driver_logging="true" --isolation="posix/cpu,posix/mem"
--launcher="posix" --launcher_dir="/mesos/mesos-1.4.0/_build/src" --logbufsecs="0" --logging_level="INFO"
--max_completed_executors_per_framework="150" --oversubscribed_resources_interval="15secs"
--perf_duration="10secs" --perf_interval="1mins" --port="5051" --qos_correction_interval_min="0ns"
--quiet="false" --recover="reconnect" --recovery_timeout="15mins" --registration_backoff_factor="10ms"
--resources="cpus:2;gpus:0;mem:1024;disk:1024;ports:[31000-32000]" --revocable_cpu_low_priority="true"
--runtime_dir="/tmp/Endpoint_SlaveEndpointTest_NoAuthorizer_0_KtWk99" --sandbox_directory="/mnt/mesos/sandbox"
--strict="true" --switch_user="true" --systemd_enable_support="true" --systemd_runtime_directory="/run/systemd/system"
--version="false" --work_dir="/tmp/Endpoint_SlaveEndpointTest_NoAuthorizer_0_tYkjXs"
I0526 21:38:44.734355 23230 credentials.hpp:86] Loading credential for authentication from
'/tmp/Endpoint_SlaveEndpointTest_NoAuthorizer_0_KtWk99/credential'
I0526 21:38:44.734568 23230 slave.cpp:265] Agent using credential for: test-principal
I0526 21:38:44.734596 23230 credentials.hpp:37] Loading credentials for authentication from
'/tmp/Endpoint_SlaveEndpointTest_NoAuthorizer_0_KtWk99/http_credentials'
I0526 21:38:44.734930 23230 http.cpp:975] Creating default 'basic' HTTP authenticator for
realm 'mesos-agent-executor'
I0526 21:38:44.735059 23230 http.cpp:996] Creating default 'jwt' HTTP authenticator for realm
'mesos-agent-executor'
I0526 21:38:44.735281 23230 http.cpp:975] Creating default 'basic' HTTP authenticator for
realm 'mesos-agent-readonly'
I0526 21:38:44.735402 23230 http.cpp:996] Creating default 'jwt' HTTP authenticator for realm
'mesos-agent-readonly'
I0526 21:38:44.735601 23230 http.cpp:975] Creating default 'basic' HTTP authenticator for
realm 'mesos-agent-readwrite'
I0526 21:38:44.735710 23230 http.cpp:996] Creating default 'jwt' HTTP authenticator for realm
'mesos-agent-readwrite'
I0526 21:38:44.736974 23230 slave.cpp:536] Agent resources: cpus(*):2; mem(*):1024; disk(*):1024;
ports(*):[31000-32000]
I0526 21:38:44.737041 23230 slave.cpp:544] Agent attributes: [  ]
I0526 21:38:44.737058 23230 slave.cpp:549] Agent hostname: cc6437e360db
I0526 21:38:44.737300 23233 status_update_manager.cpp:177] Pausing sending status updates
I0526 21:38:44.738665 23235 state.cpp:62] Recovering state from '/tmp/Endpoint_SlaveEndpointTest_NoAuthorizer_0_tYkjXs/meta'
I0526 21:38:44.739029 23227 status_update_manager.cpp:203] Recovering status update manager
I0526 21:38:44.739271 23232 containerizer.cpp:582] Recovering containerizer
I0526 21:38:44.740636 23225 provisioner.cpp:416] Provisioner recovery complete
I0526 21:38:44.741010 23233 slave.cpp:6073] Finished recovery
I0526 21:38:44.741679 23233 slave.cpp:6255] Querying resource estimator for oversubscribable
resources
I0526 21:38:44.742035 23227 slave.cpp:6269] Received oversubscribable resources {} from the
resource estimator
I0526 21:38:44.744510 23232 process.cpp:3730] Handling HTTP event for process 'slave(757)'
with path: '/slave(757)/monitor/statistics'
I0526 21:38:44.746471 23233 http.cpp:1115] HTTP GET for /slave(757)/monitor/statistics from
172.17.0.2:39711
I0526 21:38:44.746552 23233 http.cpp:936] Authorizing principal 'test-principal' to GET the
'/monitor/statistics' endpoint
I0526 21:38:44.750985 23233 slave.cpp:801] Agent terminating
[       OK ] Endpoint/SlaveEndpointTest.NoAuthorizer/0 (32 ms)
[ RUN      ] Endpoint/SlaveEndpointTest.NoAuthorizer/1
I0526 21:38:44.762919  5172 containerizer.cpp:230] Using isolation: posix/cpu,posix/mem,filesystem/posix,network/cni,environment_secret
W0526 21:38:44.763437  5172 backend.cpp:76] Failed to create 'aufs' backend: AufsBackend requires
root privileges
W0526 21:38:44.763559  5172 backend.cpp:76] Failed to create 'bind' backend: BindBackend requires
root privileges
I0526 21:38:44.763597  5172 provisioner.cpp:255] Using default backend 'copy'
I0526 21:38:44.765410  5172 cluster.cpp:448] Creating default 'local' authorizer
I0526 21:38:44.766969 23229 slave.cpp:232] Mesos agent started on (758)@172.17.0.2:59622
I0526 21:38:44.767014 23229 slave.cpp:233] Flags at startup: --acls="" --appc_simple_discovery_uri_prefix="http://"
--appc_store_dir="/tmp/mesos/store/appc" --authenticate_http_executors="true" --authenticate_http_readonly="true"
--authenticate_http_readwrite="true" --authenticatee="crammd5" --authentication_backoff_factor="1secs"
--authorizer="local" --cgroups_cpu_enable_pids_and_tids_count="false" --cgroups_enable_cfs="false"
--cgroups_hierarchy="/sys/fs/cgroup" --cgroups_limit_swap="false" --cgroups_root="mesos" --container_disk_watch_interval="15secs"
--containerizers="mesos" --credential="/tmp/Endpoint_SlaveEndpointTest_NoAuthorizer_1_qTzgdX/credential"
--default_role="*" --disk_watch_interval="1mins" --docker="docker" --docker_kill_orphans="true"
--docker_registry="https://registry-1.docker.io" --docker_remove_delay="6hrs" --docker_socket="/var/run/docker.sock"
--docker_stop_timeout="0ns" --docker_store_dir="/tmp/mesos/store/docker" --docker_volume_checkpoint_dir="/var/run/mesos/isolators/docker/volume"
--enforce_container_disk_quota="false" --executor_registration_timeout="1mins" --executor_reregistration_timeout="2secs"
--executor_secret_key="/tmp/Endpoint_SlaveEndpointTest_NoAuthorizer_1_qTzgdX/executor_secret_key"
--executor_shutdown_grace_period="5secs" --fetcher_cache_dir="/tmp/Endpoint_SlaveEndpointTest_NoAuthorizer_1_qTzgdX/fetch"
--fetcher_cache_size="2GB" --frameworks_home="" --gc_delay="1weeks" --gc_disk_headroom="0.1"
--hadoop_home="" --help="false" --hostname_lookup="true" --http_command_executor="false" --http_credentials="/tmp/Endpoint_SlaveEndpointTest_NoAuthorizer_1_qTzgdX/http_credentials"
--http_heartbeat_interval="30secs" --initialize_driver_logging="true" --isolation="posix/cpu,posix/mem"
--launcher="posix" --launcher_dir="/mesos/mesos-1.4.0/_build/src" --logbufsecs="0" --logging_level="INFO"
--max_completed_executors_per_framework="150" --oversubscribed_resources_interval="15secs"
--perf_duration="10secs" --perf_interval="1mins" --port="5051" --qos_correction_interval_min="0ns"
--quiet="false" --recover="reconnect" --recovery_timeout="15mins" --registration_backoff_factor="10ms"
--resources="cpus:2;gpus:0;mem:1024;disk:1024;ports:[31000-32000]" --revocable_cpu_low_priority="true"
--runtime_dir="/tmp/Endpoint_SlaveEndpointTest_NoAuthorizer_1_qTzgdX" --sandbox_directory="/mnt/mesos/sandbox"
--strict="true" --switch_user="true" --systemd_enable_support="true" --systemd_runtime_directory="/run/systemd/system"
--version="false" --work_dir="/tmp/Endpoint_SlaveEndpointTest_NoAuthorizer_1_UV9WVf"
I0526 21:38:44.767535 23229 credentials.hpp:86] Loading credential for authentication from
'/tmp/Endpoint_SlaveEndpointTest_NoAuthorizer_1_qTzgdX/credential'
I0526 21:38:44.767745 23229 slave.cpp:265] Agent using credential for: test-principal
I0526 21:38:44.767767 23229 credentials.hpp:37] Loading credentials for authentication from
'/tmp/Endpoint_SlaveEndpointTest_NoAuthorizer_1_qTzgdX/http_credentials'
I0526 21:38:44.768038 23229 http.cpp:975] Creating default 'basic' HTTP authenticator for
realm 'mesos-agent-executor'
I0526 21:38:44.768163 23229 http.cpp:996] Creating default 'jwt' HTTP authenticator for realm
'mesos-agent-executor'
I0526 21:38:44.768342 23229 http.cpp:975] Creating default 'basic' HTTP authenticator for
realm 'mesos-agent-readonly'
I0526 21:38:44.768419 23229 http.cpp:996] Creating default 'jwt' HTTP authenticator for realm
'mesos-agent-readonly'
I0526 21:38:44.768554 23229 http.cpp:975] Creating default 'basic' HTTP authenticator for
realm 'mesos-agent-readwrite'
I0526 21:38:44.768636 23229 http.cpp:996] Creating default 'jwt' HTTP authenticator for realm
'mesos-agent-readwrite'
I0526 21:38:44.769858 23229 slave.cpp:536] Agent resources: cpus(*):2; mem(*):1024; disk(*):1024;
ports(*):[31000-32000]
I0526 21:38:44.769927 23229 slave.cpp:544] Agent attributes: [  ]
I0526 21:38:44.769938 23229 slave.cpp:549] Agent hostname: cc6437e360db
I0526 21:38:44.770081 23225 status_update_manager.cpp:177] Pausing sending status updates
I0526 21:38:44.771500 23235 state.cpp:62] Recovering state from '/tmp/Endpoint_SlaveEndpointTest_NoAuthorizer_1_UV9WVf/meta'
I0526 21:38:44.771769 23233 status_update_manager.cpp:203] Recovering status update manager
I0526 21:38:44.772045 23232 containerizer.cpp:582] Recovering containerizer
I0526 21:38:44.773540 23221 provisioner.cpp:416] Provisioner recovery complete
I0526 21:38:44.774058 23227 slave.cpp:6073] Finished recovery
I0526 21:38:44.774896 23227 slave.cpp:6255] Querying resource estimator for oversubscribable
resources
I0526 21:38:44.775233 23225 slave.cpp:6269] Received oversubscribable resources {} from the
resource estimator
I0526 21:38:44.777588 23233 process.cpp:3730] Handling HTTP event for process 'slave(758)'
with path: '/slave(758)/monitor/statistics.json'
I0526 21:38:44.779386 23232 http.cpp:1115] HTTP GET for /slave(758)/monitor/statistics.json
from 172.17.0.2:39712
I0526 21:38:44.779476 23232 http.cpp:936] Authorizing principal 'test-principal' to GET the
'/monitor/statistics.json' endpoint
I0526 21:38:44.783398  5172 slave.cpp:801] Agent terminating
[       OK ] Endpoint/SlaveEndpointTest.NoAuthorizer/1 (32 ms)
[ RUN      ] Endpoint/SlaveEndpointTest.NoAuthorizer/2
I0526 21:38:44.794777  5172 containerizer.cpp:230] Using isolation: posix/cpu,posix/mem,filesystem/posix,network/cni,environment_secret
W0526 21:38:44.795466  5172 backend.cpp:76] Failed to create 'aufs' backend: AufsBackend requires
root privileges
W0526 21:38:44.795595  5172 backend.cpp:76] Failed to create 'bind' backend: BindBackend requires
root privileges
I0526 21:38:44.795645  5172 provisioner.cpp:255] Using default backend 'copy'
I0526 21:38:44.797886  5172 cluster.cpp:448] Creating default 'local' authorizer
I0526 21:38:44.800076 23228 slave.cpp:232] Mesos agent started on (759)@172.17.0.2:59622
I0526 21:38:44.800235 23228 slave.cpp:233] Flags at startup: --acls="" --appc_simple_discovery_uri_prefix="http://"
--appc_store_dir="/tmp/mesos/store/appc" --authenticate_http_executors="true" --authenticate_http_readonly="true"
--authenticate_http_readwrite="true" --authenticatee="crammd5" --authentication_backoff_factor="1secs"
--authorizer="local" --cgroups_cpu_enable_pids_and_tids_count="false" --cgroups_enable_cfs="false"
--cgroups_hierarchy="/sys/fs/cgroup" --cgroups_limit_swap="false" --cgroups_root="mesos" --container_disk_watch_interval="15secs"
--containerizers="mesos" --credential="/tmp/Endpoint_SlaveEndpointTest_NoAuthorizer_2_HaweCK/credential"
--default_role="*" --disk_watch_interval="1mins" --docker="docker" --docker_kill_orphans="true"
--docker_registry="https://registry-1.docker.io" --docker_remove_delay="6hrs" --docker_socket="/var/run/docker.sock"
--docker_stop_timeout="0ns" --docker_store_dir="/tmp/mesos/store/docker" --docker_volume_checkpoint_dir="/var/run/mesos/isolators/docker/volume"
--enforce_container_disk_quota="false" --executor_registration_timeout="1mins" --executor_reregistration_timeout="2secs"
--executor_secret_key="/tmp/Endpoint_SlaveEndpointTest_NoAuthorizer_2_HaweCK/executor_secret_key"
--executor_shutdown_grace_period="5secs" --fetcher_cache_dir="/tmp/Endpoint_SlaveEndpointTest_NoAuthorizer_2_HaweCK/fetch"
--fetcher_cache_size="2GB" --frameworks_home="" --gc_delay="1weeks" --gc_disk_headroom="0.1"
--hadoop_home="" --help="false" --hostname_lookup="true" --http_command_executor="false" --http_credentials="/tmp/Endpoint_SlaveEndpointTest_NoAuthorizer_2_HaweCK/http_credentials"
--http_heartbeat_interval="30secs" --initialize_driver_logging="true" --isolation="posix/cpu,posix/mem"
--launcher="posix" --launcher_dir="/mesos/mesos-1.4.0/_build/src" --logbufsecs="0" --logging_level="INFO"
--max_completed_executors_per_framework="150" --oversubscribed_resources_interval="15secs"
--perf_duration="10secs" --perf_interval="1mins" --port="5051" --qos_correction_interval_min="0ns"
--quiet="false" --recover="reconnect" --recovery_timeout="15mins" --registration_backoff_factor="10ms"
--resources="cpus:2;gpus:0;mem:1024;disk:1024;ports:[31000-32000]" --revocable_cpu_low_priority="true"
--runtime_dir="/tmp/Endpoint_SlaveEndpointTest_NoAuthorizer_2_HaweCK" --sandbox_directory="/mnt/mesos/sandbox"
--strict="true" --switch_user="true" --systemd_enable_support="true" --systemd_runtime_directory="/run/systemd/system"
--version="false" --work_dir="/tmp/Endpoint_SlaveEndpointTest_NoAuthorizer_2_9cAHf3"
I0526 21:38:44.800981 23228 credentials.hpp:86] Loading credential for authentication from
'/tmp/Endpoint_SlaveEndpointTest_NoAuthorizer_2_HaweCK/credential'
I0526 21:38:44.801201 23228 slave.cpp:265] Agent using credential for: test-principal
I0526 21:38:44.801226 23228 credentials.hpp:37] Loading credentials for authentication from
'/tmp/Endpoint_SlaveEndpointTest_NoAuthorizer_2_HaweCK/http_credentials'
I0526 21:38:44.801579 23228 http.cpp:975] Creating default 'basic' HTTP authenticator for
realm 'mesos-agent-executor'
I0526 21:38:44.801733 23228 http.cpp:996] Creating default 'jwt' HTTP authenticator for realm
'mesos-agent-executor'
I0526 21:38:44.802011 23228 http.cpp:975] Creating default 'basic' HTTP authenticator for
realm 'mesos-agent-readonly'
I0526 21:38:44.802230 23228 http.cpp:996] Creating default 'jwt' HTTP authenticator for realm
'mesos-agent-readonly'
I0526 21:38:44.802424 23228 http.cpp:975] Creating default 'basic' HTTP authenticator for
realm 'mesos-agent-readwrite'
I0526 21:38:44.802562 23228 http.cpp:996] Creating default 'jwt' HTTP authenticator for realm
'mesos-agent-readwrite'
I0526 21:38:44.803926 23228 slave.cpp:536] Agent resources: cpus(*):2; mem(*):1024; disk(*):1024;
ports(*):[31000-32000]
I0526 21:38:44.803999 23228 slave.cpp:544] Agent attributes: [  ]
I0526 21:38:44.804020 23228 slave.cpp:549] Agent hostname: cc6437e360db
I0526 21:38:44.804250 23233 status_update_manager.cpp:177] Pausing sending status updates
I0526 21:38:44.805943 23225 state.cpp:62] Recovering state from '/tmp/Endpoint_SlaveEndpointTest_NoAuthorizer_2_9cAHf3/meta'
I0526 21:38:44.806555 23225 status_update_manager.cpp:203] Recovering status update manager
I0526 21:38:44.806763 23225 containerizer.cpp:582] Recovering containerizer
I0526 21:38:44.809191 23225 provisioner.cpp:416] Provisioner recovery complete
I0526 21:38:44.809844 23228 slave.cpp:6073] Finished recovery
I0526 21:38:44.810494 23228 slave.cpp:6255] Querying resource estimator for oversubscribable
resources
I0526 21:38:44.810881 23232 slave.cpp:6269] Received oversubscribable resources {} from the
resource estimator
I0526 21:38:44.813449 23221 process.cpp:3730] Handling HTTP event for process 'slave(759)'
with path: '/slave(759)/containers'
I0526 21:38:44.815481 23235 http.cpp:1115] HTTP GET for /slave(759)/containers from 172.17.0.2:39713
I0526 21:38:44.815587 23235 http.cpp:936] Authorizing principal 'test-principal' to GET the
'/containers' endpoint
I0526 21:38:44.819005 23232 slave.cpp:801] Agent terminating
[       OK ] Endpoint/SlaveEndpointTest.NoAuthorizer/2 (36 ms)
[----------] 9 tests from Endpoint/SlaveEndpointTest (304 ms total)

[----------] Global test environment tear-down
[==========] 1588 tests from 178 test cases ran. (568442 ms total)
[  PASSED  ] 1587 tests.
[  FAILED  ] 1 test, listed below:
[  FAILED  ] ExamplesTest.PythonFramework

 1 FAILED TEST
  YOU HAVE 22 DISABLED TESTS

E0526 21:38:44.888694 23236 process.cpp:950] Failed to accept socket: future discarded
make[4]: *** [check-local] Error 1
make[4]: Leaving directory `/mesos/mesos-1.4.0/_build/src'
make[3]: *** [check-am] Error 2
make[3]: Leaving directory `/mesos/mesos-1.4.0/_build/src'
make[2]: *** [check] Error 2
make[2]: Leaving directory `/mesos/mesos-1.4.0/_build/src'
make[1]: *** [check-recursive] Error 1
make[1]: Leaving directory `/mesos/mesos-1.4.0/_build'
make: *** [distcheck] Error 1
+ docker rmi mesos-1495831498-16542
Untagged: mesos-1495831498-16542:latest
Deleted: sha256:08cabe61b16f9031ce9d0aadf83228949658468ea74746f9410b25214b206094
Deleted: sha256:10247ede6084900a2c000e5c5256dbc903141d74a77ba0c0e40efd6764911795
Deleted: sha256:0af3de098a78007e0290064c81aa25cf2b6f4625b1030a4823d067eee3923ad6
Deleted: sha256:c94639b76dc899a337e383c438f3b7cb9a66d2ec40d739fff6b6288d631e19f2
Deleted: sha256:e8ddef9b16f646b95dd93ab0b8782b2701f180c2ba18513a51d674e545334419
Deleted: sha256:9bfefec39b00199aae8f243b391b9abc264989fbcd7475db93ab48b3ee5a909d
Deleted: sha256:fe49c2dec8a34116186cc4711e705ec106dc3d0e8149b22c1972b4b44c9cb706
Deleted: sha256:d22950d261b5eb59b44688b5d1d57a39bf715a00a3613563348c4f20d0ba2bd4
Deleted: sha256:330a9a6b5e85cccf8e7bb7f40960a08b64d7a567d717ec4cb831e002df3af10c
Deleted: sha256:a90fef1386750db5f03aea0d801294d66cb92c62c11512a11546e304f4a58fd5
Deleted: sha256:369cb931f71cf6566e08e633310bbed400e7875839678c901cf42d63473c2d52
Deleted: sha256:2ef9abef5f1cb1c2e9aa3f9bfe73ab02bf3aa29570c088ffccf9c56a49a7d419
Deleted: sha256:8ac895ec7ed78ec00e584b2689a7abf46559052f0acbab805853a4d09887a0f1
Deleted: sha256:9776ee3896205396bc2ac3cdf83da5f26ee2187c5d62a7760ae26619804087e3
Deleted: sha256:1c2247135bb80a142b3414a29675288ae881d675213fcd98203d18e77aff390b
Deleted: sha256:88a797119b47233d0e14ed25165fd968e025a94a2c3f048ecf570c148bbf70c3
Deleted: sha256:ddc6fa72560ee38433f2631b914477994fdcba31a6091c6bfe2f7af4ebf54501
Deleted: sha256:e19849b5a81073c3584838b499eb54bc7daab282dcb8cb328f754c167522c037
Deleted: sha256:867808f27a76ae0c3007f2de4ca6918d11f38877660d9e4bdaee1f007eedf3bf
Deleted: sha256:bf3d1cb6d490ad736efe5cf18c5ed989adba8663f8837a15925f0b48af0ce44b
Deleted: sha256:bcb41fd2390136ceacbc993819fe5dfbedb6d70dd6eac89ecbc0edfc40321e6e
Deleted: sha256:f0fb7a5edb43333cb529d13d7771562d9a2dd1296c53bf5ab150c276c9aebd63
Deleted: sha256:71530f5e7caf81e2576dcb29b0c5831907b0257aba19b1283e0428ea4bddc7c8
Deleted: sha256:37e873d9aef4c64d15e7a3091e448e6c02476b8eacde9001767ea686cd8d4fb8
Build step 'Execute shell' marked build as failure

Mime
View raw message