mesos-builds mailing list archives

Site index · List index
Message view « Date » · « Thread »
Top « Date » · « Thread »
From Apache Jenkins Server <jenk...@builds.apache.org>
Subject Build failed in Jenkins: Mesos-Buildbot » autotools,gcc,--verbose --enable-libevent --enable-ssl,GLOG_v=1 MESOS_VERBOSE=1,centos:7,(docker||Hadoop)&&(!ubuntu-us1)&&(!ubuntu-eu2) #3636
Date Tue, 09 May 2017 13:51:40 GMT
See <https://builds.apache.org/job/Mesos-Buildbot/BUILDTOOL=autotools,COMPILER=gcc,CONFIGURATION=--verbose%20--enable-libevent%20--enable-ssl,ENVIRONMENT=GLOG_v=1%20MESOS_VERBOSE=1,OS=centos%3A7,label_exp=(docker%7C%7CHadoop)&&(!ubuntu-us1)&&(!ubuntu-eu2)/3636/display/redirect?page=changes>

Changes:

[alexr] Chained the underlying error for mnt namespace failure.

[yujie.jay] Added fields for resource provider actions.

------------------------------------------
[...truncated 2.55 MB...]
NOTE: Set LIBPROCESS_SSL_REQUIRE_CERT=1 to require peer certificate verification
E0509 13:51:24.562238 29413 process.cpp:950] Failed to accept socket: future discarded
I0509 13:51:24.569340 28392 process.cpp:1266] libprocess is initialized on 172.17.0.3:38553
with 16 worker threads
I0509 13:51:24.575047 29425 process.cpp:3730] Handling HTTP event for process '(83)' with
path: '/(83)/get'
I0509 13:51:24.580606 29416 process.cpp:3730] Handling HTTP event for process '(83)' with
path: '/(83)/get'
[       OK ] Scheme/HTTPTest.Get/0 (471 ms)
[ RUN      ] Scheme/HTTPTest.Get/1
I0509 13:51:24.591897 28392 process.cpp:1266] libprocess is initialized on 172.17.0.3:47558
with 16 worker threads
I0509 13:51:24.593778 29433 process.cpp:3730] Handling HTTP event for process '(84)' with
path: '/(84)/get'
I0509 13:51:24.596629 29437 process.cpp:3730] Handling HTTP event for process '(84)' with
path: '/(84)/get'
[       OK ] Scheme/HTTPTest.Get/1 (16 ms)
[ RUN      ] Scheme/HTTPTest.NestedGet/0
I0509 13:51:25.153977 28392 openssl.cpp:419] CA file path is unspecified! NOTE: Set CA file
path with LIBPROCESS_SSL_CA_FILE=<filepath>
I0509 13:51:25.154008 28392 openssl.cpp:424] CA directory path unspecified! NOTE: Set CA directory
path with LIBPROCESS_SSL_CA_DIR=<dirpath>
I0509 13:51:25.154016 28392 openssl.cpp:429] Will not verify peer certificate!
NOTE: Set LIBPROCESS_SSL_VERIFY_CERT=1 to enable peer certificate verification
I0509 13:51:25.154022 28392 openssl.cpp:435] Will only verify peer certificate if presented!
NOTE: Set LIBPROCESS_SSL_REQUIRE_CERT=1 to require peer certificate verification
E0509 13:51:25.154661 29447 process.cpp:950] Failed to accept socket: future discarded
I0509 13:51:25.163898 28392 process.cpp:1266] libprocess is initialized on 172.17.0.3:40394
with 16 worker threads
I0509 13:51:25.172936 29459 process.cpp:3730] Handling HTTP event for process '(85)' with
path: '/(85)//a/b/c'
I0509 13:51:25.181797 29452 process.cpp:3730] Handling HTTP event for process '(85)' with
path: '/(85)//a/b'
[       OK ] Scheme/HTTPTest.NestedGet/0 (595 ms)
[ RUN      ] Scheme/HTTPTest.NestedGet/1
I0509 13:51:25.198706 28392 process.cpp:1266] libprocess is initialized on 172.17.0.3:52959
with 16 worker threads
I0509 13:51:25.200314 29465 process.cpp:3730] Handling HTTP event for process '(86)' with
path: '/(86)//a/b/c'
I0509 13:51:25.206580 29471 process.cpp:3730] Handling HTTP event for process '(86)' with
path: '/(86)//a/b'
[       OK ] Scheme/HTTPTest.NestedGet/1 (15 ms)
[ RUN      ] Scheme/HTTPTest.StreamingGetComplete/0
I0509 13:51:25.604719 28392 openssl.cpp:419] CA file path is unspecified! NOTE: Set CA file
path with LIBPROCESS_SSL_CA_FILE=<filepath>
I0509 13:51:25.604749 28392 openssl.cpp:424] CA directory path unspecified! NOTE: Set CA directory
path with LIBPROCESS_SSL_CA_DIR=<dirpath>
I0509 13:51:25.604754 28392 openssl.cpp:429] Will not verify peer certificate!
NOTE: Set LIBPROCESS_SSL_VERIFY_CERT=1 to enable peer certificate verification
I0509 13:51:25.604759 28392 openssl.cpp:435] Will only verify peer certificate if presented!
NOTE: Set LIBPROCESS_SSL_REQUIRE_CERT=1 to require peer certificate verification
E0509 13:51:25.605383 29481 process.cpp:950] Failed to accept socket: future discarded
I0509 13:51:25.611009 28392 process.cpp:1266] libprocess is initialized on 172.17.0.3:58323
with 16 worker threads
I0509 13:51:25.617847 29493 process.cpp:3730] Handling HTTP event for process '(87)' with
path: '/(87)/pipe'
[       OK ] Scheme/HTTPTest.StreamingGetComplete/0 (470 ms)
[ RUN      ] Scheme/HTTPTest.StreamingGetComplete/1
I0509 13:51:25.683686 28392 process.cpp:1266] libprocess is initialized on 172.17.0.3:41270
with 16 worker threads
I0509 13:51:25.685122 29503 process.cpp:3730] Handling HTTP event for process '(88)' with
path: '/(88)/pipe'
[       OK ] Scheme/HTTPTest.StreamingGetComplete/1 (46 ms)
[ RUN      ] Scheme/HTTPTest.StreamingGetFailure/0
I0509 13:51:26.239755 28392 openssl.cpp:419] CA file path is unspecified! NOTE: Set CA file
path with LIBPROCESS_SSL_CA_FILE=<filepath>
I0509 13:51:26.239789 28392 openssl.cpp:424] CA directory path unspecified! NOTE: Set CA directory
path with LIBPROCESS_SSL_CA_DIR=<dirpath>
I0509 13:51:26.239797 28392 openssl.cpp:429] Will not verify peer certificate!
NOTE: Set LIBPROCESS_SSL_VERIFY_CERT=1 to enable peer certificate verification
I0509 13:51:26.239804 28392 openssl.cpp:435] Will only verify peer certificate if presented!
NOTE: Set LIBPROCESS_SSL_REQUIRE_CERT=1 to require peer certificate verification
E0509 13:51:26.240470 29515 process.cpp:950] Failed to accept socket: future discarded
I0509 13:51:26.243330 28392 process.cpp:1266] libprocess is initialized on 172.17.0.3:52146
with 16 worker threads
I0509 13:51:26.254611 29526 process.cpp:3730] Handling HTTP event for process '(89)' with
path: '/(89)/pipe'
I0509 13:51:26.295464 29529 process.cpp:1624] Failed to read from stream: oops
[       OK ] Scheme/HTTPTest.StreamingGetFailure/0 (593 ms)
[ RUN      ] Scheme/HTTPTest.StreamingGetFailure/1
I0509 13:51:26.339269 28392 process.cpp:1266] libprocess is initialized on 172.17.0.3:60303
with 16 worker threads
I0509 13:51:26.341879 29541 process.cpp:3730] Handling HTTP event for process '(90)' with
path: '/(90)/pipe'
I0509 13:51:26.345630 29541 process.cpp:1624] Failed to read from stream: oops
[       OK ] Scheme/HTTPTest.StreamingGetFailure/1 (36 ms)
[ RUN      ] Scheme/HTTPTest.PipeEquality/0
I0509 13:51:26.558735 28392 openssl.cpp:419] CA file path is unspecified! NOTE: Set CA file
path with LIBPROCESS_SSL_CA_FILE=<filepath>
I0509 13:51:26.558764 28392 openssl.cpp:424] CA directory path unspecified! NOTE: Set CA directory
path with LIBPROCESS_SSL_CA_DIR=<dirpath>
I0509 13:51:26.558773 28392 openssl.cpp:429] Will not verify peer certificate!
NOTE: Set LIBPROCESS_SSL_VERIFY_CERT=1 to enable peer certificate verification
I0509 13:51:26.558778 28392 openssl.cpp:435] Will only verify peer certificate if presented!
NOTE: Set LIBPROCESS_SSL_REQUIRE_CERT=1 to require peer certificate verification
E0509 13:51:26.559504 29549 process.cpp:950] Failed to accept socket: future discarded
I0509 13:51:26.564882 28392 process.cpp:1266] libprocess is initialized on 172.17.0.3:54294
with 16 worker threads
[       OK ] Scheme/HTTPTest.PipeEquality/0 (210 ms)
[ RUN      ] Scheme/HTTPTest.PipeEquality/1
I0509 13:51:26.570453 28392 process.cpp:1266] libprocess is initialized on 172.17.0.3:42870
with 16 worker threads
[       OK ] Scheme/HTTPTest.PipeEquality/1 (6 ms)
[ RUN      ] Scheme/HTTPTest.Post/0
I0509 13:51:27.171211 28392 openssl.cpp:419] CA file path is unspecified! NOTE: Set CA file
path with LIBPROCESS_SSL_CA_FILE=<filepath>
I0509 13:51:27.171234 28392 openssl.cpp:424] CA directory path unspecified! NOTE: Set CA directory
path with LIBPROCESS_SSL_CA_DIR=<dirpath>
I0509 13:51:27.171239 28392 openssl.cpp:429] Will not verify peer certificate!
NOTE: Set LIBPROCESS_SSL_VERIFY_CERT=1 to enable peer certificate verification
I0509 13:51:27.171243 28392 openssl.cpp:435] Will only verify peer certificate if presented!
NOTE: Set LIBPROCESS_SSL_REQUIRE_CERT=1 to require peer certificate verification
E0509 13:51:27.171882 29583 process.cpp:950] Failed to accept socket: future discarded
I0509 13:51:27.185080 28392 process.cpp:1266] libprocess is initialized on 172.17.0.3:60766
with 16 worker threads
I0509 13:51:27.201278 29586 process.cpp:3730] Handling HTTP event for process '(91)' with
path: '/(91)/post'
I0509 13:51:27.248375 29596 process.cpp:3730] Handling HTTP event for process '(91)' with
path: '/(91)/post'
[       OK ] Scheme/HTTPTest.Post/0 (720 ms)
[ RUN      ] Scheme/HTTPTest.Post/1
I0509 13:51:27.300432 28392 process.cpp:1266] libprocess is initialized on 172.17.0.3:56155
with 16 worker threads
I0509 13:51:27.302108 29605 process.cpp:3730] Handling HTTP event for process '(92)' with
path: '/(92)/post'
I0509 13:51:27.304775 29613 process.cpp:3730] Handling HTTP event for process '(92)' with
path: '/(92)/post'
[       OK ] Scheme/HTTPTest.Post/1 (14 ms)
[ RUN      ] Scheme/HTTPTest.Delete/0
I0509 13:51:27.639142 28392 openssl.cpp:419] CA file path is unspecified! NOTE: Set CA file
path with LIBPROCESS_SSL_CA_FILE=<filepath>
I0509 13:51:27.639168 28392 openssl.cpp:424] CA directory path unspecified! NOTE: Set CA directory
path with LIBPROCESS_SSL_CA_DIR=<dirpath>
I0509 13:51:27.639175 28392 openssl.cpp:429] Will not verify peer certificate!
NOTE: Set LIBPROCESS_SSL_VERIFY_CERT=1 to enable peer certificate verification
I0509 13:51:27.639181 28392 openssl.cpp:435] Will only verify peer certificate if presented!
NOTE: Set LIBPROCESS_SSL_REQUIRE_CERT=1 to require peer certificate verification
E0509 13:51:27.641547 29617 process.cpp:950] Failed to accept socket: future discarded
I0509 13:51:27.647111 28392 process.cpp:1266] libprocess is initialized on 172.17.0.3:40191
with 16 worker threads
I0509 13:51:27.656091 29629 process.cpp:3730] Handling HTTP event for process '(93)' with
path: '/(93)/delete'
[       OK ] Scheme/HTTPTest.Delete/0 (352 ms)
[ RUN      ] Scheme/HTTPTest.Delete/1
I0509 13:51:27.661314 28392 process.cpp:1266] libprocess is initialized on 172.17.0.3:44065
with 16 worker threads
I0509 13:51:27.662451 29643 process.cpp:3730] Handling HTTP event for process '(94)' with
path: '/(94)/delete'
[       OK ] Scheme/HTTPTest.Delete/1 (6 ms)
[ RUN      ] Scheme/HTTPTest.Request/0
I0509 13:51:28.363960 28392 openssl.cpp:419] CA file path is unspecified! NOTE: Set CA file
path with LIBPROCESS_SSL_CA_FILE=<filepath>
I0509 13:51:28.364037 28392 openssl.cpp:424] CA directory path unspecified! NOTE: Set CA directory
path with LIBPROCESS_SSL_CA_DIR=<dirpath>
I0509 13:51:28.364059 28392 openssl.cpp:429] Will not verify peer certificate!
NOTE: Set LIBPROCESS_SSL_VERIFY_CERT=1 to enable peer certificate verification
I0509 13:51:28.364076 28392 openssl.cpp:435] Will only verify peer certificate if presented!
NOTE: Set LIBPROCESS_SSL_REQUIRE_CERT=1 to require peer certificate verification
E0509 13:51:28.364737 29651 process.cpp:950] Failed to accept socket: future discarded
I0509 13:51:28.388689 28392 process.cpp:1266] libprocess is initialized on 172.17.0.3:54556
with 16 worker threads
I0509 13:51:28.399274 29655 process.cpp:3730] Handling HTTP event for process '(95)' with
path: '/(95)/request'
[       OK ] Scheme/HTTPTest.Request/0 (742 ms)
[ RUN      ] Scheme/HTTPTest.Request/1
I0509 13:51:28.411257 28392 process.cpp:1266] libprocess is initialized on 172.17.0.3:36612
with 16 worker threads
I0509 13:51:28.413240 29675 process.cpp:3730] Handling HTTP event for process '(96)' with
path: '/(96)/request'
[       OK ] Scheme/HTTPTest.Request/1 (9 ms)
[ RUN      ] Scheme/HTTPTest.QueryEncodeDecode/0
I0509 13:51:28.824695 28392 openssl.cpp:419] CA file path is unspecified! NOTE: Set CA file
path with LIBPROCESS_SSL_CA_FILE=<filepath>
I0509 13:51:28.824726 28392 openssl.cpp:424] CA directory path unspecified! NOTE: Set CA directory
path with LIBPROCESS_SSL_CA_DIR=<dirpath>
I0509 13:51:28.824733 28392 openssl.cpp:429] Will not verify peer certificate!
NOTE: Set LIBPROCESS_SSL_VERIFY_CERT=1 to enable peer certificate verification
I0509 13:51:28.824740 28392 openssl.cpp:435] Will only verify peer certificate if presented!
NOTE: Set LIBPROCESS_SSL_REQUIRE_CERT=1 to require peer certificate verification
E0509 13:51:28.825521 29685 process.cpp:950] Failed to accept socket: future discarded
I0509 13:51:28.842020 28392 process.cpp:1266] libprocess is initialized on 172.17.0.3:33495
with 16 worker threads
[       OK ] Scheme/HTTPTest.QueryEncodeDecode/0 (427 ms)
[ RUN      ] Scheme/HTTPTest.QueryEncodeDecode/1
I0509 13:51:28.849135 28392 process.cpp:1266] libprocess is initialized on 172.17.0.3:49794
with 16 worker threads
[       OK ] Scheme/HTTPTest.QueryEncodeDecode/1 (7 ms)
[ RUN      ] Scheme/HTTPTest.Headers/0
I0509 13:51:29.276360 28392 openssl.cpp:419] CA file path is unspecified! NOTE: Set CA file
path with LIBPROCESS_SSL_CA_FILE=<filepath>
I0509 13:51:29.276391 28392 openssl.cpp:424] CA directory path unspecified! NOTE: Set CA directory
path with LIBPROCESS_SSL_CA_DIR=<dirpath>
I0509 13:51:29.276398 28392 openssl.cpp:429] Will not verify peer certificate!
NOTE: Set LIBPROCESS_SSL_VERIFY_CERT=1 to enable peer certificate verification
I0509 13:51:29.276406 28392 openssl.cpp:435] Will only verify peer certificate if presented!
NOTE: Set LIBPROCESS_SSL_REQUIRE_CERT=1 to require peer certificate verification
E0509 13:51:29.276998 29719 process.cpp:950] Failed to accept socket: future discarded
I0509 13:51:29.291640 28392 process.cpp:1266] libprocess is initialized on 172.17.0.3:58966
with 16 worker threads
[       OK ] Scheme/HTTPTest.Headers/0 (443 ms)
[ RUN      ] Scheme/HTTPTest.Headers/1
I0509 13:51:29.299932 28392 process.cpp:1266] libprocess is initialized on 172.17.0.3:47009
with 16 worker threads
[       OK ] Scheme/HTTPTest.Headers/1 (8 ms)
[ RUN      ] Scheme/HTTPTest.CaseInsensitiveHeaders/0
I0509 13:51:29.753762 28392 openssl.cpp:419] CA file path is unspecified! NOTE: Set CA file
path with LIBPROCESS_SSL_CA_FILE=<filepath>
I0509 13:51:29.753829 28392 openssl.cpp:424] CA directory path unspecified! NOTE: Set CA directory
path with LIBPROCESS_SSL_CA_DIR=<dirpath>
I0509 13:51:29.753839 28392 openssl.cpp:429] Will not verify peer certificate!
NOTE: Set LIBPROCESS_SSL_VERIFY_CERT=1 to enable peer certificate verification
I0509 13:51:29.753846 28392 openssl.cpp:435] Will only verify peer certificate if presented!
NOTE: Set LIBPROCESS_SSL_REQUIRE_CERT=1 to require peer certificate verification
E0509 13:51:29.754561 29753 process.cpp:950] Failed to accept socket: future discarded
I0509 13:51:29.757107 28392 process.cpp:1266] libprocess is initialized on 172.17.0.3:41416
with 16 worker threads
[       OK ] Scheme/HTTPTest.CaseInsensitiveHeaders/0 (457 ms)
[ RUN      ] Scheme/HTTPTest.CaseInsensitiveHeaders/1
I0509 13:51:29.764951 28392 process.cpp:1266] libprocess is initialized on 172.17.0.3:59959
with 16 worker threads
[       OK ] Scheme/HTTPTest.CaseInsensitiveHeaders/1 (9 ms)
[ RUN      ] Scheme/HTTPTest.WWWAuthenticateHeader/0
I0509 13:51:30.565163 28392 openssl.cpp:419] CA file path is unspecified! NOTE: Set CA file
path with LIBPROCESS_SSL_CA_FILE=<filepath>
I0509 13:51:30.565194 28392 openssl.cpp:424] CA directory path unspecified! NOTE: Set CA directory
path with LIBPROCESS_SSL_CA_DIR=<dirpath>
I0509 13:51:30.565201 28392 openssl.cpp:429] Will not verify peer certificate!
NOTE: Set LIBPROCESS_SSL_VERIFY_CERT=1 to enable peer certificate verification
I0509 13:51:30.565208 28392 openssl.cpp:435] Will only verify peer certificate if presented!
NOTE: Set LIBPROCESS_SSL_REQUIRE_CERT=1 to require peer certificate verification
E0509 13:51:30.565899 29787 process.cpp:950] Failed to accept socket: future discarded
I0509 13:51:30.576064 28392 process.cpp:1266] libprocess is initialized on 172.17.0.3:46482
with 16 worker threads
[       OK ] Scheme/HTTPTest.WWWAuthenticateHeader/0 (810 ms)
[ RUN      ] Scheme/HTTPTest.WWWAuthenticateHeader/1
I0509 13:51:30.588112 28392 process.cpp:1266] libprocess is initialized on 172.17.0.3:54357
with 16 worker threads
[       OK ] Scheme/HTTPTest.WWWAuthenticateHeader/1 (12 ms)
[ RUN      ] Scheme/HTTPTest.Accepts/0
I0509 13:51:31.087514 28392 openssl.cpp:419] CA file path is unspecified! NOTE: Set CA file
path with LIBPROCESS_SSL_CA_FILE=<filepath>
I0509 13:51:31.087543 28392 openssl.cpp:424] CA directory path unspecified! NOTE: Set CA directory
path with LIBPROCESS_SSL_CA_DIR=<dirpath>
I0509 13:51:31.087548 28392 openssl.cpp:429] Will not verify peer certificate!
NOTE: Set LIBPROCESS_SSL_VERIFY_CERT=1 to enable peer certificate verification
I0509 13:51:31.087553 28392 openssl.cpp:435] Will only verify peer certificate if presented!
NOTE: Set LIBPROCESS_SSL_REQUIRE_CERT=1 to require peer certificate verification
E0509 13:51:31.088155 29821 process.cpp:950] Failed to accept socket: future discarded
*** Aborted at 1494337891 (unix time) try "date -d @1494337891" if you are using GNU date
***
I0509 13:51:31.092582 28392 process.cpp:1266] libprocess is initialized on 172.17.0.3:51293
with 16 worker threads
PC: @     0x7f78799d9c56 __memcpy_ssse3_back
*** SIGSEGV (@0x3759be8) received by PID 28392 (TID 0x7f786eab5700) from PID 58039272; stack
trace: ***
    @     0x7f787aaa2370 (unknown)
    @     0x7f78799d9c56 __memcpy_ssse3_back
[       OK ] Scheme/HTTPTest.Accepts/0 (506 ms)
[ RUN      ] Scheme/HTTPTest.Accepts/1
    @     0x7f787a2268e0 (unknown)
    @     0x7f787a226f8c (unknown)
    @           0x42aed3 process::UPID::UPID()
    @           0x8e2a0a process::DispatchEvent::DispatchEvent()
    @           0x8daef1 process::internal::dispatch()
    @           0x8f5594 process::dispatch<>()
    @           0x8d9e00 process::ProcessBase::route()
    @           0x9ccde7 process::ProcessBase::route<>()
    @           0x9c902a process::Help::initialize()
    @           0x8d3316 process::ProcessManager::resume()
    @           0x8cfd68 _ZZN7process14ProcessManager12init_threadsEvENKUt_clEv
    @           0x8e1fd2 _ZNSt12_Bind_simpleIFZN7process14ProcessManager12init_threadsEvEUt_vEE9_M_invokeIIEEEvSt12_Index_tupleIIXspT_EEE
    @           0x8e1f16 _ZNSt12_Bind_simpleIFZN7process14ProcessManager12init_threadsEvEUt_vEEclEv
    @           0x8e1ea0 _ZNSt6thread5_ImplISt12_Bind_simpleIFZN7process14ProcessManager12init_threadsEvEUt_vEEE6_M_runEv
    @     0x7f787a21d230 (unknown)
    @     0x7f787aa9adc5 start_thread
    @     0x7f787998673d __clone
make[7]: *** [check-local] Segmentation fault
make[7]: Leaving directory `/mesos/mesos-1.4.0/_build/3rdparty/libprocess'
make[6]: *** [check-am] Error 2
make[6]: Leaving directory `/mesos/mesos-1.4.0/_build/3rdparty/libprocess'
make[5]: *** [check-recursive] Error 1
make[5]: Leaving directory `/mesos/mesos-1.4.0/_build/3rdparty/libprocess'
make[4]: *** [check] Error 2
make[4]: Leaving directory `/mesos/mesos-1.4.0/_build/3rdparty/libprocess'
make[3]: *** [check-recursive] Error 1
make[3]: Leaving directory `/mesos/mesos-1.4.0/_build/3rdparty'
make[2]: *** [check] Error 2
make[2]: Leaving directory `/mesos/mesos-1.4.0/_build/3rdparty'
make[1]: *** [check-recursive] Error 1
make[1]: Leaving directory `/mesos/mesos-1.4.0/_build'
make: *** [distcheck] Error 1
+ docker rmi mesos-1494336570-32011
Untagged: mesos-1494336570-32011:latest
Deleted: sha256:b30161de763bd7f10bab67f75095e57053a4044eb3609a9a0612c6f479fc2970
Deleted: sha256:ca2dc835e4cec72185cacaafd09e4f65aedf1c8b7a7a825d98bc49cac1d4ddf6
Deleted: sha256:5f5252b947986db4370887c2746bc5e83d6e24084e07823b289a6de3f546f72c
Deleted: sha256:79e65f973b9b83dc634a9e122642ad2ca3dcbe72b03a91106ff4cccc3b97e10d
Deleted: sha256:8ea6619563c6b4fcb2a7c059c92603e5f16b91f39f9ef10ff1c5c23a8ad6942a
Deleted: sha256:14ccbfde328eedd91a325af2095b426201fc64bba98bc75428325725936e1997
Deleted: sha256:4ddac05e4717b136d18da14d16db6fc9f60f7d84cba76498ea50c0f3f403c36e
Deleted: sha256:9d2c380bba61a26514a0c7160aa6a1e4090a6e3f5d52ab08f75c64e20c2c39e7
Deleted: sha256:77d8e71bb056924ca738b5cacaf9334cc650045e080ef0038ada324fe88788fb
Deleted: sha256:7dc12e178499adb9b8f04b65dc5e0052bd06adb1582d7d3a582338da994e937a
Deleted: sha256:12bf889ae2e405a85190c7e933a120737aed97107c6569f9df9bd8495b048cbd
Deleted: sha256:f79063d739491268a1d7fcdce4e2e1e96b8be2c0be0e9141f11f864872ee2787
Deleted: sha256:1c9d858d1c963c67624a85d5c6770fa7f9e2956b84845fe23278bb4e2b1eb290
Deleted: sha256:0fd5fa6a34c5736e299e092ca844c6a41b4225256fd4cb4315689fa291f6734a
Deleted: sha256:1953018790c9fe7d7f5299360dc9f99cc4b1a9cd26dc159fd882700770233365
Deleted: sha256:f82ea2342fb9bfe4dcb989345f57d87fa4b90edb2cb21b8473a89148bc695039
Deleted: sha256:aad8bf40779c1420fc85ff00777549aa639733d8600d816a0ded96391cd920fe
Deleted: sha256:4b0dee866cf6d3ea58c3b3c5a613e4068ebd58936bd97f39cfb5a82d846f7078
Deleted: sha256:13d4fe2d78a4fe9e85b8250b045cfa9aa3c95106d11415e45c7b7ffc23d8141f
Deleted: sha256:af58e0b20af8a1940e1696e382892e60d52035c2b484888867600ffb0c1d5f4c
Deleted: sha256:33944a742b2830f15a16798edb406d510633b501240a3d2df3e412739f488a89
Deleted: sha256:f2e5dd2c1838b7db72ebf0f4f0113c563c28b560847eebe6c710080dd7a627c7
Deleted: sha256:f1da85355ccc12f0990d6cc1deec8b155970fe844509a03a7caac94ae193dccf
Deleted: sha256:3e731e08a497867a80a4cf1f11f3c8ecc736700126e8961a552c121199d0a80a
Deleted: sha256:202a0f0ac86cc872ed49b3ce8b37aa5f045d84049510d45463054bb5d0614f69
Build step 'Execute shell' marked build as failure
Not sending mail to unregistered user yujie.jay@gmail.com

Mime
View raw message