mesos-builds mailing list archives

Site index · List index
Message view « Date » · « Thread »
Top « Date » · « Thread »
From Apache Jenkins Server <jenk...@builds.apache.org>
Subject Build failed in Jenkins: Mesos-Buildbot » cmake,gcc,--verbose --enable-libevent --enable-ssl,GLOG_v=1 MESOS_VERBOSE=1,centos:7,(docker||Hadoop)&&(!ubuntu-us1)&&(!ubuntu-eu2) #3687
Date Wed, 17 May 2017 02:12:08 GMT
See <https://builds.apache.org/job/Mesos-Buildbot/BUILDTOOL=cmake,COMPILER=gcc,CONFIGURATION=--verbose%20--enable-libevent%20--enable-ssl,ENVIRONMENT=GLOG_v=1%20MESOS_VERBOSE=1,OS=centos%3A7,label_exp=(docker%7C%7CHadoop)&&(!ubuntu-us1)&&(!ubuntu-eu2)/3687/display/redirect?page=changes>

Changes:

[xujyan] Use glog to log EXIT() messages.

------------------------------------------
[...truncated 26.42 MB...]
I0517 02:12:02.422335 32189 slave.cpp:6170] Received oversubscribable resources {} from the
resource estimator
I0517 02:12:02.423382 32189 process.cpp:3730] Handling HTTP event for process 'slave(746)'
with path: '/slave(746)/containers'
I0517 02:12:02.423878 32189 http.cpp:1115] HTTP GET for /slave(746)/containers from 172.17.0.3:56094
I0517 02:12:02.423923 32189 http.cpp:936] Authorizing principal 'test-principal' to GET the
'/containers' endpoint
I0517 02:12:02.425199 26698 slave.cpp:794] Agent terminating
[       OK ] Endpoint/SlaveEndpointTest.AuthorizedRequest/2 (22 ms)
[ RUN      ] Endpoint/SlaveEndpointTest.UnauthorizedRequest/0
I0517 02:12:02.438834 26698 containerizer.cpp:221] Using isolation: posix/cpu,posix/mem,filesystem/posix,network/cni
W0517 02:12:02.439221 26698 backend.cpp:76] Failed to create 'aufs' backend: AufsBackend requires
root privileges
W0517 02:12:02.439270 26698 backend.cpp:76] Failed to create 'bind' backend: BindBackend requires
root privileges
I0517 02:12:02.439292 26698 provisioner.cpp:249] Using default backend 'copy'
I0517 02:12:02.440548 32179 slave.cpp:225] Mesos agent started on (747)@172.17.0.3:43897
I0517 02:12:02.440682 32179 slave.cpp:226] Flags at startup: --acls="" --appc_simple_discovery_uri_prefix="http://"
--appc_store_dir="/tmp/mesos/store/appc" --authenticate_http_executors="true" --authenticate_http_readonly="true"
--authenticate_http_readwrite="true" --authenticatee="crammd5" --authentication_backoff_factor="1secs"
--authorizer="local" --cgroups_cpu_enable_pids_and_tids_count="false" --cgroups_enable_cfs="false"
--cgroups_hierarchy="/sys/fs/cgroup" --cgroups_limit_swap="false" --cgroups_root="mesos" --container_disk_watch_interval="15secs"
--containerizers="mesos" --credential="/tmp/Endpoint_SlaveEndpointTest_UnauthorizedRequest_0_muD9dn/credential"
--default_role="*" --disk_watch_interval="1mins" --docker="docker" --docker_kill_orphans="true"
--docker_registry="https://registry-1.docker.io" --docker_remove_delay="6hrs" --docker_socket="/var/run/docker.sock"
--docker_stop_timeout="0ns" --docker_store_dir="/tmp/mesos/store/docker" --docker_volume_checkpoint_dir="/var/run/mesos/isolators/docker/volume"
--enforce_container_disk_quota="false" --executor_registration_timeout="1mins" --executor_secret_key="/tmp/Endpoint_SlaveEndpointTest_UnauthorizedRequest_0_muD9dn/executor_secret_key"
--executor_shutdown_grace_period="5secs" --fetcher_cache_dir="/tmp/Endpoint_SlaveEndpointTest_UnauthorizedRequest_0_muD9dn/fetch"
--fetcher_cache_size="2GB" --frameworks_home="" --gc_delay="1weeks" --gc_disk_headroom="0.1"
--hadoop_home="" --help="false" --hostname_lookup="true" --http_command_executor="false" --http_credentials="/tmp/Endpoint_SlaveEndpointTest_UnauthorizedRequest_0_muD9dn/http_credentials"
--http_heartbeat_interval="30secs" --initialize_driver_logging="true" --isolation="posix/cpu,posix/mem"
--launcher="posix" --launcher_dir="/mesos/build/src" --logbufsecs="0" --logging_level="INFO"
--max_completed_executors_per_framework="150" --oversubscribed_resources_interval="15secs"
--perf_duration="10secs" --perf_interval="1mins" --port="5051" --qos_correction_interval_min="0ns"
--quiet="false" --recover="reconnect" --recovery_timeout="15mins" --registration_backoff_factor="10ms"
--resources="cpus:2;gpus:0;mem:1024;disk:1024;ports:[31000-32000]" --revocable_cpu_low_priority="true"
--runtime_dir="/tmp/Endpoint_SlaveEndpointTest_UnauthorizedRequest_0_muD9dn" --sandbox_directory="/mnt/mesos/sandbox"
--strict="true" --switch_user="true" --systemd_enable_support="true" --systemd_runtime_directory="/run/systemd/system"
--version="false" --work_dir="/tmp/Endpoint_SlaveEndpointTest_UnauthorizedRequest_0_YKqkoe"
I0517 02:12:02.441097 32179 credentials.hpp:86] Loading credential for authentication from
'/tmp/Endpoint_SlaveEndpointTest_UnauthorizedRequest_0_muD9dn/credential'
I0517 02:12:02.441359 32179 slave.cpp:258] Agent using credential for: test-principal
I0517 02:12:02.441495 32179 credentials.hpp:37] Loading credentials for authentication from
'/tmp/Endpoint_SlaveEndpointTest_UnauthorizedRequest_0_muD9dn/http_credentials'
I0517 02:12:02.441855 32179 http.cpp:975] Creating default 'basic' HTTP authenticator for
realm 'mesos-agent-executor'
I0517 02:12:02.442023 32179 http.cpp:996] Creating default 'jwt' HTTP authenticator for realm
'mesos-agent-executor'
I0517 02:12:02.442282 32179 http.cpp:975] Creating default 'basic' HTTP authenticator for
realm 'mesos-agent-readonly'
I0517 02:12:02.442445 32179 http.cpp:996] Creating default 'jwt' HTTP authenticator for realm
'mesos-agent-readonly'
I0517 02:12:02.442685 32179 http.cpp:975] Creating default 'basic' HTTP authenticator for
realm 'mesos-agent-readwrite'
I0517 02:12:02.442845 32179 http.cpp:996] Creating default 'jwt' HTTP authenticator for realm
'mesos-agent-readwrite'
I0517 02:12:02.443631 32179 slave.cpp:529] Agent resources: cpus(*):2; mem(*):1024; disk(*):1024;
ports(*):[31000-32000]
I0517 02:12:02.443806 32179 slave.cpp:537] Agent attributes: [  ]
I0517 02:12:02.443944 32179 slave.cpp:542] Agent hostname: 2d8dd0d42e96
I0517 02:12:02.444172 32176 status_update_manager.cpp:177] Pausing sending status updates
I0517 02:12:02.444821 32187 state.cpp:62] Recovering state from '/tmp/Endpoint_SlaveEndpointTest_UnauthorizedRequest_0_YKqkoe/meta'
I0517 02:12:02.444963 32177 status_update_manager.cpp:203] Recovering status update manager
I0517 02:12:02.445230 32186 containerizer.cpp:608] Recovering containerizer
I0517 02:12:02.445772 32186 provisioner.cpp:410] Provisioner recovery complete
I0517 02:12:02.445948 32182 slave.cpp:5974] Finished recovery
I0517 02:12:02.446455 32182 slave.cpp:6156] Querying resource estimator for oversubscribable
resources
I0517 02:12:02.446657 32182 slave.cpp:6170] Received oversubscribable resources {} from the
resource estimator
I0517 02:12:02.447571 32176 process.cpp:3730] Handling HTTP event for process 'slave(747)'
with path: '/slave(747)/monitor/statistics'
I0517 02:12:02.448101 32176 http.cpp:1115] HTTP GET for /slave(747)/monitor/statistics from
172.17.0.3:56096
I0517 02:12:02.448148 32176 http.cpp:936] Authorizing principal 'test-principal' to GET the
'/monitor/statistics' endpoint
I0517 02:12:02.449391 32176 slave.cpp:794] Agent terminating
[       OK ] Endpoint/SlaveEndpointTest.UnauthorizedRequest/0 (24 ms)
[ RUN      ] Endpoint/SlaveEndpointTest.UnauthorizedRequest/1
I0517 02:12:02.462946 26698 containerizer.cpp:221] Using isolation: posix/cpu,posix/mem,filesystem/posix,network/cni
W0517 02:12:02.463302 26698 backend.cpp:76] Failed to create 'aufs' backend: AufsBackend requires
root privileges
W0517 02:12:02.463347 26698 backend.cpp:76] Failed to create 'bind' backend: BindBackend requires
root privileges
I0517 02:12:02.463366 26698 provisioner.cpp:249] Using default backend 'copy'
I0517 02:12:02.464931 32188 slave.cpp:225] Mesos agent started on (748)@172.17.0.3:43897
I0517 02:12:02.465138 32188 slave.cpp:226] Flags at startup: --acls="" --appc_simple_discovery_uri_prefix="http://"
--appc_store_dir="/tmp/mesos/store/appc" --authenticate_http_executors="true" --authenticate_http_readonly="true"
--authenticate_http_readwrite="true" --authenticatee="crammd5" --authentication_backoff_factor="1secs"
--authorizer="local" --cgroups_cpu_enable_pids_and_tids_count="false" --cgroups_enable_cfs="false"
--cgroups_hierarchy="/sys/fs/cgroup" --cgroups_limit_swap="false" --cgroups_root="mesos" --container_disk_watch_interval="15secs"
--containerizers="mesos" --credential="/tmp/Endpoint_SlaveEndpointTest_UnauthorizedRequest_1_EDAuMW/credential"
--default_role="*" --disk_watch_interval="1mins" --docker="docker" --docker_kill_orphans="true"
--docker_registry="https://registry-1.docker.io" --docker_remove_delay="6hrs" --docker_socket="/var/run/docker.sock"
--docker_stop_timeout="0ns" --docker_store_dir="/tmp/mesos/store/docker" --docker_volume_checkpoint_dir="/var/run/mesos/isolators/docker/volume"
--enforce_container_disk_quota="false" --executor_registration_timeout="1mins" --executor_secret_key="/tmp/Endpoint_SlaveEndpointTest_UnauthorizedRequest_1_EDAuMW/executor_secret_key"
--executor_shutdown_grace_period="5secs" --fetcher_cache_dir="/tmp/Endpoint_SlaveEndpointTest_UnauthorizedRequest_1_EDAuMW/fetch"
--fetcher_cache_size="2GB" --frameworks_home="" --gc_delay="1weeks" --gc_disk_headroom="0.1"
--hadoop_home="" --help="false" --hostname_lookup="true" --http_command_executor="false" --http_credentials="/tmp/Endpoint_SlaveEndpointTest_UnauthorizedRequest_1_EDAuMW/http_credentials"
--http_heartbeat_interval="30secs" --initialize_driver_logging="true" --isolation="posix/cpu,posix/mem"
--launcher="posix" --launcher_dir="/mesos/build/src" --logbufsecs="0" --logging_level="INFO"
--max_completed_executors_per_framework="150" --oversubscribed_resources_interval="15secs"
--perf_duration="10secs" --perf_interval="1mins" --port="5051" --qos_correction_interval_min="0ns"
--quiet="false" --recover="reconnect" --recovery_timeout="15mins" --registration_backoff_factor="10ms"
--resources="cpus:2;gpus:0;mem:1024;disk:1024;ports:[31000-32000]" --revocable_cpu_low_priority="true"
--runtime_dir="/tmp/Endpoint_SlaveEndpointTest_UnauthorizedRequest_1_EDAuMW" --sandbox_directory="/mnt/mesos/sandbox"
--strict="true" --switch_user="true" --systemd_enable_support="true" --systemd_runtime_directory="/run/systemd/system"
--version="false" --work_dir="/tmp/Endpoint_SlaveEndpointTest_UnauthorizedRequest_1_NO4JSN"
I0517 02:12:02.465678 32188 credentials.hpp:86] Loading credential for authentication from
'/tmp/Endpoint_SlaveEndpointTest_UnauthorizedRequest_1_EDAuMW/credential'
I0517 02:12:02.465971 32188 slave.cpp:258] Agent using credential for: test-principal
I0517 02:12:02.466172 32188 credentials.hpp:37] Loading credentials for authentication from
'/tmp/Endpoint_SlaveEndpointTest_UnauthorizedRequest_1_EDAuMW/http_credentials'
I0517 02:12:02.466516 32188 http.cpp:975] Creating default 'basic' HTTP authenticator for
realm 'mesos-agent-executor'
I0517 02:12:02.466734 32188 http.cpp:996] Creating default 'jwt' HTTP authenticator for realm
'mesos-agent-executor'
I0517 02:12:02.467027 32188 http.cpp:975] Creating default 'basic' HTTP authenticator for
realm 'mesos-agent-readonly'
I0517 02:12:02.467239 32188 http.cpp:996] Creating default 'jwt' HTTP authenticator for realm
'mesos-agent-readonly'
I0517 02:12:02.467479 32188 http.cpp:975] Creating default 'basic' HTTP authenticator for
realm 'mesos-agent-readwrite'
I0517 02:12:02.467690 32188 http.cpp:996] Creating default 'jwt' HTTP authenticator for realm
'mesos-agent-readwrite'
I0517 02:12:02.468530 32188 slave.cpp:529] Agent resources: cpus(*):2; mem(*):1024; disk(*):1024;
ports(*):[31000-32000]
I0517 02:12:02.468765 32188 slave.cpp:537] Agent attributes: [  ]
I0517 02:12:02.468940 32188 slave.cpp:542] Agent hostname: 2d8dd0d42e96
I0517 02:12:02.469187 32177 status_update_manager.cpp:177] Pausing sending status updates
I0517 02:12:02.469849 32187 state.cpp:62] Recovering state from '/tmp/Endpoint_SlaveEndpointTest_UnauthorizedRequest_1_NO4JSN/meta'
I0517 02:12:02.470082 32175 status_update_manager.cpp:203] Recovering status update manager
I0517 02:12:02.470191 32182 containerizer.cpp:608] Recovering containerizer
I0517 02:12:02.470612 32182 provisioner.cpp:410] Provisioner recovery complete
I0517 02:12:02.470711 32182 slave.cpp:5974] Finished recovery
I0517 02:12:02.471096 32182 slave.cpp:6156] Querying resource estimator for oversubscribable
resources
I0517 02:12:02.471210 32182 slave.cpp:6170] Received oversubscribable resources {} from the
resource estimator
I0517 02:12:02.472334 32185 process.cpp:3730] Handling HTTP event for process 'slave(748)'
with path: '/slave(748)/monitor/statistics.json'
I0517 02:12:02.472879 32185 http.cpp:1115] HTTP GET for /slave(748)/monitor/statistics.json
from 172.17.0.3:56098
I0517 02:12:02.472923 32185 http.cpp:936] Authorizing principal 'test-principal' to GET the
'/monitor/statistics.json' endpoint
I0517 02:12:02.474534 32190 slave.cpp:794] Agent terminating
[       OK ] Endpoint/SlaveEndpointTest.UnauthorizedRequest/1 (17 ms)
[ RUN      ] Endpoint/SlaveEndpointTest.UnauthorizedRequest/2
I0517 02:12:02.479493 26698 containerizer.cpp:221] Using isolation: posix/cpu,posix/mem,filesystem/posix,network/cni
W0517 02:12:02.479758 26698 backend.cpp:76] Failed to create 'aufs' backend: AufsBackend requires
root privileges
W0517 02:12:02.479790 26698 backend.cpp:76] Failed to create 'bind' backend: BindBackend requires
root privileges
I0517 02:12:02.479802 26698 provisioner.cpp:249] Using default backend 'copy'
I0517 02:12:02.481261 32178 slave.cpp:225] Mesos agent started on (749)@172.17.0.3:43897
I0517 02:12:02.481279 32178 slave.cpp:226] Flags at startup: --acls="" --appc_simple_discovery_uri_prefix="http://"
--appc_store_dir="/tmp/mesos/store/appc" --authenticate_http_executors="true" --authenticate_http_readonly="true"
--authenticate_http_readwrite="true" --authenticatee="crammd5" --authentication_backoff_factor="1secs"
--authorizer="local" --cgroups_cpu_enable_pids_and_tids_count="false" --cgroups_enable_cfs="false"
--cgroups_hierarchy="/sys/fs/cgroup" --cgroups_limit_swap="false" --cgroups_root="mesos" --container_disk_watch_interval="15secs"
--containerizers="mesos" --credential="/tmp/Endpoint_SlaveEndpointTest_UnauthorizedRequest_2_WWKfxw/credential"
--default_role="*" --disk_watch_interval="1mins" --docker="docker" --docker_kill_orphans="true"
--docker_registry="https://registry-1.docker.io" --docker_remove_delay="6hrs" --docker_socket="/var/run/docker.sock"
--docker_stop_timeout="0ns" --docker_store_dir="/tmp/mesos/store/docker" --docker_volume_checkpoint_dir="/var/run/mesos/isolators/docker/volume"
--enforce_container_disk_quota="false" --executor_registration_timeout="1mins" --executor_secret_key="/tmp/Endpoint_SlaveEndpointTest_UnauthorizedRequest_2_WWKfxw/executor_secret_key"
--executor_shutdown_grace_period="5secs" --fetcher_cache_dir="/tmp/Endpoint_SlaveEndpointTest_UnauthorizedRequest_2_WWKfxw/fetch"
--fetcher_cache_size="2GB" --frameworks_home="" --gc_delay="1weeks" --gc_disk_headroom="0.1"
--hadoop_home="" --help="false" --hostname_lookup="true" --http_command_executor="false" --http_credentials="/tmp/Endpoint_SlaveEndpointTest_UnauthorizedRequest_2_WWKfxw/http_credentials"
--http_heartbeat_interval="30secs" --initialize_driver_logging="true" --isolation="posix/cpu,posix/mem"
--launcher="posix" --launcher_dir="/mesos/build/src" --logbufsecs="0" --logging_level="INFO"
--max_completed_executors_per_framework="150" --oversubscribed_resources_interval="15secs"
--perf_duration="10secs" --perf_interval="1mins" --port="5051" --qos_correction_interval_min="0ns"
--quiet="false" --recover="reconnect" --recovery_timeout="15mins" --registration_backoff_factor="10ms"
--resources="cpus:2;gpus:0;mem:1024;disk:1024;ports:[31000-32000]" --revocable_cpu_low_priority="true"
--runtime_dir="/tmp/Endpoint_SlaveEndpointTest_UnauthorizedRequest_2_WWKfxw" --sandbox_directory="/mnt/mesos/sandbox"
--strict="true" --switch_user="true" --systemd_enable_support="true" --systemd_runtime_directory="/run/systemd/system"
--version="false" --work_dir="/tmp/Endpoint_SlaveEndpointTest_UnauthorizedRequest_2_fdMIAn"
I0517 02:12:02.481516 32178 credentials.hpp:86] Loading credential for authentication from
'/tmp/Endpoint_SlaveEndpointTest_UnauthorizedRequest_2_WWKfxw/credential'
I0517 02:12:02.481617 32178 slave.cpp:258] Agent using credential for: test-principal
I0517 02:12:02.481634 32178 credentials.hpp:37] Loading credentials for authentication from
'/tmp/Endpoint_SlaveEndpointTest_UnauthorizedRequest_2_WWKfxw/http_credentials'
I0517 02:12:02.481796 32178 http.cpp:975] Creating default 'basic' HTTP authenticator for
realm 'mesos-agent-executor'
I0517 02:12:02.481837 32178 http.cpp:996] Creating default 'jwt' HTTP authenticator for realm
'mesos-agent-executor'
I0517 02:12:02.481889 32178 http.cpp:975] Creating default 'basic' HTTP authenticator for
realm 'mesos-agent-readonly'
I0517 02:12:02.481916 32178 http.cpp:996] Creating default 'jwt' HTTP authenticator for realm
'mesos-agent-readonly'
I0517 02:12:02.481962 32178 http.cpp:975] Creating default 'basic' HTTP authenticator for
realm 'mesos-agent-readwrite'
I0517 02:12:02.481989 32178 http.cpp:996] Creating default 'jwt' HTTP authenticator for realm
'mesos-agent-readwrite'
I0517 02:12:02.482579 32178 slave.cpp:529] Agent resources: cpus(*):2; mem(*):1024; disk(*):1024;
ports(*):[31000-32000]
I0517 02:12:02.482627 32178 slave.cpp:537] Agent attributes: [  ]
I0517 02:12:02.482636 32178 slave.cpp:542] Agent hostname: 2d8dd0d42e96
I0517 02:12:02.482695 32180 status_update_manager.cpp:177] Pausing sending status updates
I0517 02:12:02.483104 32179 state.cpp:62] Recovering state from '/tmp/Endpoint_SlaveEndpointTest_UnauthorizedRequest_2_fdMIAn/meta'
I0517 02:12:02.483253 32181 status_update_manager.cpp:203] Recovering status update manager
I0517 02:12:02.483320 32181 containerizer.cpp:608] Recovering containerizer
I0517 02:12:02.483805 32190 provisioner.cpp:410] Provisioner recovery complete
I0517 02:12:02.483953 32190 slave.cpp:5974] Finished recovery
I0517 02:12:02.484274 32190 slave.cpp:6156] Querying resource estimator for oversubscribable
resources
I0517 02:12:02.484402 32183 slave.cpp:6170] Received oversubscribable resources {} from the
resource estimator
I0517 02:12:02.485338 32177 process.cpp:3730] Handling HTTP event for process 'slave(749)'
with path: '/slave(749)/containers'
I0517 02:12:02.485749 32177 http.cpp:1115] HTTP GET for /slave(749)/containers from 172.17.0.3:56099
I0517 02:12:02.485782 32177 http.cpp:936] Authorizing principal 'test-principal' to GET the
'/containers' endpoint
I0517 02:12:02.486939 32189 slave.cpp:794] Agent terminating
[       OK ] Endpoint/SlaveEndpointTest.UnauthorizedRequest/2 (12 ms)
[ RUN      ] Endpoint/SlaveEndpointTest.NoAuthorizer/0
I0517 02:12:02.491706 26698 containerizer.cpp:221] Using isolation: posix/cpu,posix/mem,filesystem/posix,network/cni
W0517 02:12:02.491979 26698 backend.cpp:76] Failed to create 'aufs' backend: AufsBackend requires
root privileges
W0517 02:12:02.492015 26698 backend.cpp:76] Failed to create 'bind' backend: BindBackend requires
root privileges
I0517 02:12:02.492027 26698 provisioner.cpp:249] Using default backend 'copy'
I0517 02:12:02.492501 26698 cluster.cpp:448] Creating default 'local' authorizer
I0517 02:12:02.492961 32190 slave.cpp:225] Mesos agent started on (750)@172.17.0.3:43897
I0517 02:12:02.492977 32190 slave.cpp:226] Flags at startup: --acls="" --appc_simple_discovery_uri_prefix="http://"
--appc_store_dir="/tmp/mesos/store/appc" --authenticate_http_executors="true" --authenticate_http_readonly="true"
--authenticate_http_readwrite="true" --authenticatee="crammd5" --authentication_backoff_factor="1secs"
--authorizer="local" --cgroups_cpu_enable_pids_and_tids_count="false" --cgroups_enable_cfs="false"
--cgroups_hierarchy="/sys/fs/cgroup" --cgroups_limit_swap="false" --cgroups_root="mesos" --container_disk_watch_interval="15secs"
--containerizers="mesos" --credential="/tmp/Endpoint_SlaveEndpointTest_NoAuthorizer_0_GnJ2p6/credential"
--default_role="*" --disk_watch_interval="1mins" --docker="docker" --docker_kill_orphans="true"
--docker_registry="https://registry-1.docker.io" --docker_remove_delay="6hrs" --docker_socket="/var/run/docker.sock"
--docker_stop_timeout="0ns" --docker_store_dir="/tmp/mesos/store/docker" --docker_volume_checkpoint_dir="/var/run/mesos/isolators/docker/volume"
--enforce_container_disk_quota="false" --executor_registration_timeout="1mins" --executor_secret_key="/tmp/Endpoint_SlaveEndpointTest_NoAuthorizer_0_GnJ2p6/executor_secret_key"
--executor_shutdown_grace_period="5secs" --fetcher_cache_dir="/tmp/Endpoint_SlaveEndpointTest_NoAuthorizer_0_GnJ2p6/fetch"
--fetcher_cache_size="2GB" --frameworks_home="" --gc_delay="1weeks" --gc_disk_headroom="0.1"
--hadoop_home="" --help="false" --hostname_lookup="true" --http_command_executor="false" --http_credentials="/tmp/Endpoint_SlaveEndpointTest_NoAuthorizer_0_GnJ2p6/http_credentials"
--http_heartbeat_interval="30secs" --initialize_driver_logging="true" --isolation="posix/cpu,posix/mem"
--launcher="posix" --launcher_dir="/mesos/build/src" --logbufsecs="0" --logging_level="INFO"
--max_completed_executors_per_framework="150" --oversubscribed_resources_interval="15secs"
--perf_duration="10secs" --perf_interval="1mins" --port="5051" --qos_correction_interval_min="0ns"
--quiet="false" --recover="reconnect" --recovery_timeout="15mins" --registration_backoff_factor="10ms"
--resources="cpus:2;gpus:0;mem:1024;disk:1024;ports:[31000-32000]" --revocable_cpu_low_priority="true"
--runtime_dir="/tmp/Endpoint_SlaveEndpointTest_NoAuthorizer_0_GnJ2p6" --sandbox_directory="/mnt/mesos/sandbox"
--strict="true" --switch_user="true" --systemd_enable_support="true" --systemd_runtime_directory="/run/systemd/system"
--version="false" --work_dir="/tmp/Endpoint_SlaveEndpointTest_NoAuthorizer_0_9WPxrX"
I0517 02:12:02.493190 32190 credentials.hpp:86] Loading credential for authentication from
'/tmp/Endpoint_SlaveEndpointTest_NoAuthorizer_0_GnJ2p6/credential'
I0517 02:12:02.493260 32190 slave.cpp:258] Agent using credential for: test-principal
I0517 02:12:02.493273 32190 credentials.hpp:37] Loading credentials for authentication from
'/tmp/Endpoint_SlaveEndpointTest_NoAuthorizer_0_GnJ2p6/http_credentials'
I0517 02:12:02.493373 32190 http.cpp:975] Creating default 'basic' HTTP authenticator for
realm 'mesos-agent-executor'
I0517 02:12:02.493412 32190 http.cpp:996] Creating default 'jwt' HTTP authenticator for realm
'mesos-agent-executor'
I0517 02:12:02.493469 32190 http.cpp:975] Creating default 'basic' HTTP authenticator for
realm 'mesos-agent-readonly'
I0517 02:12:02.493501 32190 http.cpp:996] Creating default 'jwt' HTTP authenticator for realm
'mesos-agent-readonly'
I0517 02:12:02.493543 32190 http.cpp:975] Creating default 'basic' HTTP authenticator for
realm 'mesos-agent-readwrite'
I0517 02:12:02.493576 32190 http.cpp:996] Creating default 'jwt' HTTP authenticator for realm
'mesos-agent-readwrite'
I0517 02:12:02.494005 32190 slave.cpp:529] Agent resources: cpus(*):2; mem(*):1024; disk(*):1024;
ports(*):[31000-32000]
I0517 02:12:02.494035 32190 slave.cpp:537] Agent attributes: [  ]
I0517 02:12:02.494040 32190 slave.cpp:542] Agent hostname: 2d8dd0d42e96
I0517 02:12:02.494101 32187 status_update_manager.cpp:177] Pausing sending status updates
I0517 02:12:02.494575 32181 state.cpp:62] Recovering state from '/tmp/Endpoint_SlaveEndpointTest_NoAuthorizer_0_9WPxrX/meta'
I0517 02:12:02.494742 32186 status_update_manager.cpp:203] Recovering status update manager
I0517 02:12:02.494889 32189 containerizer.cpp:608] Recovering containerizer
I0517 02:12:02.495422 32190 provisioner.cpp:410] Provisioner recovery complete
I0517 02:12:02.495620 32187 slave.cpp:5974] Finished recovery
I0517 02:12:02.496109 32187 slave.cpp:6156] Querying resource estimator for oversubscribable
resources
I0517 02:12:02.496279 32187 slave.cpp:6170] Received oversubscribable resources {} from the
resource estimator
I0517 02:12:02.497580 32181 process.cpp:3730] Handling HTTP event for process 'slave(750)'
with path: '/slave(750)/monitor/statistics'
I0517 02:12:02.498109 32181 http.cpp:1115] HTTP GET for /slave(750)/monitor/statistics from
172.17.0.3:56100
I0517 02:12:02.498177 32181 http.cpp:936] Authorizing principal 'test-principal' to GET the
'/monitor/statistics' endpoint
I0517 02:12:02.499560 32187 slave.cpp:794] Agent terminating
[       OK ] Endpoint/SlaveEndpointTest.NoAuthorizer/0 (12 ms)
[ RUN      ] Endpoint/SlaveEndpointTest.NoAuthorizer/1
I0517 02:12:02.504043 26698 containerizer.cpp:221] Using isolation: posix/cpu,posix/mem,filesystem/posix,network/cni
W0517 02:12:02.504283 26698 backend.cpp:76] Failed to create 'aufs' backend: AufsBackend requires
root privileges
W0517 02:12:02.504328 26698 backend.cpp:76] Failed to create 'bind' backend: BindBackend requires
root privileges
I0517 02:12:02.504346 26698 provisioner.cpp:249] Using default backend 'copy'
I0517 02:12:02.504837 26698 cluster.cpp:448] Creating default 'local' authorizer
I0517 02:12:02.505224 32176 slave.cpp:225] Mesos agent started on (751)@172.17.0.3:43897
I0517 02:12:02.505239 32176 slave.cpp:226] Flags at startup: --acls="" --appc_simple_discovery_uri_prefix="http://"
--appc_store_dir="/tmp/mesos/store/appc" --authenticate_http_executors="true" --authenticate_http_readonly="true"
--authenticate_http_readwrite="true" --authenticatee="crammd5" --authentication_backoff_factor="1secs"
--authorizer="local" --cgroups_cpu_enable_pids_and_tids_count="false" --cgroups_enable_cfs="false"
--cgroups_hierarchy="/sys/fs/cgroup" --cgroups_limit_swap="false" --cgroups_root="mesos" --container_disk_watch_interval="15secs"
--containerizers="mesos" --credential="/tmp/Endpoint_SlaveEndpointTest_NoAuthorizer_1_MeeMqG/credential"
--default_role="*" --disk_watch_interval="1mins" --docker="docker" --docker_kill_orphans="true"
--docker_registry="https://registry-1.docker.io" --docker_remove_delay="6hrs" --docker_socket="/var/run/docker.sock"
--docker_stop_timeout="0ns" --docker_store_dir="/tmp/mesos/store/docker" --docker_volume_checkpoint_dir="/var/run/mesos/isolators/docker/volume"
--enforce_container_disk_quota="false" --executor_registration_timeout="1mins" --executor_secret_key="/tmp/Endpoint_SlaveEndpointTest_NoAuthorizer_1_MeeMqG/executor_secret_key"
--executor_shutdown_grace_period="5secs" --fetcher_cache_dir="/tmp/Endpoint_SlaveEndpointTest_NoAuthorizer_1_MeeMqG/fetch"
--fetcher_cache_size="2GB" --frameworks_home="" --gc_delay="1weeks" --gc_disk_headroom="0.1"
--hadoop_home="" --help="false" --hostname_lookup="true" --http_command_executor="false" --http_credentials="/tmp/Endpoint_SlaveEndpointTest_NoAuthorizer_1_MeeMqG/http_credentials"
--http_heartbeat_interval="30secs" --initialize_driver_logging="true" --isolation="posix/cpu,posix/mem"
--launcher="posix" --launcher_dir="/mesos/build/src" --logbufsecs="0" --logging_level="INFO"
--max_completed_executors_per_framework="150" --oversubscribed_resources_interval="15secs"
--perf_duration="10secs" --perf_interval="1mins" --port="5051" --qos_correction_interval_min="0ns"
--quiet="false" --recover="reconnect" --recovery_timeout="15mins" --registration_backoff_factor="10ms"
--resources="cpus:2;gpus:0;mem:1024;disk:1024;ports:[31000-32000]" --revocable_cpu_low_priority="true"
--runtime_dir="/tmp/Endpoint_SlaveEndpointTest_NoAuthorizer_1_MeeMqG" --sandbox_directory="/mnt/mesos/sandbox"
--strict="true" --switch_user="true" --systemd_enable_support="true" --systemd_runtime_directory="/run/systemd/system"
--version="false" --work_dir="/tmp/Endpoint_SlaveEndpointTest_NoAuthorizer_1_Yi0gqx"
I0517 02:12:02.505455 32176 credentials.hpp:86] Loading credential for authentication from
'/tmp/Endpoint_SlaveEndpointTest_NoAuthorizer_1_MeeMqG/credential'
I0517 02:12:02.505545 32176 slave.cpp:258] Agent using credential for: test-principal
I0517 02:12:02.505558 32176 credentials.hpp:37] Loading credentials for authentication from
'/tmp/Endpoint_SlaveEndpointTest_NoAuthorizer_1_MeeMqG/http_credentials'
I0517 02:12:02.505666 32176 http.cpp:975] Creating default 'basic' HTTP authenticator for
realm 'mesos-agent-executor'
I0517 02:12:02.505704 32176 http.cpp:996] Creating default 'jwt' HTTP authenticator for realm
'mesos-agent-executor'
I0517 02:12:02.505776 32176 http.cpp:975] Creating default 'basic' HTTP authenticator for
realm 'mesos-agent-readonly'
I0517 02:12:02.505818 32176 http.cpp:996] Creating default 'jwt' HTTP authenticator for realm
'mesos-agent-readonly'
I0517 02:12:02.505900 32176 http.cpp:975] Creating default 'basic' HTTP authenticator for
realm 'mesos-agent-readwrite'
I0517 02:12:02.505945 32176 http.cpp:996] Creating default 'jwt' HTTP authenticator for realm
'mesos-agent-readwrite'
I0517 02:12:02.506446 32176 slave.cpp:529] Agent resources: cpus(*):2; mem(*):1024; disk(*):1024;
ports(*):[31000-32000]
I0517 02:12:02.506477 32176 slave.cpp:537] Agent attributes: [  ]
I0517 02:12:02.506484 32176 slave.cpp:542] Agent hostname: 2d8dd0d42e96
I0517 02:12:02.506568 32177 status_update_manager.cpp:177] Pausing sending status updates
I0517 02:12:02.506850 32177 state.cpp:62] Recovering state from '/tmp/Endpoint_SlaveEndpointTest_NoAuthorizer_1_Yi0gqx/meta'
I0517 02:12:02.507027 32182 status_update_manager.cpp:203] Recovering status update manager
I0517 02:12:02.507179 32186 containerizer.cpp:608] Recovering containerizer
I0517 02:12:02.507691 32183 provisioner.cpp:410] Provisioner recovery complete
I0517 02:12:02.507941 32185 slave.cpp:5974] Finished recovery
I0517 02:12:02.508281 32185 slave.cpp:6156] Querying resource estimator for oversubscribable
resources
I0517 02:12:02.508342 32185 slave.cpp:6170] Received oversubscribable resources {} from the
resource estimator
I0517 02:12:02.509249 32184 process.cpp:3730] Handling HTTP event for process 'slave(751)'
with path: '/slave(751)/monitor/statistics.json'
I0517 02:12:02.509654 32184 http.cpp:1115] HTTP GET for /slave(751)/monitor/statistics.json
from 172.17.0.3:56102
I0517 02:12:02.509686 32184 http.cpp:936] Authorizing principal 'test-principal' to GET the
'/monitor/statistics.json' endpoint
I0517 02:12:02.510970 32175 slave.cpp:794] Agent terminating
[       OK ] Endpoint/SlaveEndpointTest.NoAuthorizer/1 (12 ms)
[ RUN      ] Endpoint/SlaveEndpointTest.NoAuthorizer/2
I0517 02:12:02.517597 26698 containerizer.cpp:221] Using isolation: posix/cpu,posix/mem,filesystem/posix,network/cni
W0517 02:12:02.517963 26698 backend.cpp:76] Failed to create 'aufs' backend: AufsBackend requires
root privileges
W0517 02:12:02.518008 26698 backend.cpp:76] Failed to create 'bind' backend: BindBackend requires
root privileges
I0517 02:12:02.518028 26698 provisioner.cpp:249] Using default backend 'copy'
I0517 02:12:02.518631 26698 cluster.cpp:448] Creating default 'local' authorizer
I0517 02:12:02.519170 32186 slave.cpp:225] Mesos agent started on (752)@172.17.0.3:43897
I0517 02:12:02.519183 32186 slave.cpp:226] Flags at startup: --acls="" --appc_simple_discovery_uri_prefix="http://"
--appc_store_dir="/tmp/mesos/store/appc" --authenticate_http_executors="true" --authenticate_http_readonly="true"
--authenticate_http_readwrite="true" --authenticatee="crammd5" --authentication_backoff_factor="1secs"
--authorizer="local" --cgroups_cpu_enable_pids_and_tids_count="false" --cgroups_enable_cfs="false"
--cgroups_hierarchy="/sys/fs/cgroup" --cgroups_limit_swap="false" --cgroups_root="mesos" --container_disk_watch_interval="15secs"
--containerizers="mesos" --credential="/tmp/Endpoint_SlaveEndpointTest_NoAuthorizer_2_QWNKzg/credential"
--default_role="*" --disk_watch_interval="1mins" --docker="docker" --docker_kill_orphans="true"
--docker_registry="https://registry-1.docker.io" --docker_remove_delay="6hrs" --docker_socket="/var/run/docker.sock"
--docker_stop_timeout="0ns" --docker_store_dir="/tmp/mesos/store/docker" --docker_volume_checkpoint_dir="/var/run/mesos/isolators/docker/volume"
--enforce_container_disk_quota="false" --executor_registration_timeout="1mins" --executor_secret_key="/tmp/Endpoint_SlaveEndpointTest_NoAuthorizer_2_QWNKzg/executor_secret_key"
--executor_shutdown_grace_period="5secs" --fetcher_cache_dir="/tmp/Endpoint_SlaveEndpointTest_NoAuthorizer_2_QWNKzg/fetch"
--fetcher_cache_size="2GB" --frameworks_home="" --gc_delay="1weeks" --gc_disk_headroom="0.1"
--hadoop_home="" --help="false" --hostname_lookup="true" --http_command_executor="false" --http_credentials="/tmp/Endpoint_SlaveEndpointTest_NoAuthorizer_2_QWNKzg/http_credentials"
--http_heartbeat_interval="30secs" --initialize_driver_logging="true" --isolation="posix/cpu,posix/mem"
--launcher="posix" --launcher_dir="/mesos/build/src" --logbufsecs="0" --logging_level="INFO"
--max_completed_executors_per_framework="150" --oversubscribed_resources_interval="15secs"
--perf_duration="10secs" --perf_interval="1mins" --port="5051" --qos_correction_interval_min="0ns"
--quiet="false" --recover="reconnect" --recovery_timeout="15mins" --registration_backoff_factor="10ms"
--resources="cpus:2;gpus:0;mem:1024;disk:1024;ports:[31000-32000]" --revocable_cpu_low_priority="true"
--runtime_dir="/tmp/Endpoint_SlaveEndpointTest_NoAuthorizer_2_QWNKzg" --sandbox_directory="/mnt/mesos/sandbox"
--strict="true" --switch_user="true" --systemd_enable_support="true" --systemd_runtime_directory="/run/systemd/system"
--version="false" --work_dir="/tmp/Endpoint_SlaveEndpointTest_NoAuthorizer_2_v128w7"
I0517 02:12:02.519378 32186 credentials.hpp:86] Loading credential for authentication from
'/tmp/Endpoint_SlaveEndpointTest_NoAuthorizer_2_QWNKzg/credential'
I0517 02:12:02.519457 32186 slave.cpp:258] Agent using credential for: test-principal
I0517 02:12:02.519470 32186 credentials.hpp:37] Loading credentials for authentication from
'/tmp/Endpoint_SlaveEndpointTest_NoAuthorizer_2_QWNKzg/http_credentials'
I0517 02:12:02.519611 32186 http.cpp:975] Creating default 'basic' HTTP authenticator for
realm 'mesos-agent-executor'
I0517 02:12:02.519644 32186 http.cpp:996] Creating default 'jwt' HTTP authenticator for realm
'mesos-agent-executor'
I0517 02:12:02.519709 32186 http.cpp:975] Creating default 'basic' HTTP authenticator for
realm 'mesos-agent-readonly'
I0517 02:12:02.519743 32186 http.cpp:996] Creating default 'jwt' HTTP authenticator for realm
'mesos-agent-readonly'
I0517 02:12:02.519803 32186 http.cpp:975] Creating default 'basic' HTTP authenticator for
realm 'mesos-agent-readwrite'
I0517 02:12:02.519835 32186 http.cpp:996] Creating default 'jwt' HTTP authenticator for realm
'mesos-agent-readwrite'
I0517 02:12:02.520246 32186 slave.cpp:529] Agent resources: cpus(*):2; mem(*):1024; disk(*):1024;
ports(*):[31000-32000]
I0517 02:12:02.520282 32186 slave.cpp:537] Agent attributes: [  ]
I0517 02:12:02.520287 32186 slave.cpp:542] Agent hostname: 2d8dd0d42e96
I0517 02:12:02.520367 32176 status_update_manager.cpp:177] Pausing sending status updates
I0517 02:12:02.520648 32188 state.cpp:62] Recovering state from '/tmp/Endpoint_SlaveEndpointTest_NoAuthorizer_2_v128w7/meta'
I0517 02:12:02.520843 32179 status_update_manager.cpp:203] Recovering status update manager
I0517 02:12:02.520912 32177 containerizer.cpp:608] Recovering containerizer
I0517 02:12:02.521453 32175 provisioner.cpp:410] Provisioner recovery complete
I0517 02:12:02.521590 32180 slave.cpp:5974] Finished recovery
I0517 02:12:02.522007 32180 slave.cpp:6156] Querying resource estimator for oversubscribable
resources
I0517 02:12:02.522194 32189 slave.cpp:6170] Received oversubscribable resources {} from the
resource estimator
I0517 02:12:02.523072 32184 process.cpp:3730] Handling HTTP event for process 'slave(752)'
with path: '/slave(752)/containers'
I0517 02:12:02.523582 32186 http.cpp:1115] HTTP GET for /slave(752)/containers from 172.17.0.3:56103
I0517 02:12:02.523629 32186 http.cpp:936] Authorizing principal 'test-principal' to GET the
'/containers' endpoint
I0517 02:12:02.525224 32179 slave.cpp:794] Agent terminating
[       OK ] Endpoint/SlaveEndpointTest.NoAuthorizer/2 (13 ms)
[----------] 9 tests from Endpoint/SlaveEndpointTest (144 ms total)

[----------] Global test environment tear-down
[==========] 1526 tests from 168 test cases ran. (221294 ms total)
[  PASSED  ] 1525 tests.
[  FAILED  ] 1 test, listed below:
[  FAILED  ] ContentType/AgentAPIStreamingTest.AttachInputToNestedContainerSession/1, where
GetParam() = application/json

 1 FAILED TEST
  YOU HAVE 22 DISABLED TESTS

E0517 02:12:02.573009 32191 process.cpp:950] Failed to accept socket: future discarded
make[3]: *** [CMakeFiles/check] Error 1
make[3]: Leaving directory `/mesos/build'
make[2]: *** [CMakeFiles/check.dir/all] Error 2
make[2]: Leaving directory `/mesos/build'
make[1]: *** [CMakeFiles/check.dir/rule] Error 2
make[1]: Leaving directory `/mesos/build'
make: *** [check] Error 2
+ docker rmi mesos-1494983716-31633
Untagged: mesos-1494983716-31633:latest
Deleted: sha256:c279b5ee38e131f306e4b112045df44d59ef36d00c1b2763128a7861f825b5a3
Deleted: sha256:dd6c06f0124874ec69f39d7595eb7c2bcb88c0eedab6ca4bcf5110779cc03b30
Deleted: sha256:f206fb6ae5ec58b58c24371049916a15adc45166810a726c30f1be6ebce84b73
Deleted: sha256:6175d1981757ac96b99eb0fbe04ebf7f944b3d1ab92040006b2640375de0649f
Deleted: sha256:611f26d1f7c60b0da54ac9961a593090660c26b24c3fab2fee45c4ea96588553
Deleted: sha256:8898cf6c73e9c915285a26cc719cc3c8740f2002e4103c51fd329db397e30892
Deleted: sha256:775340d20466cce23b74b6b603ccca8010588522116d8d874cf2a8d39fb54e35
Deleted: sha256:e5413665eb8b7be496751241d9bf8b0d304d92d3fd1d93b7edad9782b7994851
Deleted: sha256:c93f8111c59fa36348e62377e2e9d62c49503410ee97626bfa4fb86ac7701702
Deleted: sha256:d2681673572069a13d7bbe493523a0473d75688249e4fe35379d3ec11f855d28
Deleted: sha256:5a926966588228dafceb683da33c5f12203c3c7196ea2b12460c62df143679c1
Deleted: sha256:300791bdf4665ff5d7b60266295d9bb76586280c7921c62445597085ca681796
Deleted: sha256:b9e01ddb3f0f9f27234ae01494b70191fcfd664b70af71aea723c3c1ff459121
Deleted: sha256:d0188931af64e7210e3c1614d6bf916dc0afc6b2765263a3f46cee71cf7cb351
Deleted: sha256:c85f56b85caef9765093548db95292383425e3ae87023bae1ff5f5f2bf28c8ed
Deleted: sha256:32fe4ddb299e6b6eb3f72fbb46d4efc99d03a881c3bf1f7c98887590a70c5863
Deleted: sha256:76ace7315044c8d1be4e9a53ef66580da93c6453a3c8311cd359943060f03c53
Deleted: sha256:76787c83796516532942c290fc682fe9a4bc0e8eac19c752e4bf982948245cf0
Deleted: sha256:253913c08600c88f391af64904740a870b6a38ed6db5af6ec0762d6af73a9f2c
Deleted: sha256:f1225e00709f98865d1b2c8c65697ce52a0ad8f5d6e904720da7a599a26068a8
Deleted: sha256:9fcf4a82b0a26d6463e4158163110911f7de2b726a634a41bd48602b5954ddf1
Deleted: sha256:00125ee2e1463533c738e196b870866998ca3996fa3c4e3dda9a67a90705b76f
Deleted: sha256:c3766921b55321489a46216ff7566fe58d55ea73d4a73fe802b38fb979632a07
Deleted: sha256:b37a6cd6a516e421ea2bfbc4209ffe0fb4f5fda862b5b31bc6258111bbc7de42
Deleted: sha256:1fb5c853ecca620d675b5fc32979c086534a4be695fe9c8ee5014c276e304046
Build step 'Execute shell' marked build as failure
Not sending mail to unregistered user xujyan@apple.com

Mime
View raw message