mesos-builds mailing list archives

Site index · List index
Message view « Date » · « Thread »
Top « Date » · « Thread »
From Apache Jenkins Server <jenk...@builds.apache.org>
Subject Build failed in Jenkins: Mesos-Buildbot » cmake,gcc,--verbose --enable-libevent --enable-ssl,GLOG_v=1 MESOS_VERBOSE=1,centos:7,(docker||Hadoop)&&(!ubuntu-us1)&&(!ubuntu-eu2) #3705
Date Mon, 22 May 2017 19:53:16 GMT
See <https://builds.apache.org/job/Mesos-Buildbot/BUILDTOOL=cmake,COMPILER=gcc,CONFIGURATION=--verbose%20--enable-libevent%20--enable-ssl,ENVIRONMENT=GLOG_v=1%20MESOS_VERBOSE=1,OS=centos%3A7,label_exp=(docker%7C%7CHadoop)&&(!ubuntu-us1)&&(!ubuntu-eu2)/3705/display/redirect?page=changes>

Changes:

[yujie.jay] Update contributors.yaml for Chun-Hung Hsiao.

------------------------------------------
[...truncated 26.75 MB...]
I0522 19:53:05.370764 32195 slave.cpp:6170] Received oversubscribable resources {} from the
resource estimator
I0522 19:53:05.371318 32202 process.cpp:3730] Handling HTTP event for process 'slave(746)'
with path: '/slave(746)/containers'
I0522 19:53:05.371773 32190 http.cpp:1115] HTTP GET for /slave(746)/containers from 172.17.0.3:34296
I0522 19:53:05.371809 32190 http.cpp:936] Authorizing principal 'test-principal' to GET the
'/containers' endpoint
I0522 19:53:05.375844 26710 slave.cpp:794] Agent terminating
[       OK ] Endpoint/SlaveEndpointTest.AuthorizedRequest/2 (13 ms)
[ RUN      ] Endpoint/SlaveEndpointTest.UnauthorizedRequest/0
I0522 19:53:05.381714 26710 containerizer.cpp:221] Using isolation: posix/cpu,posix/mem,filesystem/posix,network/cni
W0522 19:53:05.382060 26710 backend.cpp:76] Failed to create 'aufs' backend: AufsBackend requires
root privileges
W0522 19:53:05.382293 26710 backend.cpp:76] Failed to create 'bind' backend: BindBackend requires
root privileges
I0522 19:53:05.382416 26710 provisioner.cpp:249] Using default backend 'copy'
I0522 19:53:05.383781 32199 slave.cpp:225] Mesos agent started on (747)@172.17.0.3:49860
I0522 19:53:05.383800 32199 slave.cpp:226] Flags at startup: --acls="" --appc_simple_discovery_uri_prefix="http://"
--appc_store_dir="/tmp/mesos/store/appc" --authenticate_http_executors="true" --authenticate_http_readonly="true"
--authenticate_http_readwrite="true" --authenticatee="crammd5" --authentication_backoff_factor="1secs"
--authorizer="local" --cgroups_cpu_enable_pids_and_tids_count="false" --cgroups_enable_cfs="false"
--cgroups_hierarchy="/sys/fs/cgroup" --cgroups_limit_swap="false" --cgroups_root="mesos" --container_disk_watch_interval="15secs"
--containerizers="mesos" --credential="/tmp/Endpoint_SlaveEndpointTest_UnauthorizedRequest_0_KiQaPB/credential"
--default_role="*" --disk_watch_interval="1mins" --docker="docker" --docker_kill_orphans="true"
--docker_registry="https://registry-1.docker.io" --docker_remove_delay="6hrs" --docker_socket="/var/run/docker.sock"
--docker_stop_timeout="0ns" --docker_store_dir="/tmp/mesos/store/docker" --docker_volume_checkpoint_dir="/var/run/mesos/isolators/docker/volume"
--enforce_container_disk_quota="false" --executor_registration_timeout="1mins" --executor_secret_key="/tmp/Endpoint_SlaveEndpointTest_UnauthorizedRequest_0_KiQaPB/executor_secret_key"
--executor_shutdown_grace_period="5secs" --fetcher_cache_dir="/tmp/Endpoint_SlaveEndpointTest_UnauthorizedRequest_0_KiQaPB/fetch"
--fetcher_cache_size="2GB" --frameworks_home="" --gc_delay="1weeks" --gc_disk_headroom="0.1"
--hadoop_home="" --help="false" --hostname_lookup="true" --http_command_executor="false" --http_credentials="/tmp/Endpoint_SlaveEndpointTest_UnauthorizedRequest_0_KiQaPB/http_credentials"
--http_heartbeat_interval="30secs" --initialize_driver_logging="true" --isolation="posix/cpu,posix/mem"
--launcher="posix" --launcher_dir="/mesos/build/src" --logbufsecs="0" --logging_level="INFO"
--max_completed_executors_per_framework="150" --oversubscribed_resources_interval="15secs"
--perf_duration="10secs" --perf_interval="1mins" --port="5051" --qos_correction_interval_min="0ns"
--quiet="false" --recover="reconnect" --recovery_timeout="15mins" --registration_backoff_factor="10ms"
--resources="cpus:2;gpus:0;mem:1024;disk:1024;ports:[31000-32000]" --revocable_cpu_low_priority="true"
--runtime_dir="/tmp/Endpoint_SlaveEndpointTest_UnauthorizedRequest_0_KiQaPB" --sandbox_directory="/mnt/mesos/sandbox"
--strict="true" --switch_user="true" --systemd_enable_support="true" --systemd_runtime_directory="/run/systemd/system"
--version="false" --work_dir="/tmp/Endpoint_SlaveEndpointTest_UnauthorizedRequest_0_lJ3RBV"
I0522 19:53:05.384055 32199 credentials.hpp:86] Loading credential for authentication from
'/tmp/Endpoint_SlaveEndpointTest_UnauthorizedRequest_0_KiQaPB/credential'
I0522 19:53:05.384161 32199 slave.cpp:258] Agent using credential for: test-principal
I0522 19:53:05.384181 32199 credentials.hpp:37] Loading credentials for authentication from
'/tmp/Endpoint_SlaveEndpointTest_UnauthorizedRequest_0_KiQaPB/http_credentials'
I0522 19:53:05.384341 32199 http.cpp:975] Creating default 'basic' HTTP authenticator for
realm 'mesos-agent-executor'
I0522 19:53:05.384378 32199 http.cpp:996] Creating default 'jwt' HTTP authenticator for realm
'mesos-agent-executor'
I0522 19:53:05.384483 32199 http.cpp:975] Creating default 'basic' HTTP authenticator for
realm 'mesos-agent-readonly'
I0522 19:53:05.384521 32199 http.cpp:996] Creating default 'jwt' HTTP authenticator for realm
'mesos-agent-readonly'
I0522 19:53:05.384598 32199 http.cpp:975] Creating default 'basic' HTTP authenticator for
realm 'mesos-agent-readwrite'
I0522 19:53:05.384639 32199 http.cpp:996] Creating default 'jwt' HTTP authenticator for realm
'mesos-agent-readwrite'
I0522 19:53:05.385118 32199 slave.cpp:529] Agent resources: cpus(*):2; mem(*):1024; disk(*):1024;
ports(*):[31000-32000]
I0522 19:53:05.385149 32199 slave.cpp:537] Agent attributes: [  ]
I0522 19:53:05.385155 32199 slave.cpp:542] Agent hostname: 39d80456b9ea
I0522 19:53:05.385226 32192 status_update_manager.cpp:177] Pausing sending status updates
I0522 19:53:05.385496 32192 state.cpp:62] Recovering state from '/tmp/Endpoint_SlaveEndpointTest_UnauthorizedRequest_0_lJ3RBV/meta'
I0522 19:53:05.385689 32191 status_update_manager.cpp:203] Recovering status update manager
I0522 19:53:05.385784 32195 containerizer.cpp:608] Recovering containerizer
I0522 19:53:05.386459 32198 provisioner.cpp:410] Provisioner recovery complete
I0522 19:53:05.386721 32204 slave.cpp:5974] Finished recovery
I0522 19:53:05.387229 32204 slave.cpp:6156] Querying resource estimator for oversubscribable
resources
I0522 19:53:05.387362 32201 slave.cpp:6170] Received oversubscribable resources {} from the
resource estimator
I0522 19:53:05.388453 32197 process.cpp:3730] Handling HTTP event for process 'slave(747)'
with path: '/slave(747)/monitor/statistics'
I0522 19:53:05.389215 32193 http.cpp:1115] HTTP GET for /slave(747)/monitor/statistics from
172.17.0.3:34297
I0522 19:53:05.389292 32193 http.cpp:936] Authorizing principal 'test-principal' to GET the
'/monitor/statistics' endpoint
I0522 19:53:05.391055 26710 slave.cpp:794] Agent terminating
[       OK ] Endpoint/SlaveEndpointTest.UnauthorizedRequest/0 (21 ms)
[ RUN      ] Endpoint/SlaveEndpointTest.UnauthorizedRequest/1
I0522 19:53:05.403142 26710 containerizer.cpp:221] Using isolation: posix/cpu,posix/mem,filesystem/posix,network/cni
W0522 19:53:05.403563 26710 backend.cpp:76] Failed to create 'aufs' backend: AufsBackend requires
root privileges
W0522 19:53:05.403611 26710 backend.cpp:76] Failed to create 'bind' backend: BindBackend requires
root privileges
I0522 19:53:05.403633 26710 provisioner.cpp:249] Using default backend 'copy'
I0522 19:53:05.404690 32203 slave.cpp:225] Mesos agent started on (748)@172.17.0.3:49860
I0522 19:53:05.404712 32203 slave.cpp:226] Flags at startup: --acls="" --appc_simple_discovery_uri_prefix="http://"
--appc_store_dir="/tmp/mesos/store/appc" --authenticate_http_executors="true" --authenticate_http_readonly="true"
--authenticate_http_readwrite="true" --authenticatee="crammd5" --authentication_backoff_factor="1secs"
--authorizer="local" --cgroups_cpu_enable_pids_and_tids_count="false" --cgroups_enable_cfs="false"
--cgroups_hierarchy="/sys/fs/cgroup" --cgroups_limit_swap="false" --cgroups_root="mesos" --container_disk_watch_interval="15secs"
--containerizers="mesos" --credential="/tmp/Endpoint_SlaveEndpointTest_UnauthorizedRequest_1_IbeIRk/credential"
--default_role="*" --disk_watch_interval="1mins" --docker="docker" --docker_kill_orphans="true"
--docker_registry="https://registry-1.docker.io" --docker_remove_delay="6hrs" --docker_socket="/var/run/docker.sock"
--docker_stop_timeout="0ns" --docker_store_dir="/tmp/mesos/store/docker" --docker_volume_checkpoint_dir="/var/run/mesos/isolators/docker/volume"
--enforce_container_disk_quota="false" --executor_registration_timeout="1mins" --executor_secret_key="/tmp/Endpoint_SlaveEndpointTest_UnauthorizedRequest_1_IbeIRk/executor_secret_key"
--executor_shutdown_grace_period="5secs" --fetcher_cache_dir="/tmp/Endpoint_SlaveEndpointTest_UnauthorizedRequest_1_IbeIRk/fetch"
--fetcher_cache_size="2GB" --frameworks_home="" --gc_delay="1weeks" --gc_disk_headroom="0.1"
--hadoop_home="" --help="false" --hostname_lookup="true" --http_command_executor="false" --http_credentials="/tmp/Endpoint_SlaveEndpointTest_UnauthorizedRequest_1_IbeIRk/http_credentials"
--http_heartbeat_interval="30secs" --initialize_driver_logging="true" --isolation="posix/cpu,posix/mem"
--launcher="posix" --launcher_dir="/mesos/build/src" --logbufsecs="0" --logging_level="INFO"
--max_completed_executors_per_framework="150" --oversubscribed_resources_interval="15secs"
--perf_duration="10secs" --perf_interval="1mins" --port="5051" --qos_correction_interval_min="0ns"
--quiet="false" --recover="reconnect" --recovery_timeout="15mins" --registration_backoff_factor="10ms"
--resources="cpus:2;gpus:0;mem:1024;disk:1024;ports:[31000-32000]" --revocable_cpu_low_priority="true"
--runtime_dir="/tmp/Endpoint_SlaveEndpointTest_UnauthorizedRequest_1_IbeIRk" --sandbox_directory="/mnt/mesos/sandbox"
--strict="true" --switch_user="true" --systemd_enable_support="true" --systemd_runtime_directory="/run/systemd/system"
--version="false" --work_dir="/tmp/Endpoint_SlaveEndpointTest_UnauthorizedRequest_1_YD8WAE"
I0522 19:53:05.404970 32203 credentials.hpp:86] Loading credential for authentication from
'/tmp/Endpoint_SlaveEndpointTest_UnauthorizedRequest_1_IbeIRk/credential'
I0522 19:53:05.405067 32203 slave.cpp:258] Agent using credential for: test-principal
I0522 19:53:05.405082 32203 credentials.hpp:37] Loading credentials for authentication from
'/tmp/Endpoint_SlaveEndpointTest_UnauthorizedRequest_1_IbeIRk/http_credentials'
I0522 19:53:05.405277 32203 http.cpp:975] Creating default 'basic' HTTP authenticator for
realm 'mesos-agent-executor'
I0522 19:53:05.405333 32203 http.cpp:996] Creating default 'jwt' HTTP authenticator for realm
'mesos-agent-executor'
I0522 19:53:05.405400 32203 http.cpp:975] Creating default 'basic' HTTP authenticator for
realm 'mesos-agent-readonly'
I0522 19:53:05.405441 32203 http.cpp:996] Creating default 'jwt' HTTP authenticator for realm
'mesos-agent-readonly'
I0522 19:53:05.405516 32203 http.cpp:975] Creating default 'basic' HTTP authenticator for
realm 'mesos-agent-readwrite'
I0522 19:53:05.405565 32203 http.cpp:996] Creating default 'jwt' HTTP authenticator for realm
'mesos-agent-readwrite'
I0522 19:53:05.406035 32203 slave.cpp:529] Agent resources: cpus(*):2; mem(*):1024; disk(*):1024;
ports(*):[31000-32000]
I0522 19:53:05.406074 32203 slave.cpp:537] Agent attributes: [  ]
I0522 19:53:05.406080 32203 slave.cpp:542] Agent hostname: 39d80456b9ea
I0522 19:53:05.406167 32195 status_update_manager.cpp:177] Pausing sending status updates
I0522 19:53:05.406507 32196 state.cpp:62] Recovering state from '/tmp/Endpoint_SlaveEndpointTest_UnauthorizedRequest_1_YD8WAE/meta'
I0522 19:53:05.406716 32197 status_update_manager.cpp:203] Recovering status update manager
I0522 19:53:05.406888 32199 containerizer.cpp:608] Recovering containerizer
I0522 19:53:05.407328 32199 provisioner.cpp:410] Provisioner recovery complete
I0522 19:53:05.407441 32199 slave.cpp:5974] Finished recovery
I0522 19:53:05.407759 32199 slave.cpp:6156] Querying resource estimator for oversubscribable
resources
I0522 19:53:05.407878 32199 slave.cpp:6170] Received oversubscribable resources {} from the
resource estimator
I0522 19:53:05.408865 32196 process.cpp:3730] Handling HTTP event for process 'slave(748)'
with path: '/slave(748)/monitor/statistics.json'
I0522 19:53:05.409608 32205 http.cpp:1115] HTTP GET for /slave(748)/monitor/statistics.json
from 172.17.0.3:34298
I0522 19:53:05.409654 32205 http.cpp:936] Authorizing principal 'test-principal' to GET the
'/monitor/statistics.json' endpoint
I0522 19:53:05.410786 26710 slave.cpp:794] Agent terminating
[       OK ] Endpoint/SlaveEndpointTest.UnauthorizedRequest/1 (13 ms)
[ RUN      ] Endpoint/SlaveEndpointTest.UnauthorizedRequest/2
I0522 19:53:05.415966 26710 containerizer.cpp:221] Using isolation: posix/cpu,posix/mem,filesystem/posix,network/cni
W0522 19:53:05.416275 26710 backend.cpp:76] Failed to create 'aufs' backend: AufsBackend requires
root privileges
W0522 19:53:05.416308 26710 backend.cpp:76] Failed to create 'bind' backend: BindBackend requires
root privileges
I0522 19:53:05.416326 26710 provisioner.cpp:249] Using default backend 'copy'
I0522 19:53:05.417232 32202 slave.cpp:225] Mesos agent started on (749)@172.17.0.3:49860
I0522 19:53:05.417246 32202 slave.cpp:226] Flags at startup: --acls="" --appc_simple_discovery_uri_prefix="http://"
--appc_store_dir="/tmp/mesos/store/appc" --authenticate_http_executors="true" --authenticate_http_readonly="true"
--authenticate_http_readwrite="true" --authenticatee="crammd5" --authentication_backoff_factor="1secs"
--authorizer="local" --cgroups_cpu_enable_pids_and_tids_count="false" --cgroups_enable_cfs="false"
--cgroups_hierarchy="/sys/fs/cgroup" --cgroups_limit_swap="false" --cgroups_root="mesos" --container_disk_watch_interval="15secs"
--containerizers="mesos" --credential="/tmp/Endpoint_SlaveEndpointTest_UnauthorizedRequest_2_UNL933/credential"
--default_role="*" --disk_watch_interval="1mins" --docker="docker" --docker_kill_orphans="true"
--docker_registry="https://registry-1.docker.io" --docker_remove_delay="6hrs" --docker_socket="/var/run/docker.sock"
--docker_stop_timeout="0ns" --docker_store_dir="/tmp/mesos/store/docker" --docker_volume_checkpoint_dir="/var/run/mesos/isolators/docker/volume"
--enforce_container_disk_quota="false" --executor_registration_timeout="1mins" --executor_secret_key="/tmp/Endpoint_SlaveEndpointTest_UnauthorizedRequest_2_UNL933/executor_secret_key"
--executor_shutdown_grace_period="5secs" --fetcher_cache_dir="/tmp/Endpoint_SlaveEndpointTest_UnauthorizedRequest_2_UNL933/fetch"
--fetcher_cache_size="2GB" --frameworks_home="" --gc_delay="1weeks" --gc_disk_headroom="0.1"
--hadoop_home="" --help="false" --hostname_lookup="true" --http_command_executor="false" --http_credentials="/tmp/Endpoint_SlaveEndpointTest_UnauthorizedRequest_2_UNL933/http_credentials"
--http_heartbeat_interval="30secs" --initialize_driver_logging="true" --isolation="posix/cpu,posix/mem"
--launcher="posix" --launcher_dir="/mesos/build/src" --logbufsecs="0" --logging_level="INFO"
--max_completed_executors_per_framework="150" --oversubscribed_resources_interval="15secs"
--perf_duration="10secs" --perf_interval="1mins" --port="5051" --qos_correction_interval_min="0ns"
--quiet="false" --recover="reconnect" --recovery_timeout="15mins" --registration_backoff_factor="10ms"
--resources="cpus:2;gpus:0;mem:1024;disk:1024;ports:[31000-32000]" --revocable_cpu_low_priority="true"
--runtime_dir="/tmp/Endpoint_SlaveEndpointTest_UnauthorizedRequest_2_UNL933" --sandbox_directory="/mnt/mesos/sandbox"
--strict="true" --switch_user="true" --systemd_enable_support="true" --systemd_runtime_directory="/run/systemd/system"
--version="false" --work_dir="/tmp/Endpoint_SlaveEndpointTest_UnauthorizedRequest_2_4hcdLn"
I0522 19:53:05.417495 32202 credentials.hpp:86] Loading credential for authentication from
'/tmp/Endpoint_SlaveEndpointTest_UnauthorizedRequest_2_UNL933/credential'
I0522 19:53:05.417579 32202 slave.cpp:258] Agent using credential for: test-principal
I0522 19:53:05.417593 32202 credentials.hpp:37] Loading credentials for authentication from
'/tmp/Endpoint_SlaveEndpointTest_UnauthorizedRequest_2_UNL933/http_credentials'
I0522 19:53:05.417734 32202 http.cpp:975] Creating default 'basic' HTTP authenticator for
realm 'mesos-agent-executor'
I0522 19:53:05.417775 32202 http.cpp:996] Creating default 'jwt' HTTP authenticator for realm
'mesos-agent-executor'
I0522 19:53:05.417860 32202 http.cpp:975] Creating default 'basic' HTTP authenticator for
realm 'mesos-agent-readonly'
I0522 19:53:05.417901 32202 http.cpp:996] Creating default 'jwt' HTTP authenticator for realm
'mesos-agent-readonly'
I0522 19:53:05.417984 32202 http.cpp:975] Creating default 'basic' HTTP authenticator for
realm 'mesos-agent-readwrite'
I0522 19:53:05.418023 32202 http.cpp:996] Creating default 'jwt' HTTP authenticator for realm
'mesos-agent-readwrite'
I0522 19:53:05.418431 32202 slave.cpp:529] Agent resources: cpus(*):2; mem(*):1024; disk(*):1024;
ports(*):[31000-32000]
I0522 19:53:05.418475 32202 slave.cpp:537] Agent attributes: [  ]
I0522 19:53:05.418485 32202 slave.cpp:542] Agent hostname: 39d80456b9ea
I0522 19:53:05.418584 32190 status_update_manager.cpp:177] Pausing sending status updates
I0522 19:53:05.418833 32205 state.cpp:62] Recovering state from '/tmp/Endpoint_SlaveEndpointTest_UnauthorizedRequest_2_4hcdLn/meta'
I0522 19:53:05.418982 32192 status_update_manager.cpp:203] Recovering status update manager
I0522 19:53:05.419085 32195 containerizer.cpp:608] Recovering containerizer
I0522 19:53:05.419684 32194 provisioner.cpp:410] Provisioner recovery complete
I0522 19:53:05.419873 32191 slave.cpp:5974] Finished recovery
I0522 19:53:05.420240 32191 slave.cpp:6156] Querying resource estimator for oversubscribable
resources
I0522 19:53:05.420403 32201 slave.cpp:6170] Received oversubscribable resources {} from the
resource estimator
I0522 19:53:05.421197 32194 process.cpp:3730] Handling HTTP event for process 'slave(749)'
with path: '/slave(749)/containers'
I0522 19:53:05.421710 32205 http.cpp:1115] HTTP GET for /slave(749)/containers from 172.17.0.3:34300
I0522 19:53:05.421761 32205 http.cpp:936] Authorizing principal 'test-principal' to GET the
'/containers' endpoint
I0522 19:53:05.434347 32191 slave.cpp:794] Agent terminating
[       OK ] Endpoint/SlaveEndpointTest.UnauthorizedRequest/2 (29 ms)
[ RUN      ] Endpoint/SlaveEndpointTest.NoAuthorizer/0
I0522 19:53:05.445011 26710 containerizer.cpp:221] Using isolation: posix/cpu,posix/mem,filesystem/posix,network/cni
W0522 19:53:05.445307 26710 backend.cpp:76] Failed to create 'aufs' backend: AufsBackend requires
root privileges
W0522 19:53:05.445350 26710 backend.cpp:76] Failed to create 'bind' backend: BindBackend requires
root privileges
I0522 19:53:05.445372 26710 provisioner.cpp:249] Using default backend 'copy'
I0522 19:53:05.445894 26710 cluster.cpp:448] Creating default 'local' authorizer
I0522 19:53:05.446424 32198 slave.cpp:225] Mesos agent started on (750)@172.17.0.3:49860
I0522 19:53:05.446441 32198 slave.cpp:226] Flags at startup: --acls="" --appc_simple_discovery_uri_prefix="http://"
--appc_store_dir="/tmp/mesos/store/appc" --authenticate_http_executors="true" --authenticate_http_readonly="true"
--authenticate_http_readwrite="true" --authenticatee="crammd5" --authentication_backoff_factor="1secs"
--authorizer="local" --cgroups_cpu_enable_pids_and_tids_count="false" --cgroups_enable_cfs="false"
--cgroups_hierarchy="/sys/fs/cgroup" --cgroups_limit_swap="false" --cgroups_root="mesos" --container_disk_watch_interval="15secs"
--containerizers="mesos" --credential="/tmp/Endpoint_SlaveEndpointTest_NoAuthorizer_0_qsYJwN/credential"
--default_role="*" --disk_watch_interval="1mins" --docker="docker" --docker_kill_orphans="true"
--docker_registry="https://registry-1.docker.io" --docker_remove_delay="6hrs" --docker_socket="/var/run/docker.sock"
--docker_stop_timeout="0ns" --docker_store_dir="/tmp/mesos/store/docker" --docker_volume_checkpoint_dir="/var/run/mesos/isolators/docker/volume"
--enforce_container_disk_quota="false" --executor_registration_timeout="1mins" --executor_secret_key="/tmp/Endpoint_SlaveEndpointTest_NoAuthorizer_0_qsYJwN/executor_secret_key"
--executor_shutdown_grace_period="5secs" --fetcher_cache_dir="/tmp/Endpoint_SlaveEndpointTest_NoAuthorizer_0_qsYJwN/fetch"
--fetcher_cache_size="2GB" --frameworks_home="" --gc_delay="1weeks" --gc_disk_headroom="0.1"
--hadoop_home="" --help="false" --hostname_lookup="true" --http_command_executor="false" --http_credentials="/tmp/Endpoint_SlaveEndpointTest_NoAuthorizer_0_qsYJwN/http_credentials"
--http_heartbeat_interval="30secs" --initialize_driver_logging="true" --isolation="posix/cpu,posix/mem"
--launcher="posix" --launcher_dir="/mesos/build/src" --logbufsecs="0" --logging_level="INFO"
--max_completed_executors_per_framework="150" --oversubscribed_resources_interval="15secs"
--perf_duration="10secs" --perf_interval="1mins" --port="5051" --qos_correction_interval_min="0ns"
--quiet="false" --recover="reconnect" --recovery_timeout="15mins" --registration_backoff_factor="10ms"
--resources="cpus:2;gpus:0;mem:1024;disk:1024;ports:[31000-32000]" --revocable_cpu_low_priority="true"
--runtime_dir="/tmp/Endpoint_SlaveEndpointTest_NoAuthorizer_0_qsYJwN" --sandbox_directory="/mnt/mesos/sandbox"
--strict="true" --switch_user="true" --systemd_enable_support="true" --systemd_runtime_directory="/run/systemd/system"
--version="false" --work_dir="/tmp/Endpoint_SlaveEndpointTest_NoAuthorizer_0_UvN586"
I0522 19:53:05.446698 32198 credentials.hpp:86] Loading credential for authentication from
'/tmp/Endpoint_SlaveEndpointTest_NoAuthorizer_0_qsYJwN/credential'
I0522 19:53:05.446785 32198 slave.cpp:258] Agent using credential for: test-principal
I0522 19:53:05.446799 32198 credentials.hpp:37] Loading credentials for authentication from
'/tmp/Endpoint_SlaveEndpointTest_NoAuthorizer_0_qsYJwN/http_credentials'
I0522 19:53:05.446910 32198 http.cpp:975] Creating default 'basic' HTTP authenticator for
realm 'mesos-agent-executor'
I0522 19:53:05.446944 32198 http.cpp:996] Creating default 'jwt' HTTP authenticator for realm
'mesos-agent-executor'
I0522 19:53:05.447016 32198 http.cpp:975] Creating default 'basic' HTTP authenticator for
realm 'mesos-agent-readonly'
I0522 19:53:05.447046 32198 http.cpp:996] Creating default 'jwt' HTTP authenticator for realm
'mesos-agent-readonly'
I0522 19:53:05.447118 32198 http.cpp:975] Creating default 'basic' HTTP authenticator for
realm 'mesos-agent-readwrite'
I0522 19:53:05.447154 32198 http.cpp:996] Creating default 'jwt' HTTP authenticator for realm
'mesos-agent-readwrite'
I0522 19:53:05.447566 32198 slave.cpp:529] Agent resources: cpus(*):2; mem(*):1024; disk(*):1024;
ports(*):[31000-32000]
I0522 19:53:05.447599 32198 slave.cpp:537] Agent attributes: [  ]
I0522 19:53:05.447604 32198 slave.cpp:542] Agent hostname: 39d80456b9ea
I0522 19:53:05.447682 32190 status_update_manager.cpp:177] Pausing sending status updates
I0522 19:53:05.448179 32197 state.cpp:62] Recovering state from '/tmp/Endpoint_SlaveEndpointTest_NoAuthorizer_0_UvN586/meta'
I0522 19:53:05.448390 32195 status_update_manager.cpp:203] Recovering status update manager
I0522 19:53:05.448473 32195 containerizer.cpp:608] Recovering containerizer
I0522 19:53:05.448990 32194 provisioner.cpp:410] Provisioner recovery complete
I0522 19:53:05.449141 32201 slave.cpp:5974] Finished recovery
I0522 19:53:05.449506 32201 slave.cpp:6156] Querying resource estimator for oversubscribable
resources
I0522 19:53:05.449625 32200 slave.cpp:6170] Received oversubscribable resources {} from the
resource estimator
I0522 19:53:05.454139 32196 process.cpp:3730] Handling HTTP event for process 'slave(750)'
with path: '/slave(750)/monitor/statistics'
I0522 19:53:05.456248 32200 http.cpp:1115] HTTP GET for /slave(750)/monitor/statistics from
172.17.0.3:34301
I0522 19:53:05.456292 32200 http.cpp:936] Authorizing principal 'test-principal' to GET the
'/monitor/statistics' endpoint
I0522 19:53:05.458513 26710 slave.cpp:794] Agent terminating
[       OK ] Endpoint/SlaveEndpointTest.NoAuthorizer/0 (18 ms)
[ RUN      ] Endpoint/SlaveEndpointTest.NoAuthorizer/1
I0522 19:53:05.464067 26710 containerizer.cpp:221] Using isolation: posix/cpu,posix/mem,filesystem/posix,network/cni
W0522 19:53:05.464408 26710 backend.cpp:76] Failed to create 'aufs' backend: AufsBackend requires
root privileges
W0522 19:53:05.464449 26710 backend.cpp:76] Failed to create 'bind' backend: BindBackend requires
root privileges
I0522 19:53:05.464468 26710 provisioner.cpp:249] Using default backend 'copy'
I0522 19:53:05.465001 26710 cluster.cpp:448] Creating default 'local' authorizer
I0522 19:53:05.465502 32193 slave.cpp:225] Mesos agent started on (751)@172.17.0.3:49860
I0522 19:53:05.465520 32193 slave.cpp:226] Flags at startup: --acls="" --appc_simple_discovery_uri_prefix="http://"
--appc_store_dir="/tmp/mesos/store/appc" --authenticate_http_executors="true" --authenticate_http_readonly="true"
--authenticate_http_readwrite="true" --authenticatee="crammd5" --authentication_backoff_factor="1secs"
--authorizer="local" --cgroups_cpu_enable_pids_and_tids_count="false" --cgroups_enable_cfs="false"
--cgroups_hierarchy="/sys/fs/cgroup" --cgroups_limit_swap="false" --cgroups_root="mesos" --container_disk_watch_interval="15secs"
--containerizers="mesos" --credential="/tmp/Endpoint_SlaveEndpointTest_NoAuthorizer_1_SBFadx/credential"
--default_role="*" --disk_watch_interval="1mins" --docker="docker" --docker_kill_orphans="true"
--docker_registry="https://registry-1.docker.io" --docker_remove_delay="6hrs" --docker_socket="/var/run/docker.sock"
--docker_stop_timeout="0ns" --docker_store_dir="/tmp/mesos/store/docker" --docker_volume_checkpoint_dir="/var/run/mesos/isolators/docker/volume"
--enforce_container_disk_quota="false" --executor_registration_timeout="1mins" --executor_secret_key="/tmp/Endpoint_SlaveEndpointTest_NoAuthorizer_1_SBFadx/executor_secret_key"
--executor_shutdown_grace_period="5secs" --fetcher_cache_dir="/tmp/Endpoint_SlaveEndpointTest_NoAuthorizer_1_SBFadx/fetch"
--fetcher_cache_size="2GB" --frameworks_home="" --gc_delay="1weeks" --gc_disk_headroom="0.1"
--hadoop_home="" --help="false" --hostname_lookup="true" --http_command_executor="false" --http_credentials="/tmp/Endpoint_SlaveEndpointTest_NoAuthorizer_1_SBFadx/http_credentials"
--http_heartbeat_interval="30secs" --initialize_driver_logging="true" --isolation="posix/cpu,posix/mem"
--launcher="posix" --launcher_dir="/mesos/build/src" --logbufsecs="0" --logging_level="INFO"
--max_completed_executors_per_framework="150" --oversubscribed_resources_interval="15secs"
--perf_duration="10secs" --perf_interval="1mins" --port="5051" --qos_correction_interval_min="0ns"
--quiet="false" --recover="reconnect" --recovery_timeout="15mins" --registration_backoff_factor="10ms"
--resources="cpus:2;gpus:0;mem:1024;disk:1024;ports:[31000-32000]" --revocable_cpu_low_priority="true"
--runtime_dir="/tmp/Endpoint_SlaveEndpointTest_NoAuthorizer_1_SBFadx" --sandbox_directory="/mnt/mesos/sandbox"
--strict="true" --switch_user="true" --systemd_enable_support="true" --systemd_runtime_directory="/run/systemd/system"
--version="false" --work_dir="/tmp/Endpoint_SlaveEndpointTest_NoAuthorizer_1_ILItMQ"
I0522 19:53:05.465759 32193 credentials.hpp:86] Loading credential for authentication from
'/tmp/Endpoint_SlaveEndpointTest_NoAuthorizer_1_SBFadx/credential'
I0522 19:53:05.466058 32193 slave.cpp:258] Agent using credential for: test-principal
I0522 19:53:05.466075 32193 credentials.hpp:37] Loading credentials for authentication from
'/tmp/Endpoint_SlaveEndpointTest_NoAuthorizer_1_SBFadx/http_credentials'
I0522 19:53:05.466238 32193 http.cpp:975] Creating default 'basic' HTTP authenticator for
realm 'mesos-agent-executor'
I0522 19:53:05.466284 32193 http.cpp:996] Creating default 'jwt' HTTP authenticator for realm
'mesos-agent-executor'
I0522 19:53:05.466359 32193 http.cpp:975] Creating default 'basic' HTTP authenticator for
realm 'mesos-agent-readonly'
I0522 19:53:05.466406 32193 http.cpp:996] Creating default 'jwt' HTTP authenticator for realm
'mesos-agent-readonly'
I0522 19:53:05.466480 32193 http.cpp:975] Creating default 'basic' HTTP authenticator for
realm 'mesos-agent-readwrite'
I0522 19:53:05.466521 32193 http.cpp:996] Creating default 'jwt' HTTP authenticator for realm
'mesos-agent-readwrite'
I0522 19:53:05.466894 32193 slave.cpp:529] Agent resources: cpus(*):2; mem(*):1024; disk(*):1024;
ports(*):[31000-32000]
I0522 19:53:05.466941 32193 slave.cpp:537] Agent attributes: [  ]
I0522 19:53:05.466948 32193 slave.cpp:542] Agent hostname: 39d80456b9ea
I0522 19:53:05.467028 32203 status_update_manager.cpp:177] Pausing sending status updates
I0522 19:53:05.467452 32194 state.cpp:62] Recovering state from '/tmp/Endpoint_SlaveEndpointTest_NoAuthorizer_1_ILItMQ/meta'
I0522 19:53:05.467675 32200 status_update_manager.cpp:203] Recovering status update manager
I0522 19:53:05.467783 32192 containerizer.cpp:608] Recovering containerizer
I0522 19:53:05.468454 32192 provisioner.cpp:410] Provisioner recovery complete
I0522 19:53:05.468613 32192 slave.cpp:5974] Finished recovery
I0522 19:53:05.469085 32192 slave.cpp:6156] Querying resource estimator for oversubscribable
resources
I0522 19:53:05.469573 32196 slave.cpp:6170] Received oversubscribable resources {} from the
resource estimator
I0522 19:53:05.471529 32193 process.cpp:3730] Handling HTTP event for process 'slave(751)'
with path: '/slave(751)/monitor/statistics.json'
I0522 19:53:05.472210 32199 http.cpp:1115] HTTP GET for /slave(751)/monitor/statistics.json
from 172.17.0.3:34302
I0522 19:53:05.472247 32199 http.cpp:936] Authorizing principal 'test-principal' to GET the
'/monitor/statistics.json' endpoint
I0522 19:53:05.474869 26710 slave.cpp:794] Agent terminating
[       OK ] Endpoint/SlaveEndpointTest.NoAuthorizer/1 (16 ms)
[ RUN      ] Endpoint/SlaveEndpointTest.NoAuthorizer/2
I0522 19:53:05.481056 26710 containerizer.cpp:221] Using isolation: posix/cpu,posix/mem,filesystem/posix,network/cni
W0522 19:53:05.481395 26710 backend.cpp:76] Failed to create 'aufs' backend: AufsBackend requires
root privileges
W0522 19:53:05.481438 26710 backend.cpp:76] Failed to create 'bind' backend: BindBackend requires
root privileges
I0522 19:53:05.481458 26710 provisioner.cpp:249] Using default backend 'copy'
I0522 19:53:05.482015 26710 cluster.cpp:448] Creating default 'local' authorizer
I0522 19:53:05.482486 32191 slave.cpp:225] Mesos agent started on (752)@172.17.0.3:49860
I0522 19:53:05.482502 32191 slave.cpp:226] Flags at startup: --acls="" --appc_simple_discovery_uri_prefix="http://"
--appc_store_dir="/tmp/mesos/store/appc" --authenticate_http_executors="true" --authenticate_http_readonly="true"
--authenticate_http_readwrite="true" --authenticatee="crammd5" --authentication_backoff_factor="1secs"
--authorizer="local" --cgroups_cpu_enable_pids_and_tids_count="false" --cgroups_enable_cfs="false"
--cgroups_hierarchy="/sys/fs/cgroup" --cgroups_limit_swap="false" --cgroups_root="mesos" --container_disk_watch_interval="15secs"
--containerizers="mesos" --credential="/tmp/Endpoint_SlaveEndpointTest_NoAuthorizer_2_ZdzY4g/credential"
--default_role="*" --disk_watch_interval="1mins" --docker="docker" --docker_kill_orphans="true"
--docker_registry="https://registry-1.docker.io" --docker_remove_delay="6hrs" --docker_socket="/var/run/docker.sock"
--docker_stop_timeout="0ns" --docker_store_dir="/tmp/mesos/store/docker" --docker_volume_checkpoint_dir="/var/run/mesos/isolators/docker/volume"
--enforce_container_disk_quota="false" --executor_registration_timeout="1mins" --executor_secret_key="/tmp/Endpoint_SlaveEndpointTest_NoAuthorizer_2_ZdzY4g/executor_secret_key"
--executor_shutdown_grace_period="5secs" --fetcher_cache_dir="/tmp/Endpoint_SlaveEndpointTest_NoAuthorizer_2_ZdzY4g/fetch"
--fetcher_cache_size="2GB" --frameworks_home="" --gc_delay="1weeks" --gc_disk_headroom="0.1"
--hadoop_home="" --help="false" --hostname_lookup="true" --http_command_executor="false" --http_credentials="/tmp/Endpoint_SlaveEndpointTest_NoAuthorizer_2_ZdzY4g/http_credentials"
--http_heartbeat_interval="30secs" --initialize_driver_logging="true" --isolation="posix/cpu,posix/mem"
--launcher="posix" --launcher_dir="/mesos/build/src" --logbufsecs="0" --logging_level="INFO"
--max_completed_executors_per_framework="150" --oversubscribed_resources_interval="15secs"
--perf_duration="10secs" --perf_interval="1mins" --port="5051" --qos_correction_interval_min="0ns"
--quiet="false" --recover="reconnect" --recovery_timeout="15mins" --registration_backoff_factor="10ms"
--resources="cpus:2;gpus:0;mem:1024;disk:1024;ports:[31000-32000]" --revocable_cpu_low_priority="true"
--runtime_dir="/tmp/Endpoint_SlaveEndpointTest_NoAuthorizer_2_ZdzY4g" --sandbox_directory="/mnt/mesos/sandbox"
--strict="true" --switch_user="true" --systemd_enable_support="true" --systemd_runtime_directory="/run/systemd/system"
--version="false" --work_dir="/tmp/Endpoint_SlaveEndpointTest_NoAuthorizer_2_rDUxBA"
I0522 19:53:05.482785 32191 credentials.hpp:86] Loading credential for authentication from
'/tmp/Endpoint_SlaveEndpointTest_NoAuthorizer_2_ZdzY4g/credential'
I0522 19:53:05.482869 32191 slave.cpp:258] Agent using credential for: test-principal
I0522 19:53:05.482879 32191 credentials.hpp:37] Loading credentials for authentication from
'/tmp/Endpoint_SlaveEndpointTest_NoAuthorizer_2_ZdzY4g/http_credentials'
I0522 19:53:05.482987 32191 http.cpp:975] Creating default 'basic' HTTP authenticator for
realm 'mesos-agent-executor'
I0522 19:53:05.483021 32191 http.cpp:996] Creating default 'jwt' HTTP authenticator for realm
'mesos-agent-executor'
I0522 19:53:05.483057 32191 http.cpp:975] Creating default 'basic' HTTP authenticator for
realm 'mesos-agent-readonly'
I0522 19:53:05.483075 32191 http.cpp:996] Creating default 'jwt' HTTP authenticator for realm
'mesos-agent-readonly'
I0522 19:53:05.483162 32191 http.cpp:975] Creating default 'basic' HTTP authenticator for
realm 'mesos-agent-readwrite'
I0522 19:53:05.483211 32191 http.cpp:996] Creating default 'jwt' HTTP authenticator for realm
'mesos-agent-readwrite'
I0522 19:53:05.483767 32191 slave.cpp:529] Agent resources: cpus(*):2; mem(*):1024; disk(*):1024;
ports(*):[31000-32000]
I0522 19:53:05.483809 32191 slave.cpp:537] Agent attributes: [  ]
I0522 19:53:05.483816 32191 slave.cpp:542] Agent hostname: 39d80456b9ea
I0522 19:53:05.483876 32197 status_update_manager.cpp:177] Pausing sending status updates
I0522 19:53:05.484302 32204 state.cpp:62] Recovering state from '/tmp/Endpoint_SlaveEndpointTest_NoAuthorizer_2_rDUxBA/meta'
I0522 19:53:05.484558 32199 status_update_manager.cpp:203] Recovering status update manager
I0522 19:53:05.484643 32199 containerizer.cpp:608] Recovering containerizer
I0522 19:53:05.485301 32205 provisioner.cpp:410] Provisioner recovery complete
I0522 19:53:05.485488 32205 slave.cpp:5974] Finished recovery
I0522 19:53:05.485947 32205 slave.cpp:6156] Querying resource estimator for oversubscribable
resources
I0522 19:53:05.486088 32196 slave.cpp:6170] Received oversubscribable resources {} from the
resource estimator
I0522 19:53:05.486933 32192 process.cpp:3730] Handling HTTP event for process 'slave(752)'
with path: '/slave(752)/containers'
I0522 19:53:05.487313 32192 http.cpp:1115] HTTP GET for /slave(752)/containers from 172.17.0.3:34304
I0522 19:53:05.487354 32192 http.cpp:936] Authorizing principal 'test-principal' to GET the
'/containers' endpoint
I0522 19:53:05.488440 32191 slave.cpp:794] Agent terminating
[       OK ] Endpoint/SlaveEndpointTest.NoAuthorizer/2 (12 ms)
[----------] 9 tests from Endpoint/SlaveEndpointTest (159 ms total)

[----------] Global test environment tear-down
[==========] 1526 tests from 168 test cases ran. (223901 ms total)
[  PASSED  ] 1525 tests.
[  FAILED  ] 1 test, listed below:
[  FAILED  ] OversubscriptionTest.RescindRevocableOfferWithIncreasedRevocable

 1 FAILED TEST
  YOU HAVE 22 DISABLED TESTS

E0522 19:53:05.545083 32206 process.cpp:950] Failed to accept socket: future discarded
make[3]: Leaving directory `/mesos/build'
make[3]: *** [CMakeFiles/check] Error 1
make[2]: *** [CMakeFiles/check.dir/all] Error 2
make[2]: Leaving directory `/mesos/build'
make[1]: *** [CMakeFiles/check.dir/rule] Error 2
make[1]: Leaving directory `/mesos/build'
make: *** [check] Error 2
+ docker rmi mesos-1495479859-13174
Untagged: mesos-1495479859-13174:latest
Deleted: sha256:f4464d0841b91fd566f20e352f222399349a31fe77ac7e61cfa3acbab95e8c78
Deleted: sha256:67b6b09e5f6de824125506e2d8a0bee8d57a8671709fba82b0a74e0dc789f963
Deleted: sha256:ffe85fbb28d62ed68b63127aac6d6b3df914d01423cc115e942561128a9ad298
Deleted: sha256:9530fdadf2a9a5f8c26c43d7c6f966045f0cd6419a0bd648acfd84cc80e54f9e
Deleted: sha256:89f0cfdc43076c95f5e8f3dd26d4410633a51c3c04c60ecfa1179908a641badf
Deleted: sha256:08d5ee8b1b771bd660bfd33d7ec7bdf54985ad46acf08439a3078cc8ae3746a0
Deleted: sha256:9e4bd0a2cbcac9b94e3e2d90c4708c6bc61d69b9e27e4c83b50dcafbece60581
Deleted: sha256:19898a4beda554991503ffb132cdb034b9b3b3ac6b6479f0fced12ef5febe1c5
Deleted: sha256:25b6fd653dccdfb742e5b31463ba002be592e38e807f61ff9cce4c62d591bd14
Deleted: sha256:1920d606ef54dbe3b3d680523546433d7e8b93735eed62747aa90760478b318c
Deleted: sha256:d7a433e4b0e1a23663ac6c1dc8bc03b7905919503635c2b9dc4d6b2fe0ad3770
Deleted: sha256:a5cdf999c7d9ef031c0d2095907002d29dd540af1ba08bfd8eb7f4895731c722
Deleted: sha256:b3ad79cee48ed93ce19b8eea3d50e2530e028d167aa5c97b0600a97cd1201e15
Deleted: sha256:3e6e113f9dd96d6ea13ce6aa2d9685b80bbdb84f46d8bb313319545180f9f49a
Deleted: sha256:80052d7083accf0fcb9180c855a237df46bb449d7ca195801e65afb4d2d9daf3
Deleted: sha256:d487b1895fc9efb4838ef4235263fb93a660ff80870184fe77428cc8397b4055
Deleted: sha256:670d16d95ddbc2f7686131cb8303762a7a208dd15e7f3fbdba9a1cd5bf324a7f
Deleted: sha256:2334639db3441bca840c2a589d72710d7c6cce6a663ecf31c2efbd0e35a653d6
Deleted: sha256:619f6d16405e6948a1ec00567beaa68f2a2d427dc1c56fd09e281194b3947fe7
Deleted: sha256:444be82a274151f13e658aa70221afa9732dc1a3c6756852d0f9246aae97392e
Deleted: sha256:e4ba9ea77d58cd90f76bb0ad88c45e19630fa3766d4be3b9004924fb51623a83
Deleted: sha256:aede16e43ac49f2d50348535e33b920490cc1ed6e10a704dc30980b9314559c9
Deleted: sha256:8b0ba022188a411945ec0e2bedc79a207e5b9ab2ac0d88c292d092ed7fbf2830
Deleted: sha256:a23c68cf4f75186cc386d966221877307582c6414999e05a5c5c314d4aae022e
Deleted: sha256:15c91d3067800e34553485af64fdd7702eedfc1c333b7d3a3db2c5ccc83f5361
Build step 'Execute shell' marked build as failure
Not sending mail to unregistered user yujie.jay@gmail.com

Mime
View raw message