mesos-builds mailing list archives

Site index · List index
Message view « Date » · « Thread »
Top « Date » · « Thread »
From Apache Jenkins Server <jenk...@builds.apache.org>
Subject Build failed in Jenkins: Mesos-Reviewbot #17922
Date Tue, 02 May 2017 21:15:04 GMT
See <https://builds.apache.org/job/Mesos-Reviewbot/17922/display/redirect>

------------------------------------------
[...truncated 26.93 MB...]
I0502 21:15:00.533154 30840 slave.cpp:790] Agent terminating
[       OK ] Endpoint/SlaveEndpointTest.AuthorizedRequest/1 (28 ms)
[ RUN      ] Endpoint/SlaveEndpointTest.AuthorizedRequest/2
I0502 21:15:00.543295 30813 containerizer.cpp:221] Using isolation: posix/cpu,posix/mem,filesystem/posix,network/cni
W0502 21:15:00.543849 30813 backend.cpp:76] Failed to create 'aufs' backend: AufsBackend requires
root privileges
W0502 21:15:00.543949 30813 backend.cpp:76] Failed to create 'bind' backend: BindBackend requires
root privileges
I0502 21:15:00.543983 30813 provisioner.cpp:249] Using default backend 'copy'
I0502 21:15:00.547721 30847 slave.cpp:225] Mesos agent started on (743)@172.17.0.2:37654
I0502 21:15:00.547745 30847 slave.cpp:226] Flags at startup: --acls="" --appc_simple_discovery_uri_prefix="http://"
--appc_store_dir="/tmp/mesos/store/appc" --authenticate_http_readonly="true" --authenticate_http_readwrite="true"
--authenticatee="crammd5" --authentication_backoff_factor="1secs" --authorizer="local" --cgroups_cpu_enable_pids_and_tids_count="false"
--cgroups_enable_cfs="false" --cgroups_hierarchy="/sys/fs/cgroup" --cgroups_limit_swap="false"
--cgroups_root="mesos" --container_disk_watch_interval="15secs" --containerizers="mesos" --credential="/tmp/Endpoint_SlaveEndpointTest_AuthorizedRequest_2_pOrD6R/credential"
--default_role="*" --disk_watch_interval="1mins" --docker="docker" --docker_kill_orphans="true"
--docker_registry="https://registry-1.docker.io" --docker_remove_delay="6hrs" --docker_socket="/var/run/docker.sock"
--docker_stop_timeout="0ns" --docker_store_dir="/tmp/mesos/store/docker" --docker_volume_checkpoint_dir="/var/run/mesos/isolators/docker/volume"
--enforce_container_disk_quota="false" --executor_registration_timeout="1mins" --executor_shutdown_grace_period="5secs"
--fetcher_cache_dir="/tmp/Endpoint_SlaveEndpointTest_AuthorizedRequest_2_pOrD6R/fetch" --fetcher_cache_size="2GB"
--frameworks_home="" --gc_delay="1weeks" --gc_disk_headroom="0.1" --hadoop_home="" --help="false"
--hostname_lookup="true" --http_command_executor="false" --http_credentials="/tmp/Endpoint_SlaveEndpointTest_AuthorizedRequest_2_pOrD6R/http_credentials"
--http_heartbeat_interval="30secs" --initialize_driver_logging="true" --isolation="posix/cpu,posix/mem"
--launcher="posix" --launcher_dir="/mesos/mesos-1.3.0/_build/src" --logbufsecs="0" --logging_level="INFO"
--max_completed_executors_per_framework="150" --oversubscribed_resources_interval="15secs"
--perf_duration="10secs" --perf_interval="1mins" --port="5051" --qos_correction_interval_min="0ns"
--quiet="false" --recover="reconnect" --recovery_timeout="15mins" --registration_backoff_factor="10ms"
--resources="cpus:2;gpus:0;mem:1024;disk:1024;ports:[31000-32000]" --revocable_cpu_low_priority="true"
--runtime_dir="/tmp/Endpoint_SlaveEndpointTest_AuthorizedRequest_2_pOrD6R" --sandbox_directory="/mnt/mesos/sandbox"
--strict="true" --switch_user="true" --systemd_enable_support="true" --systemd_runtime_directory="/run/systemd/system"
--version="false" --work_dir="/tmp/Endpoint_SlaveEndpointTest_AuthorizedRequest_2_oFP66G"
I0502 21:15:00.548187 30847 credentials.hpp:86] Loading credential for authentication from
'/tmp/Endpoint_SlaveEndpointTest_AuthorizedRequest_2_pOrD6R/credential'
I0502 21:15:00.548333 30847 slave.cpp:258] Agent using credential for: test-principal
I0502 21:15:00.548355 30847 credentials.hpp:37] Loading credentials for authentication from
'/tmp/Endpoint_SlaveEndpointTest_AuthorizedRequest_2_pOrD6R/http_credentials'
I0502 21:15:00.548554 30847 http.cpp:975] Creating default 'basic' HTTP authenticator for
realm 'mesos-agent-readonly'
I0502 21:15:00.548902 30847 http.cpp:975] Creating default 'basic' HTTP authenticator for
realm 'mesos-agent-readwrite'
I0502 21:15:00.550149 30847 slave.cpp:525] Agent resources: cpus(*):2; mem(*):1024; disk(*):1024;
ports(*):[31000-32000]
I0502 21:15:00.550231 30847 slave.cpp:533] Agent attributes: [  ]
I0502 21:15:00.550246 30847 slave.cpp:538] Agent hostname: 76d571085df6
I0502 21:15:00.550369 30840 status_update_manager.cpp:177] Pausing sending status updates
I0502 21:15:00.552152 30832 state.cpp:62] Recovering state from '/tmp/Endpoint_SlaveEndpointTest_AuthorizedRequest_2_oFP66G/meta'
I0502 21:15:00.552486 30844 status_update_manager.cpp:203] Recovering status update manager
I0502 21:15:00.552959 30836 containerizer.cpp:608] Recovering containerizer
I0502 21:15:00.554630 30842 provisioner.cpp:410] Provisioner recovery complete
I0502 21:15:00.555164 30841 slave.cpp:5963] Finished recovery
I0502 21:15:00.555580 30841 slave.cpp:6145] Querying resource estimator for oversubscribable
resources
I0502 21:15:00.555939 30839 slave.cpp:6159] Received oversubscribable resources {} from the
resource estimator
I0502 21:15:00.558055 30841 process.cpp:3731] Handling HTTP event for process 'slave(743)'
with path: '/slave(743)/containers'
I0502 21:15:00.559469 30853 http.cpp:1115] HTTP GET for /slave(743)/containers from 172.17.0.2:45500
I0502 21:15:00.559550 30853 http.cpp:936] Authorizing principal 'test-principal' to GET the
'/containers' endpoint
I0502 21:15:00.563259 30845 slave.cpp:790] Agent terminating
[       OK ] Endpoint/SlaveEndpointTest.AuthorizedRequest/2 (31 ms)
[ RUN      ] Endpoint/SlaveEndpointTest.UnauthorizedRequest/0
I0502 21:15:00.574010 30813 containerizer.cpp:221] Using isolation: posix/cpu,posix/mem,filesystem/posix,network/cni
W0502 21:15:00.574534 30813 backend.cpp:76] Failed to create 'aufs' backend: AufsBackend requires
root privileges
W0502 21:15:00.574628 30813 backend.cpp:76] Failed to create 'bind' backend: BindBackend requires
root privileges
I0502 21:15:00.574662 30813 provisioner.cpp:249] Using default backend 'copy'
I0502 21:15:00.578759 30837 slave.cpp:225] Mesos agent started on (744)@172.17.0.2:37654
I0502 21:15:00.578793 30837 slave.cpp:226] Flags at startup: --acls="" --appc_simple_discovery_uri_prefix="http://"
--appc_store_dir="/tmp/mesos/store/appc" --authenticate_http_readonly="true" --authenticate_http_readwrite="true"
--authenticatee="crammd5" --authentication_backoff_factor="1secs" --authorizer="local" --cgroups_cpu_enable_pids_and_tids_count="false"
--cgroups_enable_cfs="false" --cgroups_hierarchy="/sys/fs/cgroup" --cgroups_limit_swap="false"
--cgroups_root="mesos" --container_disk_watch_interval="15secs" --containerizers="mesos" --credential="/tmp/Endpoint_SlaveEndpointTest_UnauthorizedRequest_0_x5uqkA/credential"
--default_role="*" --disk_watch_interval="1mins" --docker="docker" --docker_kill_orphans="true"
--docker_registry="https://registry-1.docker.io" --docker_remove_delay="6hrs" --docker_socket="/var/run/docker.sock"
--docker_stop_timeout="0ns" --docker_store_dir="/tmp/mesos/store/docker" --docker_volume_checkpoint_dir="/var/run/mesos/isolators/docker/volume"
--enforce_container_disk_quota="false" --executor_registration_timeout="1mins" --executor_shutdown_grace_period="5secs"
--fetcher_cache_dir="/tmp/Endpoint_SlaveEndpointTest_UnauthorizedRequest_0_x5uqkA/fetch" --fetcher_cache_size="2GB"
--frameworks_home="" --gc_delay="1weeks" --gc_disk_headroom="0.1" --hadoop_home="" --help="false"
--hostname_lookup="true" --http_command_executor="false" --http_credentials="/tmp/Endpoint_SlaveEndpointTest_UnauthorizedRequest_0_x5uqkA/http_credentials"
--http_heartbeat_interval="30secs" --initialize_driver_logging="true" --isolation="posix/cpu,posix/mem"
--launcher="posix" --launcher_dir="/mesos/mesos-1.3.0/_build/src" --logbufsecs="0" --logging_level="INFO"
--max_completed_executors_per_framework="150" --oversubscribed_resources_interval="15secs"
--perf_duration="10secs" --perf_interval="1mins" --port="5051" --qos_correction_interval_min="0ns"
--quiet="false" --recover="reconnect" --recovery_timeout="15mins" --registration_backoff_factor="10ms"
--resources="cpus:2;gpus:0;mem:1024;disk:1024;ports:[31000-32000]" --revocable_cpu_low_priority="true"
--runtime_dir="/tmp/Endpoint_SlaveEndpointTest_UnauthorizedRequest_0_x5uqkA" --sandbox_directory="/mnt/mesos/sandbox"
--strict="true" --switch_user="true" --systemd_enable_support="true" --systemd_runtime_directory="/run/systemd/system"
--version="false" --work_dir="/tmp/Endpoint_SlaveEndpointTest_UnauthorizedRequest_0_YHhigp"
I0502 21:15:00.579205 30837 credentials.hpp:86] Loading credential for authentication from
'/tmp/Endpoint_SlaveEndpointTest_UnauthorizedRequest_0_x5uqkA/credential'
I0502 21:15:00.579381 30837 slave.cpp:258] Agent using credential for: test-principal
I0502 21:15:00.579404 30837 credentials.hpp:37] Loading credentials for authentication from
'/tmp/Endpoint_SlaveEndpointTest_UnauthorizedRequest_0_x5uqkA/http_credentials'
I0502 21:15:00.579625 30837 http.cpp:975] Creating default 'basic' HTTP authenticator for
realm 'mesos-agent-readonly'
I0502 21:15:00.579761 30837 http.cpp:975] Creating default 'basic' HTTP authenticator for
realm 'mesos-agent-readwrite'
I0502 21:15:00.581131 30837 slave.cpp:525] Agent resources: cpus(*):2; mem(*):1024; disk(*):1024;
ports(*):[31000-32000]
I0502 21:15:00.581212 30837 slave.cpp:533] Agent attributes: [  ]
I0502 21:15:00.581224 30837 slave.cpp:538] Agent hostname: 76d571085df6
I0502 21:15:00.581351 30846 status_update_manager.cpp:177] Pausing sending status updates
I0502 21:15:00.582666 30843 state.cpp:62] Recovering state from '/tmp/Endpoint_SlaveEndpointTest_UnauthorizedRequest_0_YHhigp/meta'
I0502 21:15:00.582968 30845 status_update_manager.cpp:203] Recovering status update manager
I0502 21:15:00.583163 30855 containerizer.cpp:608] Recovering containerizer
I0502 21:15:00.584875 30843 provisioner.cpp:410] Provisioner recovery complete
I0502 21:15:00.585263 30845 slave.cpp:5963] Finished recovery
I0502 21:15:00.585733 30845 slave.cpp:6145] Querying resource estimator for oversubscribable
resources
I0502 21:15:00.585989 30852 slave.cpp:6159] Received oversubscribable resources {} from the
resource estimator
I0502 21:15:00.587998 30838 process.cpp:3731] Handling HTTP event for process 'slave(744)'
with path: '/slave(744)/monitor/statistics'
I0502 21:15:00.589126 30844 http.cpp:1115] HTTP GET for /slave(744)/monitor/statistics from
172.17.0.2:45502
I0502 21:15:00.589195 30844 http.cpp:936] Authorizing principal 'test-principal' to GET the
'/monitor/statistics' endpoint
I0502 21:15:00.591603 30850 slave.cpp:790] Agent terminating
[       OK ] Endpoint/SlaveEndpointTest.UnauthorizedRequest/0 (27 ms)
[ RUN      ] Endpoint/SlaveEndpointTest.UnauthorizedRequest/1
I0502 21:15:00.601730 30813 containerizer.cpp:221] Using isolation: posix/cpu,posix/mem,filesystem/posix,network/cni
W0502 21:15:00.602249 30813 backend.cpp:76] Failed to create 'aufs' backend: AufsBackend requires
root privileges
W0502 21:15:00.602345 30813 backend.cpp:76] Failed to create 'bind' backend: BindBackend requires
root privileges
I0502 21:15:00.602388 30813 provisioner.cpp:249] Using default backend 'copy'
I0502 21:15:00.605952 30846 slave.cpp:225] Mesos agent started on (745)@172.17.0.2:37654
I0502 21:15:00.605986 30846 slave.cpp:226] Flags at startup: --acls="" --appc_simple_discovery_uri_prefix="http://"
--appc_store_dir="/tmp/mesos/store/appc" --authenticate_http_readonly="true" --authenticate_http_readwrite="true"
--authenticatee="crammd5" --authentication_backoff_factor="1secs" --authorizer="local" --cgroups_cpu_enable_pids_and_tids_count="false"
--cgroups_enable_cfs="false" --cgroups_hierarchy="/sys/fs/cgroup" --cgroups_limit_swap="false"
--cgroups_root="mesos" --container_disk_watch_interval="15secs" --containerizers="mesos" --credential="/tmp/Endpoint_SlaveEndpointTest_UnauthorizedRequest_1_Tyq2Oi/credential"
--default_role="*" --disk_watch_interval="1mins" --docker="docker" --docker_kill_orphans="true"
--docker_registry="https://registry-1.docker.io" --docker_remove_delay="6hrs" --docker_socket="/var/run/docker.sock"
--docker_stop_timeout="0ns" --docker_store_dir="/tmp/mesos/store/docker" --docker_volume_checkpoint_dir="/var/run/mesos/isolators/docker/volume"
--enforce_container_disk_quota="false" --executor_registration_timeout="1mins" --executor_shutdown_grace_period="5secs"
--fetcher_cache_dir="/tmp/Endpoint_SlaveEndpointTest_UnauthorizedRequest_1_Tyq2Oi/fetch" --fetcher_cache_size="2GB"
--frameworks_home="" --gc_delay="1weeks" --gc_disk_headroom="0.1" --hadoop_home="" --help="false"
--hostname_lookup="true" --http_command_executor="false" --http_credentials="/tmp/Endpoint_SlaveEndpointTest_UnauthorizedRequest_1_Tyq2Oi/http_credentials"
--http_heartbeat_interval="30secs" --initialize_driver_logging="true" --isolation="posix/cpu,posix/mem"
--launcher="posix" --launcher_dir="/mesos/mesos-1.3.0/_build/src" --logbufsecs="0" --logging_level="INFO"
--max_completed_executors_per_framework="150" --oversubscribed_resources_interval="15secs"
--perf_duration="10secs" --perf_interval="1mins" --port="5051" --qos_correction_interval_min="0ns"
--quiet="false" --recover="reconnect" --recovery_timeout="15mins" --registration_backoff_factor="10ms"
--resources="cpus:2;gpus:0;mem:1024;disk:1024;ports:[31000-32000]" --revocable_cpu_low_priority="true"
--runtime_dir="/tmp/Endpoint_SlaveEndpointTest_UnauthorizedRequest_1_Tyq2Oi" --sandbox_directory="/mnt/mesos/sandbox"
--strict="true" --switch_user="true" --systemd_enable_support="true" --systemd_runtime_directory="/run/systemd/system"
--version="false" --work_dir="/tmp/Endpoint_SlaveEndpointTest_UnauthorizedRequest_1_MlsNG7"
I0502 21:15:00.606631 30846 credentials.hpp:86] Loading credential for authentication from
'/tmp/Endpoint_SlaveEndpointTest_UnauthorizedRequest_1_Tyq2Oi/credential'
I0502 21:15:00.606842 30846 slave.cpp:258] Agent using credential for: test-principal
I0502 21:15:00.606873 30846 credentials.hpp:37] Loading credentials for authentication from
'/tmp/Endpoint_SlaveEndpointTest_UnauthorizedRequest_1_Tyq2Oi/http_credentials'
I0502 21:15:00.607163 30846 http.cpp:975] Creating default 'basic' HTTP authenticator for
realm 'mesos-agent-readonly'
I0502 21:15:00.607295 30846 http.cpp:975] Creating default 'basic' HTTP authenticator for
realm 'mesos-agent-readwrite'
I0502 21:15:00.608495 30846 slave.cpp:525] Agent resources: cpus(*):2; mem(*):1024; disk(*):1024;
ports(*):[31000-32000]
I0502 21:15:00.608575 30846 slave.cpp:533] Agent attributes: [  ]
I0502 21:15:00.608588 30846 slave.cpp:538] Agent hostname: 76d571085df6
I0502 21:15:00.608723 30840 status_update_manager.cpp:177] Pausing sending status updates
I0502 21:15:00.609972 30850 state.cpp:62] Recovering state from '/tmp/Endpoint_SlaveEndpointTest_UnauthorizedRequest_1_MlsNG7/meta'
I0502 21:15:00.610241 30837 status_update_manager.cpp:203] Recovering status update manager
I0502 21:15:00.610563 30847 containerizer.cpp:608] Recovering containerizer
I0502 21:15:00.612063 30847 provisioner.cpp:410] Provisioner recovery complete
I0502 21:15:00.612700 30839 slave.cpp:5963] Finished recovery
I0502 21:15:00.613153 30839 slave.cpp:6145] Querying resource estimator for oversubscribable
resources
I0502 21:15:00.613472 30845 slave.cpp:6159] Received oversubscribable resources {} from the
resource estimator
I0502 21:15:00.615573 30848 process.cpp:3731] Handling HTTP event for process 'slave(745)'
with path: '/slave(745)/monitor/statistics.json'
I0502 21:15:00.616744 30837 http.cpp:1115] HTTP GET for /slave(745)/monitor/statistics.json
from 172.17.0.2:45504
I0502 21:15:00.616809 30837 http.cpp:936] Authorizing principal 'test-principal' to GET the
'/monitor/statistics.json' endpoint
I0502 21:15:00.619181 30849 slave.cpp:790] Agent terminating
[       OK ] Endpoint/SlaveEndpointTest.UnauthorizedRequest/1 (27 ms)
[ RUN      ] Endpoint/SlaveEndpointTest.UnauthorizedRequest/2
I0502 21:15:00.631006 30813 containerizer.cpp:221] Using isolation: posix/cpu,posix/mem,filesystem/posix,network/cni
W0502 21:15:00.631501 30813 backend.cpp:76] Failed to create 'aufs' backend: AufsBackend requires
root privileges
W0502 21:15:00.631593 30813 backend.cpp:76] Failed to create 'bind' backend: BindBackend requires
root privileges
I0502 21:15:00.631623 30813 provisioner.cpp:249] Using default backend 'copy'
I0502 21:15:00.635191 30854 slave.cpp:225] Mesos agent started on (746)@172.17.0.2:37654
I0502 21:15:00.635222 30854 slave.cpp:226] Flags at startup: --acls="" --appc_simple_discovery_uri_prefix="http://"
--appc_store_dir="/tmp/mesos/store/appc" --authenticate_http_readonly="true" --authenticate_http_readwrite="true"
--authenticatee="crammd5" --authentication_backoff_factor="1secs" --authorizer="local" --cgroups_cpu_enable_pids_and_tids_count="false"
--cgroups_enable_cfs="false" --cgroups_hierarchy="/sys/fs/cgroup" --cgroups_limit_swap="false"
--cgroups_root="mesos" --container_disk_watch_interval="15secs" --containerizers="mesos" --credential="/tmp/Endpoint_SlaveEndpointTest_UnauthorizedRequest_2_ZwAiA1/credential"
--default_role="*" --disk_watch_interval="1mins" --docker="docker" --docker_kill_orphans="true"
--docker_registry="https://registry-1.docker.io" --docker_remove_delay="6hrs" --docker_socket="/var/run/docker.sock"
--docker_stop_timeout="0ns" --docker_store_dir="/tmp/mesos/store/docker" --docker_volume_checkpoint_dir="/var/run/mesos/isolators/docker/volume"
--enforce_container_disk_quota="false" --executor_registration_timeout="1mins" --executor_shutdown_grace_period="5secs"
--fetcher_cache_dir="/tmp/Endpoint_SlaveEndpointTest_UnauthorizedRequest_2_ZwAiA1/fetch" --fetcher_cache_size="2GB"
--frameworks_home="" --gc_delay="1weeks" --gc_disk_headroom="0.1" --hadoop_home="" --help="false"
--hostname_lookup="true" --http_command_executor="false" --http_credentials="/tmp/Endpoint_SlaveEndpointTest_UnauthorizedRequest_2_ZwAiA1/http_credentials"
--http_heartbeat_interval="30secs" --initialize_driver_logging="true" --isolation="posix/cpu,posix/mem"
--launcher="posix" --launcher_dir="/mesos/mesos-1.3.0/_build/src" --logbufsecs="0" --logging_level="INFO"
--max_completed_executors_per_framework="150" --oversubscribed_resources_interval="15secs"
--perf_duration="10secs" --perf_interval="1mins" --port="5051" --qos_correction_interval_min="0ns"
--quiet="false" --recover="reconnect" --recovery_timeout="15mins" --registration_backoff_factor="10ms"
--resources="cpus:2;gpus:0;mem:1024;disk:1024;ports:[31000-32000]" --revocable_cpu_low_priority="true"
--runtime_dir="/tmp/Endpoint_SlaveEndpointTest_UnauthorizedRequest_2_ZwAiA1" --sandbox_directory="/mnt/mesos/sandbox"
--strict="true" --switch_user="true" --systemd_enable_support="true" --systemd_runtime_directory="/run/systemd/system"
--version="false" --work_dir="/tmp/Endpoint_SlaveEndpointTest_UnauthorizedRequest_2_ozbRnQ"
I0502 21:15:00.635586 30854 credentials.hpp:86] Loading credential for authentication from
'/tmp/Endpoint_SlaveEndpointTest_UnauthorizedRequest_2_ZwAiA1/credential'
I0502 21:15:00.635732 30854 slave.cpp:258] Agent using credential for: test-principal
I0502 21:15:00.635753 30854 credentials.hpp:37] Loading credentials for authentication from
'/tmp/Endpoint_SlaveEndpointTest_UnauthorizedRequest_2_ZwAiA1/http_credentials'
I0502 21:15:00.635984 30854 http.cpp:975] Creating default 'basic' HTTP authenticator for
realm 'mesos-agent-readonly'
I0502 21:15:00.636129 30854 http.cpp:975] Creating default 'basic' HTTP authenticator for
realm 'mesos-agent-readwrite'
I0502 21:15:00.637373 30854 slave.cpp:525] Agent resources: cpus(*):2; mem(*):1024; disk(*):1024;
ports(*):[31000-32000]
I0502 21:15:00.637454 30854 slave.cpp:533] Agent attributes: [  ]
I0502 21:15:00.637468 30854 slave.cpp:538] Agent hostname: 76d571085df6
I0502 21:15:00.637606 30855 status_update_manager.cpp:177] Pausing sending status updates
I0502 21:15:00.638870 30835 state.cpp:62] Recovering state from '/tmp/Endpoint_SlaveEndpointTest_UnauthorizedRequest_2_ozbRnQ/meta'
I0502 21:15:00.639145 30841 status_update_manager.cpp:203] Recovering status update manager
I0502 21:15:00.639391 30855 containerizer.cpp:608] Recovering containerizer
I0502 21:15:00.641031 30840 provisioner.cpp:410] Provisioner recovery complete
I0502 21:15:00.641446 30847 slave.cpp:5963] Finished recovery
I0502 21:15:00.641877 30847 slave.cpp:6145] Querying resource estimator for oversubscribable
resources
I0502 21:15:00.642107 30845 slave.cpp:6159] Received oversubscribable resources {} from the
resource estimator
I0502 21:15:00.644337 30851 process.cpp:3731] Handling HTTP event for process 'slave(746)'
with path: '/slave(746)/containers'
I0502 21:15:00.645437 30851 http.cpp:1115] HTTP GET for /slave(746)/containers from 172.17.0.2:45506
I0502 21:15:00.645515 30851 http.cpp:936] Authorizing principal 'test-principal' to GET the
'/containers' endpoint
I0502 21:15:00.648138 30839 slave.cpp:790] Agent terminating
[       OK ] Endpoint/SlaveEndpointTest.UnauthorizedRequest/2 (28 ms)
[ RUN      ] Endpoint/SlaveEndpointTest.NoAuthorizer/0
I0502 21:15:00.658248 30813 containerizer.cpp:221] Using isolation: posix/cpu,posix/mem,filesystem/posix,network/cni
W0502 21:15:00.658758 30813 backend.cpp:76] Failed to create 'aufs' backend: AufsBackend requires
root privileges
W0502 21:15:00.658857 30813 backend.cpp:76] Failed to create 'bind' backend: BindBackend requires
root privileges
I0502 21:15:00.658887 30813 provisioner.cpp:249] Using default backend 'copy'
I0502 21:15:00.660759 30813 cluster.cpp:448] Creating default 'local' authorizer
I0502 21:15:00.662587 30840 slave.cpp:225] Mesos agent started on (747)@172.17.0.2:37654
I0502 21:15:00.662609 30840 slave.cpp:226] Flags at startup: --acls="" --appc_simple_discovery_uri_prefix="http://"
--appc_store_dir="/tmp/mesos/store/appc" --authenticate_http_readonly="true" --authenticate_http_readwrite="true"
--authenticatee="crammd5" --authentication_backoff_factor="1secs" --authorizer="local" --cgroups_cpu_enable_pids_and_tids_count="false"
--cgroups_enable_cfs="false" --cgroups_hierarchy="/sys/fs/cgroup" --cgroups_limit_swap="false"
--cgroups_root="mesos" --container_disk_watch_interval="15secs" --containerizers="mesos" --credential="/tmp/Endpoint_SlaveEndpointTest_NoAuthorizer_0_NOMyCK/credential"
--default_role="*" --disk_watch_interval="1mins" --docker="docker" --docker_kill_orphans="true"
--docker_registry="https://registry-1.docker.io" --docker_remove_delay="6hrs" --docker_socket="/var/run/docker.sock"
--docker_stop_timeout="0ns" --docker_store_dir="/tmp/mesos/store/docker" --docker_volume_checkpoint_dir="/var/run/mesos/isolators/docker/volume"
--enforce_container_disk_quota="false" --executor_registration_timeout="1mins" --executor_shutdown_grace_period="5secs"
--fetcher_cache_dir="/tmp/Endpoint_SlaveEndpointTest_NoAuthorizer_0_NOMyCK/fetch" --fetcher_cache_size="2GB"
--frameworks_home="" --gc_delay="1weeks" --gc_disk_headroom="0.1" --hadoop_home="" --help="false"
--hostname_lookup="true" --http_command_executor="false" --http_credentials="/tmp/Endpoint_SlaveEndpointTest_NoAuthorizer_0_NOMyCK/http_credentials"
--http_heartbeat_interval="30secs" --initialize_driver_logging="true" --isolation="posix/cpu,posix/mem"
--launcher="posix" --launcher_dir="/mesos/mesos-1.3.0/_build/src" --logbufsecs="0" --logging_level="INFO"
--max_completed_executors_per_framework="150" --oversubscribed_resources_interval="15secs"
--perf_duration="10secs" --perf_interval="1mins" --port="5051" --qos_correction_interval_min="0ns"
--quiet="false" --recover="reconnect" --recovery_timeout="15mins" --registration_backoff_factor="10ms"
--resources="cpus:2;gpus:0;mem:1024;disk:1024;ports:[31000-32000]" --revocable_cpu_low_priority="true"
--runtime_dir="/tmp/Endpoint_SlaveEndpointTest_NoAuthorizer_0_NOMyCK" --sandbox_directory="/mnt/mesos/sandbox"
--strict="true" --switch_user="true" --systemd_enable_support="true" --systemd_runtime_directory="/run/systemd/system"
--version="false" --work_dir="/tmp/Endpoint_SlaveEndpointTest_NoAuthorizer_0_U91Tlz"
I0502 21:15:00.662994 30840 credentials.hpp:86] Loading credential for authentication from
'/tmp/Endpoint_SlaveEndpointTest_NoAuthorizer_0_NOMyCK/credential'
I0502 21:15:00.663131 30840 slave.cpp:258] Agent using credential for: test-principal
I0502 21:15:00.663153 30840 credentials.hpp:37] Loading credentials for authentication from
'/tmp/Endpoint_SlaveEndpointTest_NoAuthorizer_0_NOMyCK/http_credentials'
I0502 21:15:00.663360 30840 http.cpp:975] Creating default 'basic' HTTP authenticator for
realm 'mesos-agent-readonly'
I0502 21:15:00.663493 30840 http.cpp:975] Creating default 'basic' HTTP authenticator for
realm 'mesos-agent-readwrite'
I0502 21:15:00.664937 30840 slave.cpp:525] Agent resources: cpus(*):2; mem(*):1024; disk(*):1024;
ports(*):[31000-32000]
I0502 21:15:00.665019 30840 slave.cpp:533] Agent attributes: [  ]
I0502 21:15:00.665032 30840 slave.cpp:538] Agent hostname: 76d571085df6
I0502 21:15:00.665184 30854 status_update_manager.cpp:177] Pausing sending status updates
I0502 21:15:00.666383 30845 state.cpp:62] Recovering state from '/tmp/Endpoint_SlaveEndpointTest_NoAuthorizer_0_U91Tlz/meta'
I0502 21:15:00.666666 30847 status_update_manager.cpp:203] Recovering status update manager
I0502 21:15:00.666887 30854 containerizer.cpp:608] Recovering containerizer
I0502 21:15:00.668561 30851 provisioner.cpp:410] Provisioner recovery complete
I0502 21:15:00.668942 30852 slave.cpp:5963] Finished recovery
I0502 21:15:00.669348 30852 slave.cpp:6145] Querying resource estimator for oversubscribable
resources
I0502 21:15:00.669724 30836 slave.cpp:6159] Received oversubscribable resources {} from the
resource estimator
I0502 21:15:00.671747 30842 process.cpp:3731] Handling HTTP event for process 'slave(747)'
with path: '/slave(747)/monitor/statistics'
I0502 21:15:00.673156 30851 http.cpp:1115] HTTP GET for /slave(747)/monitor/statistics from
172.17.0.2:45508
I0502 21:15:00.673228 30851 http.cpp:936] Authorizing principal 'test-principal' to GET the
'/monitor/statistics' endpoint
I0502 21:15:00.676822 30847 slave.cpp:790] Agent terminating
[       OK ] Endpoint/SlaveEndpointTest.NoAuthorizer/0 (29 ms)
[ RUN      ] Endpoint/SlaveEndpointTest.NoAuthorizer/1
I0502 21:15:00.688277 30813 containerizer.cpp:221] Using isolation: posix/cpu,posix/mem,filesystem/posix,network/cni
W0502 21:15:00.688868 30813 backend.cpp:76] Failed to create 'aufs' backend: AufsBackend requires
root privileges
W0502 21:15:00.688966 30813 backend.cpp:76] Failed to create 'bind' backend: BindBackend requires
root privileges
I0502 21:15:00.689002 30813 provisioner.cpp:249] Using default backend 'copy'
I0502 21:15:00.690559 30813 cluster.cpp:448] Creating default 'local' authorizer
I0502 21:15:00.692191 30855 slave.cpp:225] Mesos agent started on (748)@172.17.0.2:37654
I0502 21:15:00.692210 30855 slave.cpp:226] Flags at startup: --acls="" --appc_simple_discovery_uri_prefix="http://"
--appc_store_dir="/tmp/mesos/store/appc" --authenticate_http_readonly="true" --authenticate_http_readwrite="true"
--authenticatee="crammd5" --authentication_backoff_factor="1secs" --authorizer="local" --cgroups_cpu_enable_pids_and_tids_count="false"
--cgroups_enable_cfs="false" --cgroups_hierarchy="/sys/fs/cgroup" --cgroups_limit_swap="false"
--cgroups_root="mesos" --container_disk_watch_interval="15secs" --containerizers="mesos" --credential="/tmp/Endpoint_SlaveEndpointTest_NoAuthorizer_1_zHv9Vt/credential"
--default_role="*" --disk_watch_interval="1mins" --docker="docker" --docker_kill_orphans="true"
--docker_registry="https://registry-1.docker.io" --docker_remove_delay="6hrs" --docker_socket="/var/run/docker.sock"
--docker_stop_timeout="0ns" --docker_store_dir="/tmp/mesos/store/docker" --docker_volume_checkpoint_dir="/var/run/mesos/isolators/docker/volume"
--enforce_container_disk_quota="false" --executor_registration_timeout="1mins" --executor_shutdown_grace_period="5secs"
--fetcher_cache_dir="/tmp/Endpoint_SlaveEndpointTest_NoAuthorizer_1_zHv9Vt/fetch" --fetcher_cache_size="2GB"
--frameworks_home="" --gc_delay="1weeks" --gc_disk_headroom="0.1" --hadoop_home="" --help="false"
--hostname_lookup="true" --http_command_executor="false" --http_credentials="/tmp/Endpoint_SlaveEndpointTest_NoAuthorizer_1_zHv9Vt/http_credentials"
--http_heartbeat_interval="30secs" --initialize_driver_logging="true" --isolation="posix/cpu,posix/mem"
--launcher="posix" --launcher_dir="/mesos/mesos-1.3.0/_build/src" --logbufsecs="0" --logging_level="INFO"
--max_completed_executors_per_framework="150" --oversubscribed_resources_interval="15secs"
--perf_duration="10secs" --perf_interval="1mins" --port="5051" --qos_correction_interval_min="0ns"
--quiet="false" --recover="reconnect" --recovery_timeout="15mins" --registration_backoff_factor="10ms"
--resources="cpus:2;gpus:0;mem:1024;disk:1024;ports:[31000-32000]" --revocable_cpu_low_priority="true"
--runtime_dir="/tmp/Endpoint_SlaveEndpointTest_NoAuthorizer_1_zHv9Vt" --sandbox_directory="/mnt/mesos/sandbox"
--strict="true" --switch_user="true" --systemd_enable_support="true" --systemd_runtime_directory="/run/systemd/system"
--version="false" --work_dir="/tmp/Endpoint_SlaveEndpointTest_NoAuthorizer_1_8yx4Ai"
I0502 21:15:00.692524 30855 credentials.hpp:86] Loading credential for authentication from
'/tmp/Endpoint_SlaveEndpointTest_NoAuthorizer_1_zHv9Vt/credential'
I0502 21:15:00.692677 30855 slave.cpp:258] Agent using credential for: test-principal
I0502 21:15:00.692701 30855 credentials.hpp:37] Loading credentials for authentication from
'/tmp/Endpoint_SlaveEndpointTest_NoAuthorizer_1_zHv9Vt/http_credentials'
I0502 21:15:00.692937 30855 http.cpp:975] Creating default 'basic' HTTP authenticator for
realm 'mesos-agent-readonly'
I0502 21:15:00.693078 30855 http.cpp:975] Creating default 'basic' HTTP authenticator for
realm 'mesos-agent-readwrite'
I0502 21:15:00.694288 30855 slave.cpp:525] Agent resources: cpus(*):2; mem(*):1024; disk(*):1024;
ports(*):[31000-32000]
I0502 21:15:00.694371 30855 slave.cpp:533] Agent attributes: [  ]
I0502 21:15:00.694384 30855 slave.cpp:538] Agent hostname: 76d571085df6
I0502 21:15:00.694538 30843 status_update_manager.cpp:177] Pausing sending status updates
I0502 21:15:00.695829 30843 state.cpp:62] Recovering state from '/tmp/Endpoint_SlaveEndpointTest_NoAuthorizer_1_8yx4Ai/meta'
I0502 21:15:00.696121 30836 status_update_manager.cpp:203] Recovering status update manager
I0502 21:15:00.696403 30852 containerizer.cpp:608] Recovering containerizer
I0502 21:15:00.697710 30836 provisioner.cpp:410] Provisioner recovery complete
I0502 21:15:00.698098 30833 slave.cpp:5963] Finished recovery
I0502 21:15:00.698634 30833 slave.cpp:6145] Querying resource estimator for oversubscribable
resources
I0502 21:15:00.698930 30836 slave.cpp:6159] Received oversubscribable resources {} from the
resource estimator
I0502 21:15:00.700932 30842 process.cpp:3731] Handling HTTP event for process 'slave(748)'
with path: '/slave(748)/monitor/statistics.json'
I0502 21:15:00.702198 30841 http.cpp:1115] HTTP GET for /slave(748)/monitor/statistics.json
from 172.17.0.2:45510
I0502 21:15:00.702262 30841 http.cpp:936] Authorizing principal 'test-principal' to GET the
'/monitor/statistics.json' endpoint
I0502 21:15:00.705377 30843 slave.cpp:790] Agent terminating
[       OK ] Endpoint/SlaveEndpointTest.NoAuthorizer/1 (27 ms)
[ RUN      ] Endpoint/SlaveEndpointTest.NoAuthorizer/2
I0502 21:15:00.715680 30813 containerizer.cpp:221] Using isolation: posix/cpu,posix/mem,filesystem/posix,network/cni
W0502 21:15:00.716183 30813 backend.cpp:76] Failed to create 'aufs' backend: AufsBackend requires
root privileges
W0502 21:15:00.716275 30813 backend.cpp:76] Failed to create 'bind' backend: BindBackend requires
root privileges
I0502 21:15:00.716311 30813 provisioner.cpp:249] Using default backend 'copy'
I0502 21:15:00.717993 30813 cluster.cpp:448] Creating default 'local' authorizer
I0502 21:15:00.719945 30849 slave.cpp:225] Mesos agent started on (749)@172.17.0.2:37654
I0502 21:15:00.719972 30849 slave.cpp:226] Flags at startup: --acls="" --appc_simple_discovery_uri_prefix="http://"
--appc_store_dir="/tmp/mesos/store/appc" --authenticate_http_readonly="true" --authenticate_http_readwrite="true"
--authenticatee="crammd5" --authentication_backoff_factor="1secs" --authorizer="local" --cgroups_cpu_enable_pids_and_tids_count="false"
--cgroups_enable_cfs="false" --cgroups_hierarchy="/sys/fs/cgroup" --cgroups_limit_swap="false"
--cgroups_root="mesos" --container_disk_watch_interval="15secs" --containerizers="mesos" --credential="/tmp/Endpoint_SlaveEndpointTest_NoAuthorizer_2_HW3pwd/credential"
--default_role="*" --disk_watch_interval="1mins" --docker="docker" --docker_kill_orphans="true"
--docker_registry="https://registry-1.docker.io" --docker_remove_delay="6hrs" --docker_socket="/var/run/docker.sock"
--docker_stop_timeout="0ns" --docker_store_dir="/tmp/mesos/store/docker" --docker_volume_checkpoint_dir="/var/run/mesos/isolators/docker/volume"
--enforce_container_disk_quota="false" --executor_registration_timeout="1mins" --executor_shutdown_grace_period="5secs"
--fetcher_cache_dir="/tmp/Endpoint_SlaveEndpointTest_NoAuthorizer_2_HW3pwd/fetch" --fetcher_cache_size="2GB"
--frameworks_home="" --gc_delay="1weeks" --gc_disk_headroom="0.1" --hadoop_home="" --help="false"
--hostname_lookup="true" --http_command_executor="false" --http_credentials="/tmp/Endpoint_SlaveEndpointTest_NoAuthorizer_2_HW3pwd/http_credentials"
--http_heartbeat_interval="30secs" --initialize_driver_logging="true" --isolation="posix/cpu,posix/mem"
--launcher="posix" --launcher_dir="/mesos/mesos-1.3.0/_build/src" --logbufsecs="0" --logging_level="INFO"
--max_completed_executors_per_framework="150" --oversubscribed_resources_interval="15secs"
--perf_duration="10secs" --perf_interval="1mins" --port="5051" --qos_correction_interval_min="0ns"
--quiet="false" --recover="reconnect" --recovery_timeout="15mins" --registration_backoff_factor="10ms"
--resources="cpus:2;gpus:0;mem:1024;disk:1024;ports:[31000-32000]" --revocable_cpu_low_priority="true"
--runtime_dir="/tmp/Endpoint_SlaveEndpointTest_NoAuthorizer_2_HW3pwd" --sandbox_directory="/mnt/mesos/sandbox"
--strict="true" --switch_user="true" --systemd_enable_support="true" --systemd_runtime_directory="/run/systemd/system"
--version="false" --work_dir="/tmp/Endpoint_SlaveEndpointTest_NoAuthorizer_2_4Koe71"
I0502 21:15:00.720362 30849 credentials.hpp:86] Loading credential for authentication from
'/tmp/Endpoint_SlaveEndpointTest_NoAuthorizer_2_HW3pwd/credential'
I0502 21:15:00.720508 30849 slave.cpp:258] Agent using credential for: test-principal
I0502 21:15:00.720533 30849 credentials.hpp:37] Loading credentials for authentication from
'/tmp/Endpoint_SlaveEndpointTest_NoAuthorizer_2_HW3pwd/http_credentials'
I0502 21:15:00.720749 30849 http.cpp:975] Creating default 'basic' HTTP authenticator for
realm 'mesos-agent-readonly'
I0502 21:15:00.720887 30849 http.cpp:975] Creating default 'basic' HTTP authenticator for
realm 'mesos-agent-readwrite'
I0502 21:15:00.722117 30849 slave.cpp:525] Agent resources: cpus(*):2; mem(*):1024; disk(*):1024;
ports(*):[31000-32000]
I0502 21:15:00.722201 30849 slave.cpp:533] Agent attributes: [  ]
I0502 21:15:00.722219 30849 slave.cpp:538] Agent hostname: 76d571085df6
I0502 21:15:00.722357 30845 status_update_manager.cpp:177] Pausing sending status updates
I0502 21:15:00.723533 30851 state.cpp:62] Recovering state from '/tmp/Endpoint_SlaveEndpointTest_NoAuthorizer_2_4Koe71/meta'
I0502 21:15:00.723788 30835 status_update_manager.cpp:203] Recovering status update manager
I0502 21:15:00.724050 30847 containerizer.cpp:608] Recovering containerizer
I0502 21:15:00.725456 30839 provisioner.cpp:410] Provisioner recovery complete
I0502 21:15:00.725853 30849 slave.cpp:5963] Finished recovery
I0502 21:15:00.726274 30849 slave.cpp:6145] Querying resource estimator for oversubscribable
resources
I0502 21:15:00.726712 30843 slave.cpp:6159] Received oversubscribable resources {} from the
resource estimator
I0502 21:15:00.728730 30853 process.cpp:3731] Handling HTTP event for process 'slave(749)'
with path: '/slave(749)/containers'
I0502 21:15:00.729887 30845 http.cpp:1115] HTTP GET for /slave(749)/containers from 172.17.0.2:45512
I0502 21:15:00.729954 30845 http.cpp:936] Authorizing principal 'test-principal' to GET the
'/containers' endpoint
I0502 21:15:00.733254 30841 slave.cpp:790] Agent terminating
[       OK ] Endpoint/SlaveEndpointTest.NoAuthorizer/2 (28 ms)
[----------] 9 tests from Endpoint/SlaveEndpointTest (261 ms total)

[----------] Global test environment tear-down
[==========] 1569 tests from 175 test cases ran. (477997 ms total)
[  PASSED  ] 1568 tests.
[  FAILED  ] 1 test, listed below:
[  FAILED  ] RegisterSlaveValidationTest.DropInvalidRegistration

 1 FAILED TEST
  YOU HAVE 19 DISABLED TESTS

E0502 21:15:00.798188 30856 process.cpp:951] Failed to accept socket: future discarded
make[4]: *** [check-local] Error 1
make[4]: Leaving directory `/mesos/mesos-1.3.0/_build/src'
make[3]: *** [check-am] Error 2
make[3]: Leaving directory `/mesos/mesos-1.3.0/_build/src'
make[2]: *** [check] Error 2
make[2]: Leaving directory `/mesos/mesos-1.3.0/_build/src'
make[1]: *** [check-recursive] Error 1
make[1]: Leaving directory `/mesos/mesos-1.3.0/_build'
make: *** [distcheck] Error 1
+ docker rmi mesos-1493757087-491
Untagged: mesos-1493757087-491:latest
Deleted: sha256:4f60c4e8ab0296a10873d36c8c1bbc6bd7fd63acb7165878fd8377d178e45b5a
Deleted: sha256:52a603f5be954dde3f8e0f0955275440f11c7489e3a6261dad3732fd200e5187
Deleted: sha256:e585985b8a7bba6b55f2535889769c006f20663603e7c1e408268a778ddbfacc
Deleted: sha256:013a45288ad1385ce085290cb3ee8f79d0fbd5f58db47d1f4fae2d58bdeb479a
Deleted: sha256:e88b5c6c9bfaa793936c9b9ec3a53bb069c007dcb191c3b14f21e1379015af4d
Deleted: sha256:d672296383c8d129141042745250d09fbcd93f181ca96e533f686b74d0cfe3ba
Deleted: sha256:8fd2926ef65bd2595c89077f7cb85190e0fc1e62048f06fed5b572b6e51eaa19
Deleted: sha256:c7695dbda9a572687af6f03779ef27f4ce42ad4ac1f07d870f0b9368fc3ee19d
Deleted: sha256:9324a89c427dd484680fda70a54adb5ce346bbffca76e5c82bbf09a664ca2c14
Deleted: sha256:cbbb5b5ed5721064fbab94989544e8e052618761865284b21fc59685aa4cfb01
Deleted: sha256:6616f54c07bd6149bb1ec5ceda4326dc24c7392355298fb4d153a454070bd939
Deleted: sha256:a304fb97aa4bd0d4d70371aceabd01c9919d7b83cee6b9a78f13c2a00c69b9ed
Deleted: sha256:fa1e159b34ef280db9331a91e85ad4e7c4b0a5e25d2c06e3d998fecfc42cb004
Deleted: sha256:31fa3ca3d4801597cadb67c968cdaa8b0aa667d6808fed2590f0546a0e5015b8
Deleted: sha256:8f9eb1e2dbc3761471ce40eaadfb3d8a5d94f306438ebba5213374d9176d4d58
Deleted: sha256:0640adb8e5d7663fd3d203425c6cc94e26b3e56b2c5a4c507380c39cfbe1c667
Deleted: sha256:5b855ce447b8d661cf29136e83e2f6aaca71a1b487c2447c0969e549ac46617b
Deleted: sha256:b096135d0f0ab4aaa9c295fb9240bdc68cd941948bc5cbe783d82bb34480ada2
Deleted: sha256:a48486e8cb5b348f037ca8464aee2f0aeedbd7063b4f20a42eeab3dbce768d6c
Deleted: sha256:3c14657f29bf9f43cd46171739899bd8cac3104e8c2a2d74e5554049667dad56
Deleted: sha256:4b25821a2a13b978dc6713d882916dc641596b00ad2c140e331c6912465de0a6
Deleted: sha256:8e68e17ef62fdefe26644456d17e19cc5bcb4a855d5e29cb6ca4ec03ebe4a183
Deleted: sha256:43e27cd06e0762c78673cd54f2f4956f0789edf99e8c2c290aca8a11b705e137
Deleted: sha256:1b57061fba67184a1a680f31a7a87689d4575c8a3dbee6772b9a768b059a8122
Build step 'Execute shell' marked build as failure

Mime
View raw message