mesos-builds mailing list archives

Site index · List index
Message view « Date » · « Thread »
Top « Date » · « Thread »
From Apache Jenkins Server <jenk...@builds.apache.org>
Subject Build failed in Jenkins: Mesos-Reviewbot #18126
Date Fri, 19 May 2017 20:46:43 GMT
See <https://builds.apache.org/job/Mesos-Reviewbot/18126/display/redirect>

------------------------------------------
[...truncated 27.09 MB...]
I0519 20:46:38.258733 30924 slave.cpp:794] Agent terminating
[       OK ] Endpoint/SlaveEndpointTest.AuthorizedRequest/1 (27 ms)
[ RUN      ] Endpoint/SlaveEndpointTest.AuthorizedRequest/2
I0519 20:46:38.268759 30888 containerizer.cpp:221] Using isolation: posix/cpu,posix/mem,filesystem/posix,network/cni
W0519 20:46:38.269274 30888 backend.cpp:76] Failed to create 'aufs' backend: AufsBackend requires
root privileges
W0519 20:46:38.269373 30888 backend.cpp:76] Failed to create 'bind' backend: BindBackend requires
root privileges
I0519 20:46:38.269405 30888 provisioner.cpp:249] Using default backend 'copy'
I0519 20:46:38.273838 30923 slave.cpp:225] Mesos agent started on (746)@172.17.0.2:39821
I0519 20:46:38.273862 30923 slave.cpp:226] Flags at startup: --acls="" --appc_simple_discovery_uri_prefix="http://"
--appc_store_dir="/tmp/mesos/store/appc" --authenticate_http_readonly="true" --authenticate_http_readwrite="true"
--authenticatee="crammd5" --authentication_backoff_factor="1secs" --authorizer="local" --cgroups_cpu_enable_pids_and_tids_count="false"
--cgroups_enable_cfs="false" --cgroups_hierarchy="/sys/fs/cgroup" --cgroups_limit_swap="false"
--cgroups_root="mesos" --container_disk_watch_interval="15secs" --containerizers="mesos" --credential="/tmp/Endpoint_SlaveEndpointTest_AuthorizedRequest_2_24GaMf/credential"
--default_role="*" --disk_watch_interval="1mins" --docker="docker" --docker_kill_orphans="true"
--docker_registry="https://registry-1.docker.io" --docker_remove_delay="6hrs" --docker_socket="/var/run/docker.sock"
--docker_stop_timeout="0ns" --docker_store_dir="/tmp/mesos/store/docker" --docker_volume_checkpoint_dir="/var/run/mesos/isolators/docker/volume"
--enforce_container_disk_quota="false" --executor_registration_timeout="1mins" --executor_shutdown_grace_period="5secs"
--fetcher_cache_dir="/tmp/Endpoint_SlaveEndpointTest_AuthorizedRequest_2_24GaMf/fetch" --fetcher_cache_size="2GB"
--frameworks_home="" --gc_delay="1weeks" --gc_disk_headroom="0.1" --hadoop_home="" --help="false"
--hostname_lookup="true" --http_command_executor="false" --http_credentials="/tmp/Endpoint_SlaveEndpointTest_AuthorizedRequest_2_24GaMf/http_credentials"
--http_heartbeat_interval="30secs" --initialize_driver_logging="true" --isolation="posix/cpu,posix/mem"
--launcher="posix" --launcher_dir="/mesos/mesos-1.4.0/_build/src" --logbufsecs="0" --logging_level="INFO"
--max_completed_executors_per_framework="150" --oversubscribed_resources_interval="15secs"
--perf_duration="10secs" --perf_interval="1mins" --port="5051" --qos_correction_interval_min="0ns"
--quiet="false" --recover="reconnect" --recovery_timeout="15mins" --registration_backoff_factor="10ms"
--resources="cpus:2;gpus:0;mem:1024;disk:1024;ports:[31000-32000]" --revocable_cpu_low_priority="true"
--runtime_dir="/tmp/Endpoint_SlaveEndpointTest_AuthorizedRequest_2_24GaMf" --sandbox_directory="/mnt/mesos/sandbox"
--strict="true" --switch_user="true" --systemd_enable_support="true" --systemd_runtime_directory="/run/systemd/system"
--version="false" --work_dir="/tmp/Endpoint_SlaveEndpointTest_AuthorizedRequest_2_Wa0dCC"
I0519 20:46:38.274245 30923 credentials.hpp:86] Loading credential for authentication from
'/tmp/Endpoint_SlaveEndpointTest_AuthorizedRequest_2_24GaMf/credential'
I0519 20:46:38.274384 30923 slave.cpp:258] Agent using credential for: test-principal
I0519 20:46:38.274405 30923 credentials.hpp:37] Loading credentials for authentication from
'/tmp/Endpoint_SlaveEndpointTest_AuthorizedRequest_2_24GaMf/http_credentials'
I0519 20:46:38.274632 30923 http.cpp:975] Creating default 'basic' HTTP authenticator for
realm 'mesos-agent-readonly'
I0519 20:46:38.274788 30923 http.cpp:975] Creating default 'basic' HTTP authenticator for
realm 'mesos-agent-readwrite'
I0519 20:46:38.276053 30923 slave.cpp:529] Agent resources: cpus(*):2; mem(*):1024; disk(*):1024;
ports(*):[31000-32000]
I0519 20:46:38.276131 30923 slave.cpp:537] Agent attributes: [  ]
I0519 20:46:38.276144 30923 slave.cpp:542] Agent hostname: 920afd45b524
I0519 20:46:38.276298 30927 status_update_manager.cpp:177] Pausing sending status updates
I0519 20:46:38.277724 30913 state.cpp:62] Recovering state from '/tmp/Endpoint_SlaveEndpointTest_AuthorizedRequest_2_Wa0dCC/meta'
I0519 20:46:38.278122 30927 status_update_manager.cpp:203] Recovering status update manager
I0519 20:46:38.278440 30921 containerizer.cpp:608] Recovering containerizer
I0519 20:46:38.279716 30910 provisioner.cpp:410] Provisioner recovery complete
I0519 20:46:38.280234 30927 slave.cpp:5974] Finished recovery
I0519 20:46:38.280668 30927 slave.cpp:6156] Querying resource estimator for oversubscribable
resources
I0519 20:46:38.281129 30929 slave.cpp:6170] Received oversubscribable resources {} from the
resource estimator
I0519 20:46:38.283143 30918 process.cpp:3730] Handling HTTP event for process 'slave(746)'
with path: '/slave(746)/containers'
I0519 20:46:38.284477 30908 http.cpp:1115] HTTP GET for /slave(746)/containers from 172.17.0.2:56530
I0519 20:46:38.284574 30908 http.cpp:936] Authorizing principal 'test-principal' to GET the
'/containers' endpoint
I0519 20:46:38.288410 30920 slave.cpp:794] Agent terminating
[       OK ] Endpoint/SlaveEndpointTest.AuthorizedRequest/2 (29 ms)
[ RUN      ] Endpoint/SlaveEndpointTest.UnauthorizedRequest/0
I0519 20:46:38.298251 30888 containerizer.cpp:221] Using isolation: posix/cpu,posix/mem,filesystem/posix,network/cni
W0519 20:46:38.298749 30888 backend.cpp:76] Failed to create 'aufs' backend: AufsBackend requires
root privileges
W0519 20:46:38.298844 30888 backend.cpp:76] Failed to create 'bind' backend: BindBackend requires
root privileges
I0519 20:46:38.298874 30888 provisioner.cpp:249] Using default backend 'copy'
I0519 20:46:38.302819 30910 slave.cpp:225] Mesos agent started on (747)@172.17.0.2:39821
I0519 20:46:38.302839 30910 slave.cpp:226] Flags at startup: --acls="" --appc_simple_discovery_uri_prefix="http://"
--appc_store_dir="/tmp/mesos/store/appc" --authenticate_http_readonly="true" --authenticate_http_readwrite="true"
--authenticatee="crammd5" --authentication_backoff_factor="1secs" --authorizer="local" --cgroups_cpu_enable_pids_and_tids_count="false"
--cgroups_enable_cfs="false" --cgroups_hierarchy="/sys/fs/cgroup" --cgroups_limit_swap="false"
--cgroups_root="mesos" --container_disk_watch_interval="15secs" --containerizers="mesos" --credential="/tmp/Endpoint_SlaveEndpointTest_UnauthorizedRequest_0_KzC3EM/credential"
--default_role="*" --disk_watch_interval="1mins" --docker="docker" --docker_kill_orphans="true"
--docker_registry="https://registry-1.docker.io" --docker_remove_delay="6hrs" --docker_socket="/var/run/docker.sock"
--docker_stop_timeout="0ns" --docker_store_dir="/tmp/mesos/store/docker" --docker_volume_checkpoint_dir="/var/run/mesos/isolators/docker/volume"
--enforce_container_disk_quota="false" --executor_registration_timeout="1mins" --executor_shutdown_grace_period="5secs"
--fetcher_cache_dir="/tmp/Endpoint_SlaveEndpointTest_UnauthorizedRequest_0_KzC3EM/fetch" --fetcher_cache_size="2GB"
--frameworks_home="" --gc_delay="1weeks" --gc_disk_headroom="0.1" --hadoop_home="" --help="false"
--hostname_lookup="true" --http_command_executor="false" --http_credentials="/tmp/Endpoint_SlaveEndpointTest_UnauthorizedRequest_0_KzC3EM/http_credentials"
--http_heartbeat_interval="30secs" --initialize_driver_logging="true" --isolation="posix/cpu,posix/mem"
--launcher="posix" --launcher_dir="/mesos/mesos-1.4.0/_build/src" --logbufsecs="0" --logging_level="INFO"
--max_completed_executors_per_framework="150" --oversubscribed_resources_interval="15secs"
--perf_duration="10secs" --perf_interval="1mins" --port="5051" --qos_correction_interval_min="0ns"
--quiet="false" --recover="reconnect" --recovery_timeout="15mins" --registration_backoff_factor="10ms"
--resources="cpus:2;gpus:0;mem:1024;disk:1024;ports:[31000-32000]" --revocable_cpu_low_priority="true"
--runtime_dir="/tmp/Endpoint_SlaveEndpointTest_UnauthorizedRequest_0_KzC3EM" --sandbox_directory="/mnt/mesos/sandbox"
--strict="true" --switch_user="true" --systemd_enable_support="true" --systemd_runtime_directory="/run/systemd/system"
--version="false" --work_dir="/tmp/Endpoint_SlaveEndpointTest_UnauthorizedRequest_0_IPUGq9"
I0519 20:46:38.303227 30910 credentials.hpp:86] Loading credential for authentication from
'/tmp/Endpoint_SlaveEndpointTest_UnauthorizedRequest_0_KzC3EM/credential'
I0519 20:46:38.303373 30910 slave.cpp:258] Agent using credential for: test-principal
I0519 20:46:38.303395 30910 credentials.hpp:37] Loading credentials for authentication from
'/tmp/Endpoint_SlaveEndpointTest_UnauthorizedRequest_0_KzC3EM/http_credentials'
I0519 20:46:38.303603 30910 http.cpp:975] Creating default 'basic' HTTP authenticator for
realm 'mesos-agent-readonly'
I0519 20:46:38.303742 30910 http.cpp:975] Creating default 'basic' HTTP authenticator for
realm 'mesos-agent-readwrite'
I0519 20:46:38.305129 30910 slave.cpp:529] Agent resources: cpus(*):2; mem(*):1024; disk(*):1024;
ports(*):[31000-32000]
I0519 20:46:38.305212 30910 slave.cpp:537] Agent attributes: [  ]
I0519 20:46:38.305222 30910 slave.cpp:542] Agent hostname: 920afd45b524
I0519 20:46:38.305352 30921 status_update_manager.cpp:177] Pausing sending status updates
I0519 20:46:38.306489 30920 state.cpp:62] Recovering state from '/tmp/Endpoint_SlaveEndpointTest_UnauthorizedRequest_0_IPUGq9/meta'
I0519 20:46:38.306726 30909 status_update_manager.cpp:203] Recovering status update manager
I0519 20:46:38.307090 30926 containerizer.cpp:608] Recovering containerizer
I0519 20:46:38.308358 30909 provisioner.cpp:410] Provisioner recovery complete
I0519 20:46:38.308770 30919 slave.cpp:5974] Finished recovery
I0519 20:46:38.309231 30919 slave.cpp:6156] Querying resource estimator for oversubscribable
resources
I0519 20:46:38.309492 30907 slave.cpp:6170] Received oversubscribable resources {} from the
resource estimator
I0519 20:46:38.311570 30926 process.cpp:3730] Handling HTTP event for process 'slave(747)'
with path: '/slave(747)/monitor/statistics'
I0519 20:46:38.313078 30925 http.cpp:1115] HTTP GET for /slave(747)/monitor/statistics from
172.17.0.2:56532
I0519 20:46:38.313144 30925 http.cpp:936] Authorizing principal 'test-principal' to GET the
'/monitor/statistics' endpoint
I0519 20:46:38.316520 30930 slave.cpp:794] Agent terminating
[       OK ] Endpoint/SlaveEndpointTest.UnauthorizedRequest/0 (27 ms)
[ RUN      ] Endpoint/SlaveEndpointTest.UnauthorizedRequest/1
I0519 20:46:38.326206 30888 containerizer.cpp:221] Using isolation: posix/cpu,posix/mem,filesystem/posix,network/cni
W0519 20:46:38.326737 30888 backend.cpp:76] Failed to create 'aufs' backend: AufsBackend requires
root privileges
W0519 20:46:38.326836 30888 backend.cpp:76] Failed to create 'bind' backend: BindBackend requires
root privileges
I0519 20:46:38.326866 30888 provisioner.cpp:249] Using default backend 'copy'
I0519 20:46:38.330610 30920 slave.cpp:225] Mesos agent started on (748)@172.17.0.2:39821
I0519 20:46:38.330636 30920 slave.cpp:226] Flags at startup: --acls="" --appc_simple_discovery_uri_prefix="http://"
--appc_store_dir="/tmp/mesos/store/appc" --authenticate_http_readonly="true" --authenticate_http_readwrite="true"
--authenticatee="crammd5" --authentication_backoff_factor="1secs" --authorizer="local" --cgroups_cpu_enable_pids_and_tids_count="false"
--cgroups_enable_cfs="false" --cgroups_hierarchy="/sys/fs/cgroup" --cgroups_limit_swap="false"
--cgroups_root="mesos" --container_disk_watch_interval="15secs" --containerizers="mesos" --credential="/tmp/Endpoint_SlaveEndpointTest_UnauthorizedRequest_1_UztHOj/credential"
--default_role="*" --disk_watch_interval="1mins" --docker="docker" --docker_kill_orphans="true"
--docker_registry="https://registry-1.docker.io" --docker_remove_delay="6hrs" --docker_socket="/var/run/docker.sock"
--docker_stop_timeout="0ns" --docker_store_dir="/tmp/mesos/store/docker" --docker_volume_checkpoint_dir="/var/run/mesos/isolators/docker/volume"
--enforce_container_disk_quota="false" --executor_registration_timeout="1mins" --executor_shutdown_grace_period="5secs"
--fetcher_cache_dir="/tmp/Endpoint_SlaveEndpointTest_UnauthorizedRequest_1_UztHOj/fetch" --fetcher_cache_size="2GB"
--frameworks_home="" --gc_delay="1weeks" --gc_disk_headroom="0.1" --hadoop_home="" --help="false"
--hostname_lookup="true" --http_command_executor="false" --http_credentials="/tmp/Endpoint_SlaveEndpointTest_UnauthorizedRequest_1_UztHOj/http_credentials"
--http_heartbeat_interval="30secs" --initialize_driver_logging="true" --isolation="posix/cpu,posix/mem"
--launcher="posix" --launcher_dir="/mesos/mesos-1.4.0/_build/src" --logbufsecs="0" --logging_level="INFO"
--max_completed_executors_per_framework="150" --oversubscribed_resources_interval="15secs"
--perf_duration="10secs" --perf_interval="1mins" --port="5051" --qos_correction_interval_min="0ns"
--quiet="false" --recover="reconnect" --recovery_timeout="15mins" --registration_backoff_factor="10ms"
--resources="cpus:2;gpus:0;mem:1024;disk:1024;ports:[31000-32000]" --revocable_cpu_low_priority="true"
--runtime_dir="/tmp/Endpoint_SlaveEndpointTest_UnauthorizedRequest_1_UztHOj" --sandbox_directory="/mnt/mesos/sandbox"
--strict="true" --switch_user="true" --systemd_enable_support="true" --systemd_runtime_directory="/run/systemd/system"
--version="false" --work_dir="/tmp/Endpoint_SlaveEndpointTest_UnauthorizedRequest_1_oQV9vG"
I0519 20:46:38.331002 30920 credentials.hpp:86] Loading credential for authentication from
'/tmp/Endpoint_SlaveEndpointTest_UnauthorizedRequest_1_UztHOj/credential'
I0519 20:46:38.331171 30920 slave.cpp:258] Agent using credential for: test-principal
I0519 20:46:38.331192 30920 credentials.hpp:37] Loading credentials for authentication from
'/tmp/Endpoint_SlaveEndpointTest_UnauthorizedRequest_1_UztHOj/http_credentials'
I0519 20:46:38.331429 30920 http.cpp:975] Creating default 'basic' HTTP authenticator for
realm 'mesos-agent-readonly'
I0519 20:46:38.331574 30920 http.cpp:975] Creating default 'basic' HTTP authenticator for
realm 'mesos-agent-readwrite'
I0519 20:46:38.332880 30920 slave.cpp:529] Agent resources: cpus(*):2; mem(*):1024; disk(*):1024;
ports(*):[31000-32000]
I0519 20:46:38.332969 30920 slave.cpp:537] Agent attributes: [  ]
I0519 20:46:38.332988 30920 slave.cpp:542] Agent hostname: 920afd45b524
I0519 20:46:38.333178 30910 status_update_manager.cpp:177] Pausing sending status updates
I0519 20:46:38.334520 30930 state.cpp:62] Recovering state from '/tmp/Endpoint_SlaveEndpointTest_UnauthorizedRequest_1_oQV9vG/meta'
I0519 20:46:38.334811 30914 status_update_manager.cpp:203] Recovering status update manager
I0519 20:46:38.335001 30911 containerizer.cpp:608] Recovering containerizer
I0519 20:46:38.336311 30916 provisioner.cpp:410] Provisioner recovery complete
I0519 20:46:38.336700 30908 slave.cpp:5974] Finished recovery
I0519 20:46:38.337294 30908 slave.cpp:6156] Querying resource estimator for oversubscribable
resources
I0519 20:46:38.337661 30927 slave.cpp:6170] Received oversubscribable resources {} from the
resource estimator
I0519 20:46:38.339650 30918 process.cpp:3730] Handling HTTP event for process 'slave(748)'
with path: '/slave(748)/monitor/statistics.json'
I0519 20:46:38.340901 30914 http.cpp:1115] HTTP GET for /slave(748)/monitor/statistics.json
from 172.17.0.2:56534
I0519 20:46:38.340960 30914 http.cpp:936] Authorizing principal 'test-principal' to GET the
'/monitor/statistics.json' endpoint
I0519 20:46:38.343161 30916 slave.cpp:794] Agent terminating
[       OK ] Endpoint/SlaveEndpointTest.UnauthorizedRequest/1 (26 ms)
[ RUN      ] Endpoint/SlaveEndpointTest.UnauthorizedRequest/2
I0519 20:46:38.353165 30888 containerizer.cpp:221] Using isolation: posix/cpu,posix/mem,filesystem/posix,network/cni
W0519 20:46:38.354003 30888 backend.cpp:76] Failed to create 'aufs' backend: AufsBackend requires
root privileges
W0519 20:46:38.354157 30888 backend.cpp:76] Failed to create 'bind' backend: BindBackend requires
root privileges
I0519 20:46:38.354193 30888 provisioner.cpp:249] Using default backend 'copy'
I0519 20:46:38.358165 30913 slave.cpp:225] Mesos agent started on (749)@172.17.0.2:39821
I0519 20:46:38.358196 30913 slave.cpp:226] Flags at startup: --acls="" --appc_simple_discovery_uri_prefix="http://"
--appc_store_dir="/tmp/mesos/store/appc" --authenticate_http_readonly="true" --authenticate_http_readwrite="true"
--authenticatee="crammd5" --authentication_backoff_factor="1secs" --authorizer="local" --cgroups_cpu_enable_pids_and_tids_count="false"
--cgroups_enable_cfs="false" --cgroups_hierarchy="/sys/fs/cgroup" --cgroups_limit_swap="false"
--cgroups_root="mesos" --container_disk_watch_interval="15secs" --containerizers="mesos" --credential="/tmp/Endpoint_SlaveEndpointTest_UnauthorizedRequest_2_I1LreR/credential"
--default_role="*" --disk_watch_interval="1mins" --docker="docker" --docker_kill_orphans="true"
--docker_registry="https://registry-1.docker.io" --docker_remove_delay="6hrs" --docker_socket="/var/run/docker.sock"
--docker_stop_timeout="0ns" --docker_store_dir="/tmp/mesos/store/docker" --docker_volume_checkpoint_dir="/var/run/mesos/isolators/docker/volume"
--enforce_container_disk_quota="false" --executor_registration_timeout="1mins" --executor_shutdown_grace_period="5secs"
--fetcher_cache_dir="/tmp/Endpoint_SlaveEndpointTest_UnauthorizedRequest_2_I1LreR/fetch" --fetcher_cache_size="2GB"
--frameworks_home="" --gc_delay="1weeks" --gc_disk_headroom="0.1" --hadoop_home="" --help="false"
--hostname_lookup="true" --http_command_executor="false" --http_credentials="/tmp/Endpoint_SlaveEndpointTest_UnauthorizedRequest_2_I1LreR/http_credentials"
--http_heartbeat_interval="30secs" --initialize_driver_logging="true" --isolation="posix/cpu,posix/mem"
--launcher="posix" --launcher_dir="/mesos/mesos-1.4.0/_build/src" --logbufsecs="0" --logging_level="INFO"
--max_completed_executors_per_framework="150" --oversubscribed_resources_interval="15secs"
--perf_duration="10secs" --perf_interval="1mins" --port="5051" --qos_correction_interval_min="0ns"
--quiet="false" --recover="reconnect" --recovery_timeout="15mins" --registration_backoff_factor="10ms"
--resources="cpus:2;gpus:0;mem:1024;disk:1024;ports:[31000-32000]" --revocable_cpu_low_priority="true"
--runtime_dir="/tmp/Endpoint_SlaveEndpointTest_UnauthorizedRequest_2_I1LreR" --sandbox_directory="/mnt/mesos/sandbox"
--strict="true" --switch_user="true" --systemd_enable_support="true" --systemd_runtime_directory="/run/systemd/system"
--version="false" --work_dir="/tmp/Endpoint_SlaveEndpointTest_UnauthorizedRequest_2_8NuVRd"
I0519 20:46:38.358592 30913 credentials.hpp:86] Loading credential for authentication from
'/tmp/Endpoint_SlaveEndpointTest_UnauthorizedRequest_2_I1LreR/credential'
I0519 20:46:38.358737 30913 slave.cpp:258] Agent using credential for: test-principal
I0519 20:46:38.358759 30913 credentials.hpp:37] Loading credentials for authentication from
'/tmp/Endpoint_SlaveEndpointTest_UnauthorizedRequest_2_I1LreR/http_credentials'
I0519 20:46:38.358961 30913 http.cpp:975] Creating default 'basic' HTTP authenticator for
realm 'mesos-agent-readonly'
I0519 20:46:38.359097 30913 http.cpp:975] Creating default 'basic' HTTP authenticator for
realm 'mesos-agent-readwrite'
I0519 20:46:38.360452 30913 slave.cpp:529] Agent resources: cpus(*):2; mem(*):1024; disk(*):1024;
ports(*):[31000-32000]
I0519 20:46:38.360532 30913 slave.cpp:537] Agent attributes: [  ]
I0519 20:46:38.360544 30913 slave.cpp:542] Agent hostname: 920afd45b524
I0519 20:46:38.360678 30925 status_update_manager.cpp:177] Pausing sending status updates
I0519 20:46:38.361776 30922 state.cpp:62] Recovering state from '/tmp/Endpoint_SlaveEndpointTest_UnauthorizedRequest_2_8NuVRd/meta'
I0519 20:46:38.362121 30921 status_update_manager.cpp:203] Recovering status update manager
I0519 20:46:38.362383 30907 containerizer.cpp:608] Recovering containerizer
I0519 20:46:38.363867 30916 provisioner.cpp:410] Provisioner recovery complete
I0519 20:46:38.364264 30918 slave.cpp:5974] Finished recovery
I0519 20:46:38.364660 30918 slave.cpp:6156] Querying resource estimator for oversubscribable
resources
I0519 20:46:38.365094 30925 slave.cpp:6170] Received oversubscribable resources {} from the
resource estimator
I0519 20:46:38.367331 30922 process.cpp:3730] Handling HTTP event for process 'slave(749)'
with path: '/slave(749)/containers'
I0519 20:46:38.368680 30908 http.cpp:1115] HTTP GET for /slave(749)/containers from 172.17.0.2:56536
I0519 20:46:38.368746 30908 http.cpp:936] Authorizing principal 'test-principal' to GET the
'/containers' endpoint
I0519 20:46:38.371721 30925 slave.cpp:794] Agent terminating
[       OK ] Endpoint/SlaveEndpointTest.UnauthorizedRequest/2 (28 ms)
[ RUN      ] Endpoint/SlaveEndpointTest.NoAuthorizer/0
I0519 20:46:38.382062 30888 containerizer.cpp:221] Using isolation: posix/cpu,posix/mem,filesystem/posix,network/cni
W0519 20:46:38.382565 30888 backend.cpp:76] Failed to create 'aufs' backend: AufsBackend requires
root privileges
W0519 20:46:38.382663 30888 backend.cpp:76] Failed to create 'bind' backend: BindBackend requires
root privileges
I0519 20:46:38.382695 30888 provisioner.cpp:249] Using default backend 'copy'
I0519 20:46:38.384557 30888 cluster.cpp:448] Creating default 'local' authorizer
I0519 20:46:38.386137 30922 slave.cpp:225] Mesos agent started on (750)@172.17.0.2:39821
I0519 20:46:38.386162 30922 slave.cpp:226] Flags at startup: --acls="" --appc_simple_discovery_uri_prefix="http://"
--appc_store_dir="/tmp/mesos/store/appc" --authenticate_http_readonly="true" --authenticate_http_readwrite="true"
--authenticatee="crammd5" --authentication_backoff_factor="1secs" --authorizer="local" --cgroups_cpu_enable_pids_and_tids_count="false"
--cgroups_enable_cfs="false" --cgroups_hierarchy="/sys/fs/cgroup" --cgroups_limit_swap="false"
--cgroups_root="mesos" --container_disk_watch_interval="15secs" --containerizers="mesos" --credential="/tmp/Endpoint_SlaveEndpointTest_NoAuthorizer_0_ENg5Uo/credential"
--default_role="*" --disk_watch_interval="1mins" --docker="docker" --docker_kill_orphans="true"
--docker_registry="https://registry-1.docker.io" --docker_remove_delay="6hrs" --docker_socket="/var/run/docker.sock"
--docker_stop_timeout="0ns" --docker_store_dir="/tmp/mesos/store/docker" --docker_volume_checkpoint_dir="/var/run/mesos/isolators/docker/volume"
--enforce_container_disk_quota="false" --executor_registration_timeout="1mins" --executor_shutdown_grace_period="5secs"
--fetcher_cache_dir="/tmp/Endpoint_SlaveEndpointTest_NoAuthorizer_0_ENg5Uo/fetch" --fetcher_cache_size="2GB"
--frameworks_home="" --gc_delay="1weeks" --gc_disk_headroom="0.1" --hadoop_home="" --help="false"
--hostname_lookup="true" --http_command_executor="false" --http_credentials="/tmp/Endpoint_SlaveEndpointTest_NoAuthorizer_0_ENg5Uo/http_credentials"
--http_heartbeat_interval="30secs" --initialize_driver_logging="true" --isolation="posix/cpu,posix/mem"
--launcher="posix" --launcher_dir="/mesos/mesos-1.4.0/_build/src" --logbufsecs="0" --logging_level="INFO"
--max_completed_executors_per_framework="150" --oversubscribed_resources_interval="15secs"
--perf_duration="10secs" --perf_interval="1mins" --port="5051" --qos_correction_interval_min="0ns"
--quiet="false" --recover="reconnect" --recovery_timeout="15mins" --registration_backoff_factor="10ms"
--resources="cpus:2;gpus:0;mem:1024;disk:1024;ports:[31000-32000]" --revocable_cpu_low_priority="true"
--runtime_dir="/tmp/Endpoint_SlaveEndpointTest_NoAuthorizer_0_ENg5Uo" --sandbox_directory="/mnt/mesos/sandbox"
--strict="true" --switch_user="true" --systemd_enable_support="true" --systemd_runtime_directory="/run/systemd/system"
--version="false" --work_dir="/tmp/Endpoint_SlaveEndpointTest_NoAuthorizer_0_wBfiuL"
I0519 20:46:38.386476 30922 credentials.hpp:86] Loading credential for authentication from
'/tmp/Endpoint_SlaveEndpointTest_NoAuthorizer_0_ENg5Uo/credential'
I0519 20:46:38.386654 30922 slave.cpp:258] Agent using credential for: test-principal
I0519 20:46:38.386687 30922 credentials.hpp:37] Loading credentials for authentication from
'/tmp/Endpoint_SlaveEndpointTest_NoAuthorizer_0_ENg5Uo/http_credentials'
I0519 20:46:38.386914 30922 http.cpp:975] Creating default 'basic' HTTP authenticator for
realm 'mesos-agent-readonly'
I0519 20:46:38.387050 30922 http.cpp:975] Creating default 'basic' HTTP authenticator for
realm 'mesos-agent-readwrite'
I0519 20:46:38.388301 30922 slave.cpp:529] Agent resources: cpus(*):2; mem(*):1024; disk(*):1024;
ports(*):[31000-32000]
I0519 20:46:38.388377 30922 slave.cpp:537] Agent attributes: [  ]
I0519 20:46:38.388389 30922 slave.cpp:542] Agent hostname: 920afd45b524
I0519 20:46:38.388509 30926 status_update_manager.cpp:177] Pausing sending status updates
I0519 20:46:38.389674 30915 state.cpp:62] Recovering state from '/tmp/Endpoint_SlaveEndpointTest_NoAuthorizer_0_wBfiuL/meta'
I0519 20:46:38.389909 30916 status_update_manager.cpp:203] Recovering status update manager
I0519 20:46:38.390197 30920 containerizer.cpp:608] Recovering containerizer
I0519 20:46:38.391535 30914 provisioner.cpp:410] Provisioner recovery complete
I0519 20:46:38.391989 30917 slave.cpp:5974] Finished recovery
I0519 20:46:38.392416 30917 slave.cpp:6156] Querying resource estimator for oversubscribable
resources
I0519 20:46:38.392654 30924 slave.cpp:6170] Received oversubscribable resources {} from the
resource estimator
I0519 20:46:38.394743 30908 process.cpp:3730] Handling HTTP event for process 'slave(750)'
with path: '/slave(750)/monitor/statistics'
I0519 20:46:38.395998 30917 http.cpp:1115] HTTP GET for /slave(750)/monitor/statistics from
172.17.0.2:56538
I0519 20:46:38.396097 30917 http.cpp:936] Authorizing principal 'test-principal' to GET the
'/monitor/statistics' endpoint
I0519 20:46:38.399155 30926 slave.cpp:794] Agent terminating
[       OK ] Endpoint/SlaveEndpointTest.NoAuthorizer/0 (26 ms)
[ RUN      ] Endpoint/SlaveEndpointTest.NoAuthorizer/1
I0519 20:46:38.408705 30888 containerizer.cpp:221] Using isolation: posix/cpu,posix/mem,filesystem/posix,network/cni
W0519 20:46:38.409201 30888 backend.cpp:76] Failed to create 'aufs' backend: AufsBackend requires
root privileges
W0519 20:46:38.409296 30888 backend.cpp:76] Failed to create 'bind' backend: BindBackend requires
root privileges
I0519 20:46:38.409325 30888 provisioner.cpp:249] Using default backend 'copy'
I0519 20:46:38.410928 30888 cluster.cpp:448] Creating default 'local' authorizer
I0519 20:46:38.412446 30911 slave.cpp:225] Mesos agent started on (751)@172.17.0.2:39821
I0519 20:46:38.412468 30911 slave.cpp:226] Flags at startup: --acls="" --appc_simple_discovery_uri_prefix="http://"
--appc_store_dir="/tmp/mesos/store/appc" --authenticate_http_readonly="true" --authenticate_http_readwrite="true"
--authenticatee="crammd5" --authentication_backoff_factor="1secs" --authorizer="local" --cgroups_cpu_enable_pids_and_tids_count="false"
--cgroups_enable_cfs="false" --cgroups_hierarchy="/sys/fs/cgroup" --cgroups_limit_swap="false"
--cgroups_root="mesos" --container_disk_watch_interval="15secs" --containerizers="mesos" --credential="/tmp/Endpoint_SlaveEndpointTest_NoAuthorizer_1_mywQRW/credential"
--default_role="*" --disk_watch_interval="1mins" --docker="docker" --docker_kill_orphans="true"
--docker_registry="https://registry-1.docker.io" --docker_remove_delay="6hrs" --docker_socket="/var/run/docker.sock"
--docker_stop_timeout="0ns" --docker_store_dir="/tmp/mesos/store/docker" --docker_volume_checkpoint_dir="/var/run/mesos/isolators/docker/volume"
--enforce_container_disk_quota="false" --executor_registration_timeout="1mins" --executor_shutdown_grace_period="5secs"
--fetcher_cache_dir="/tmp/Endpoint_SlaveEndpointTest_NoAuthorizer_1_mywQRW/fetch" --fetcher_cache_size="2GB"
--frameworks_home="" --gc_delay="1weeks" --gc_disk_headroom="0.1" --hadoop_home="" --help="false"
--hostname_lookup="true" --http_command_executor="false" --http_credentials="/tmp/Endpoint_SlaveEndpointTest_NoAuthorizer_1_mywQRW/http_credentials"
--http_heartbeat_interval="30secs" --initialize_driver_logging="true" --isolation="posix/cpu,posix/mem"
--launcher="posix" --launcher_dir="/mesos/mesos-1.4.0/_build/src" --logbufsecs="0" --logging_level="INFO"
--max_completed_executors_per_framework="150" --oversubscribed_resources_interval="15secs"
--perf_duration="10secs" --perf_interval="1mins" --port="5051" --qos_correction_interval_min="0ns"
--quiet="false" --recover="reconnect" --recovery_timeout="15mins" --registration_backoff_factor="10ms"
--resources="cpus:2;gpus:0;mem:1024;disk:1024;ports:[31000-32000]" --revocable_cpu_low_priority="true"
--runtime_dir="/tmp/Endpoint_SlaveEndpointTest_NoAuthorizer_1_mywQRW" --sandbox_directory="/mnt/mesos/sandbox"
--strict="true" --switch_user="true" --systemd_enable_support="true" --systemd_runtime_directory="/run/systemd/system"
--version="false" --work_dir="/tmp/Endpoint_SlaveEndpointTest_NoAuthorizer_1_0Yu4mj"
I0519 20:46:38.412802 30911 credentials.hpp:86] Loading credential for authentication from
'/tmp/Endpoint_SlaveEndpointTest_NoAuthorizer_1_mywQRW/credential'
I0519 20:46:38.412948 30911 slave.cpp:258] Agent using credential for: test-principal
I0519 20:46:38.412971 30911 credentials.hpp:37] Loading credentials for authentication from
'/tmp/Endpoint_SlaveEndpointTest_NoAuthorizer_1_mywQRW/http_credentials'
I0519 20:46:38.413195 30911 http.cpp:975] Creating default 'basic' HTTP authenticator for
realm 'mesos-agent-readonly'
I0519 20:46:38.413327 30911 http.cpp:975] Creating default 'basic' HTTP authenticator for
realm 'mesos-agent-readwrite'
I0519 20:46:38.414819 30911 slave.cpp:529] Agent resources: cpus(*):2; mem(*):1024; disk(*):1024;
ports(*):[31000-32000]
I0519 20:46:38.414901 30911 slave.cpp:537] Agent attributes: [  ]
I0519 20:46:38.414921 30911 slave.cpp:542] Agent hostname: 920afd45b524
I0519 20:46:38.415068 30923 status_update_manager.cpp:177] Pausing sending status updates
I0519 20:46:38.416306 30924 state.cpp:62] Recovering state from '/tmp/Endpoint_SlaveEndpointTest_NoAuthorizer_1_0Yu4mj/meta'
I0519 20:46:38.416574 30912 status_update_manager.cpp:203] Recovering status update manager
I0519 20:46:38.416764 30911 containerizer.cpp:608] Recovering containerizer
I0519 20:46:38.418189 30928 provisioner.cpp:410] Provisioner recovery complete
I0519 20:46:38.418741 30930 slave.cpp:5974] Finished recovery
I0519 20:46:38.419530 30930 slave.cpp:6156] Querying resource estimator for oversubscribable
resources
I0519 20:46:38.420040 30919 slave.cpp:6170] Received oversubscribable resources {} from the
resource estimator
I0519 20:46:38.421989 30907 process.cpp:3730] Handling HTTP event for process 'slave(751)'
with path: '/slave(751)/monitor/statistics.json'
I0519 20:46:38.423334 30917 http.cpp:1115] HTTP GET for /slave(751)/monitor/statistics.json
from 172.17.0.2:56540
I0519 20:46:38.423424 30917 http.cpp:936] Authorizing principal 'test-principal' to GET the
'/monitor/statistics.json' endpoint
I0519 20:46:38.426442 30908 slave.cpp:794] Agent terminating
[       OK ] Endpoint/SlaveEndpointTest.NoAuthorizer/1 (27 ms)
[ RUN      ] Endpoint/SlaveEndpointTest.NoAuthorizer/2
I0519 20:46:38.437010 30888 containerizer.cpp:221] Using isolation: posix/cpu,posix/mem,filesystem/posix,network/cni
W0519 20:46:38.437505 30888 backend.cpp:76] Failed to create 'aufs' backend: AufsBackend requires
root privileges
W0519 20:46:38.437600 30888 backend.cpp:76] Failed to create 'bind' backend: BindBackend requires
root privileges
I0519 20:46:38.437631 30888 provisioner.cpp:249] Using default backend 'copy'
I0519 20:46:38.439183 30888 cluster.cpp:448] Creating default 'local' authorizer
I0519 20:46:38.440902 30910 slave.cpp:225] Mesos agent started on (752)@172.17.0.2:39821
I0519 20:46:38.440924 30910 slave.cpp:226] Flags at startup: --acls="" --appc_simple_discovery_uri_prefix="http://"
--appc_store_dir="/tmp/mesos/store/appc" --authenticate_http_readonly="true" --authenticate_http_readwrite="true"
--authenticatee="crammd5" --authentication_backoff_factor="1secs" --authorizer="local" --cgroups_cpu_enable_pids_and_tids_count="false"
--cgroups_enable_cfs="false" --cgroups_hierarchy="/sys/fs/cgroup" --cgroups_limit_swap="false"
--cgroups_root="mesos" --container_disk_watch_interval="15secs" --containerizers="mesos" --credential="/tmp/Endpoint_SlaveEndpointTest_NoAuthorizer_2_IMp94u/credential"
--default_role="*" --disk_watch_interval="1mins" --docker="docker" --docker_kill_orphans="true"
--docker_registry="https://registry-1.docker.io" --docker_remove_delay="6hrs" --docker_socket="/var/run/docker.sock"
--docker_stop_timeout="0ns" --docker_store_dir="/tmp/mesos/store/docker" --docker_volume_checkpoint_dir="/var/run/mesos/isolators/docker/volume"
--enforce_container_disk_quota="false" --executor_registration_timeout="1mins" --executor_shutdown_grace_period="5secs"
--fetcher_cache_dir="/tmp/Endpoint_SlaveEndpointTest_NoAuthorizer_2_IMp94u/fetch" --fetcher_cache_size="2GB"
--frameworks_home="" --gc_delay="1weeks" --gc_disk_headroom="0.1" --hadoop_home="" --help="false"
--hostname_lookup="true" --http_command_executor="false" --http_credentials="/tmp/Endpoint_SlaveEndpointTest_NoAuthorizer_2_IMp94u/http_credentials"
--http_heartbeat_interval="30secs" --initialize_driver_logging="true" --isolation="posix/cpu,posix/mem"
--launcher="posix" --launcher_dir="/mesos/mesos-1.4.0/_build/src" --logbufsecs="0" --logging_level="INFO"
--max_completed_executors_per_framework="150" --oversubscribed_resources_interval="15secs"
--perf_duration="10secs" --perf_interval="1mins" --port="5051" --qos_correction_interval_min="0ns"
--quiet="false" --recover="reconnect" --recovery_timeout="15mins" --registration_backoff_factor="10ms"
--resources="cpus:2;gpus:0;mem:1024;disk:1024;ports:[31000-32000]" --revocable_cpu_low_priority="true"
--runtime_dir="/tmp/Endpoint_SlaveEndpointTest_NoAuthorizer_2_IMp94u" --sandbox_directory="/mnt/mesos/sandbox"
--strict="true" --switch_user="true" --systemd_enable_support="true" --systemd_runtime_directory="/run/systemd/system"
--version="false" --work_dir="/tmp/Endpoint_SlaveEndpointTest_NoAuthorizer_2_EHdbwR"
I0519 20:46:38.441258 30910 credentials.hpp:86] Loading credential for authentication from
'/tmp/Endpoint_SlaveEndpointTest_NoAuthorizer_2_IMp94u/credential'
I0519 20:46:38.441400 30910 slave.cpp:258] Agent using credential for: test-principal
I0519 20:46:38.441421 30910 credentials.hpp:37] Loading credentials for authentication from
'/tmp/Endpoint_SlaveEndpointTest_NoAuthorizer_2_IMp94u/http_credentials'
I0519 20:46:38.441648 30910 http.cpp:975] Creating default 'basic' HTTP authenticator for
realm 'mesos-agent-readonly'
I0519 20:46:38.441781 30910 http.cpp:975] Creating default 'basic' HTTP authenticator for
realm 'mesos-agent-readwrite'
I0519 20:46:38.443073 30910 slave.cpp:529] Agent resources: cpus(*):2; mem(*):1024; disk(*):1024;
ports(*):[31000-32000]
I0519 20:46:38.443150 30910 slave.cpp:537] Agent attributes: [  ]
I0519 20:46:38.443161 30910 slave.cpp:542] Agent hostname: 920afd45b524
I0519 20:46:38.443336 30920 status_update_manager.cpp:177] Pausing sending status updates
I0519 20:46:38.444556 30916 state.cpp:62] Recovering state from '/tmp/Endpoint_SlaveEndpointTest_NoAuthorizer_2_EHdbwR/meta'
I0519 20:46:38.444967 30919 status_update_manager.cpp:203] Recovering status update manager
I0519 20:46:38.445307 30927 containerizer.cpp:608] Recovering containerizer
I0519 20:46:38.446693 30922 provisioner.cpp:410] Provisioner recovery complete
I0519 20:46:38.447147 30924 slave.cpp:5974] Finished recovery
I0519 20:46:38.447715 30924 slave.cpp:6156] Querying resource estimator for oversubscribable
resources
I0519 20:46:38.447991 30928 slave.cpp:6170] Received oversubscribable resources {} from the
resource estimator
I0519 20:46:38.450556 30918 process.cpp:3730] Handling HTTP event for process 'slave(752)'
with path: '/slave(752)/containers'
I0519 20:46:38.451700 30919 http.cpp:1115] HTTP GET for /slave(752)/containers from 172.17.0.2:56542
I0519 20:46:38.451781 30919 http.cpp:936] Authorizing principal 'test-principal' to GET the
'/containers' endpoint
I0519 20:46:38.456351 30920 slave.cpp:794] Agent terminating
[       OK ] Endpoint/SlaveEndpointTest.NoAuthorizer/2 (29 ms)
[----------] 9 tests from Endpoint/SlaveEndpointTest (257 ms total)

[----------] Global test environment tear-down
[==========] 1575 tests from 175 test cases ran. (463869 ms total)
[  PASSED  ] 1574 tests.
[  FAILED  ] 1 test, listed below:
[  FAILED  ] MasterTest.IgnoreOldAgentReregistration

 1 FAILED TEST
  YOU HAVE 22 DISABLED TESTS

E0519 20:46:38.518599 30931 process.cpp:950] Failed to accept socket: future discarded
make[4]: *** [check-local] Error 1
make[4]: Leaving directory `/mesos/mesos-1.4.0/_build/src'
make[3]: *** [check-am] Error 2
make[3]: Leaving directory `/mesos/mesos-1.4.0/_build/src'
make[2]: *** [check] Error 2
make[2]: Leaving directory `/mesos/mesos-1.4.0/_build/src'
make[1]: *** [check-recursive] Error 1
make[1]: Leaving directory `/mesos/mesos-1.4.0/_build'
make: *** [distcheck] Error 1
+ docker rmi mesos-1495224079-11326
Untagged: mesos-1495224079-11326:latest
Deleted: sha256:50720ee6d1eb451d6b342a434990cd42637ee8d349519d0233a0299dd5be53cc
Deleted: sha256:6f860e8532dcf650a65139939f35e7d2509839dc4c27469c8eac40ee9b146053
Deleted: sha256:15decbe49d4257e8e8a93f378cf4f5a1d5bebb042790b776f0c3500a68ce0ef5
Deleted: sha256:2d2844273fb29b20a9df0bb6b92047efad3da2886d2b055d2f5912b2c7857f9d
Deleted: sha256:e52094eaffd1122dcb25f511ec6903c5d6995d660156ac905f1054aa97f67b0d
Deleted: sha256:debf812686223b3f696af0694248dbb63c7fae16799f024f3f476f87d508fb3f
Deleted: sha256:a0bf970ca30de464037308660f3cd16f1198002d72b4ad16061e562bb0f089fc
Deleted: sha256:72d7564d8741a8bbc13c081460fd2424f2ef803f5184758d8b6f50c5a13e97ba
Deleted: sha256:50cc800d6f57abf3d9d93946e32b7bbd199b2fd1574b26f92513dc4650993451
Deleted: sha256:7ca8b61e7d5028be798e09247cb87e22a9241a30d150b5516dd00bf859cd9753
Deleted: sha256:9b48c214ace9a274f0a9ba3d08f592910868bb95043a4fbf1e7220c0ce9bbc65
Deleted: sha256:0b582a07089a39fae8d886a3f4a93bc6116007860b3ee68cf40db3970d83fd1d
Deleted: sha256:9381bfa9b260b70a7e90d7116401dfb31eb37a946362f34f568fce351ef8d1bf
Deleted: sha256:3cc76fbdbb1d76da377a2fc11524c8c569907edc7abda01d7d03d500c41e02b7
Deleted: sha256:68f4193c356909adc546a9ba6ecec8693b97a9483f0c166a66949576fcd818bd
Deleted: sha256:f56402a7c91513aab3af6a69a7cd813ebf1a2a8c3d2217787497e3cb57a0912a
Deleted: sha256:9c876e180400c30576d3398aee3befcdb2f948a82a94f62464797e6040c4ea94
Deleted: sha256:bebe06860f575309a492ee0b82853ae85de7ddd1384da3ee1f3fd7c51b393c35
Deleted: sha256:b91c3bc584076475edd7094705aff2b9c0ce9cfbeded91c8bdca04a7b7eea0e3
Deleted: sha256:da65af8d9a86f10ad055823c16a360d9611c35bc00c2b28ac0286bb448cbd148
Deleted: sha256:697c3197a254e4806b8b052303d35c387b9d4a359909c1e741a746499c82e752
Deleted: sha256:5a5d639390b9e6a4ffd26bf59e41accb402d94830b6071457e0d76dc67e63f91
Deleted: sha256:4689e0b2ff8a196705579121af8efd6e8ba91b57267c2bcd43e54f50713854d0
Deleted: sha256:bdb928f7fba7f7e78f6b7bca4b0edaf9ca8cf363c69eef3e2a46f584109b2b3e
Build step 'Execute shell' marked build as failure

Mime
View raw message