mesos-builds mailing list archives

Site index · List index
Message view « Date » · « Thread »
Top « Date » · « Thread »
From Apache Jenkins Server <jenk...@builds.apache.org>
Subject Build failed in Jenkins: Mesos-Buildbot » autotools,clang,--verbose,GLOG_v=1 MESOS_VERBOSE=1,ubuntu:14.04,(docker||Hadoop)&&(!ubuntu-us1)&&(!ubuntu-eu2) #3689
Date Wed, 17 May 2017 18:46:23 GMT
See <https://builds.apache.org/job/Mesos-Buildbot/BUILDTOOL=autotools,COMPILER=clang,CONFIGURATION=--verbose,ENVIRONMENT=GLOG_v=1%20MESOS_VERBOSE=1,OS=ubuntu%3A14.04,label_exp=(docker%7C%7CHadoop)&&(!ubuntu-us1)&&(!ubuntu-eu2)/3689/display/redirect?page=changes>

Changes:

[neil.conway] Introduced a filter for test cases that need thread-safety.

[neil.conway] Fixed use of 'GTEST_IS_THREADSAFE'.

[neil.conway] Updated GMock/GTest to version 1.8.0.

[neil.conway] Updated GMock/GTest in stout.

[neil.conway] Updated GMock/GTest in libprocess.

[neil.conway] Fixed Makefile.am variable syntax.

------------------------------------------
[...truncated 27.09 MB...]
[       OK ] Endpoint/SlaveEndpointTest.AuthorizedRequest/1 (28 ms)
[ RUN      ] Endpoint/SlaveEndpointTest.AuthorizedRequest/2
I0517 18:46:16.034966 29180 containerizer.cpp:221] Using isolation: posix/cpu,posix/mem,filesystem/posix,network/cni
W0517 18:46:16.035459 29180 backend.cpp:76] Failed to create 'aufs' backend: AufsBackend requires
root privileges
W0517 18:46:16.035568 29180 backend.cpp:76] Failed to create 'bind' backend: BindBackend requires
root privileges
I0517 18:46:16.035612 29180 provisioner.cpp:249] Using default backend 'copy'
I0517 18:46:16.038534 29213 slave.cpp:225] Mesos agent started on (746)@172.17.0.2:53016
I0517 18:46:16.038575 29213 slave.cpp:226] Flags at startup: --acls="" --appc_simple_discovery_uri_prefix="http://"
--appc_store_dir="/tmp/mesos/store/appc" --authenticate_http_readonly="true" --authenticate_http_readwrite="true"
--authenticatee="crammd5" --authentication_backoff_factor="1secs" --authorizer="local" --cgroups_cpu_enable_pids_and_tids_count="false"
--cgroups_enable_cfs="false" --cgroups_hierarchy="/sys/fs/cgroup" --cgroups_limit_swap="false"
--cgroups_root="mesos" --container_disk_watch_interval="15secs" --containerizers="mesos" --credential="/tmp/Endpoint_SlaveEndpointTest_AuthorizedRequest_2_BafWyM/credential"
--default_role="*" --disk_watch_interval="1mins" --docker="docker" --docker_kill_orphans="true"
--docker_registry="https://registry-1.docker.io" --docker_remove_delay="6hrs" --docker_socket="/var/run/docker.sock"
--docker_stop_timeout="0ns" --docker_store_dir="/tmp/mesos/store/docker" --docker_volume_checkpoint_dir="/var/run/mesos/isolators/docker/volume"
--enforce_container_disk_quota="false" --executor_registration_timeout="1mins" --executor_shutdown_grace_period="5secs"
--fetcher_cache_dir="/tmp/Endpoint_SlaveEndpointTest_AuthorizedRequest_2_BafWyM/fetch" --fetcher_cache_size="2GB"
--frameworks_home="" --gc_delay="1weeks" --gc_disk_headroom="0.1" --hadoop_home="" --help="false"
--hostname_lookup="true" --http_command_executor="false" --http_credentials="/tmp/Endpoint_SlaveEndpointTest_AuthorizedRequest_2_BafWyM/http_credentials"
--http_heartbeat_interval="30secs" --initialize_driver_logging="true" --isolation="posix/cpu,posix/mem"
--launcher="posix" --launcher_dir="/mesos/mesos-1.4.0/_build/src" --logbufsecs="0" --logging_level="INFO"
--max_completed_executors_per_framework="150" --oversubscribed_resources_interval="15secs"
--perf_duration="10secs" --perf_interval="1mins" --port="5051" --qos_correction_interval_min="0ns"
--quiet="false" --recover="reconnect" --recovery_timeout="15mins" --registration_backoff_factor="10ms"
--resources="cpus:2;gpus:0;mem:1024;disk:1024;ports:[31000-32000]" --revocable_cpu_low_priority="true"
--runtime_dir="/tmp/Endpoint_SlaveEndpointTest_AuthorizedRequest_2_BafWyM" --sandbox_directory="/mnt/mesos/sandbox"
--strict="true" --switch_user="true" --systemd_enable_support="true" --systemd_runtime_directory="/run/systemd/system"
--version="false" --work_dir="/tmp/Endpoint_SlaveEndpointTest_AuthorizedRequest_2_tKH6R1"
I0517 18:46:16.039153 29213 credentials.hpp:86] Loading credential for authentication from
'/tmp/Endpoint_SlaveEndpointTest_AuthorizedRequest_2_BafWyM/credential'
I0517 18:46:16.039378 29213 slave.cpp:258] Agent using credential for: test-principal
I0517 18:46:16.039405 29213 credentials.hpp:37] Loading credentials for authentication from
'/tmp/Endpoint_SlaveEndpointTest_AuthorizedRequest_2_BafWyM/http_credentials'
I0517 18:46:16.039687 29213 http.cpp:975] Creating default 'basic' HTTP authenticator for
realm 'mesos-agent-readonly'
I0517 18:46:16.039893 29213 http.cpp:975] Creating default 'basic' HTTP authenticator for
realm 'mesos-agent-readwrite'
I0517 18:46:16.041795 29213 slave.cpp:529] Agent resources: cpus(*):2; mem(*):1024; disk(*):1024;
ports(*):[31000-32000]
I0517 18:46:16.041915 29213 slave.cpp:537] Agent attributes: [  ]
I0517 18:46:16.041939 29213 slave.cpp:542] Agent hostname: 1f8d8f5189a1
I0517 18:46:16.042209 29211 status_update_manager.cpp:177] Pausing sending status updates
I0517 18:46:16.043915 29208 state.cpp:62] Recovering state from '/tmp/Endpoint_SlaveEndpointTest_AuthorizedRequest_2_tKH6R1/meta'
I0517 18:46:16.044211 29202 status_update_manager.cpp:203] Recovering status update manager
I0517 18:46:16.044432 29206 containerizer.cpp:608] Recovering containerizer
I0517 18:46:16.045984 29207 provisioner.cpp:410] Provisioner recovery complete
I0517 18:46:16.046506 29202 slave.cpp:5974] Finished recovery
I0517 18:46:16.047193 29202 slave.cpp:6156] Querying resource estimator for oversubscribable
resources
I0517 18:46:16.047472 29200 slave.cpp:6170] Received oversubscribable resources {} from the
resource estimator
I0517 18:46:16.050148 29202 process.cpp:3730] Handling HTTP event for process 'slave(746)'
with path: '/slave(746)/containers'
I0517 18:46:16.051618 29208 http.cpp:1115] HTTP GET for /slave(746)/containers from 172.17.0.2:54679
I0517 18:46:16.051692 29208 http.cpp:936] Authorizing principal 'test-principal' to GET the
'/containers' endpoint
I0517 18:46:16.055058 29206 slave.cpp:794] Agent terminating
[       OK ] Endpoint/SlaveEndpointTest.AuthorizedRequest/2 (29 ms)
[ RUN      ] Endpoint/SlaveEndpointTest.UnauthorizedRequest/0
I0517 18:46:16.064610 29180 containerizer.cpp:221] Using isolation: posix/cpu,posix/mem,filesystem/posix,network/cni
W0517 18:46:16.065109 29180 backend.cpp:76] Failed to create 'aufs' backend: AufsBackend requires
root privileges
W0517 18:46:16.065212 29180 backend.cpp:76] Failed to create 'bind' backend: BindBackend requires
root privileges
I0517 18:46:16.065255 29180 provisioner.cpp:249] Using default backend 'copy'
I0517 18:46:16.068348 29212 slave.cpp:225] Mesos agent started on (747)@172.17.0.2:53016
I0517 18:46:16.068408 29212 slave.cpp:226] Flags at startup: --acls="" --appc_simple_discovery_uri_prefix="http://"
--appc_store_dir="/tmp/mesos/store/appc" --authenticate_http_readonly="true" --authenticate_http_readwrite="true"
--authenticatee="crammd5" --authentication_backoff_factor="1secs" --authorizer="local" --cgroups_cpu_enable_pids_and_tids_count="false"
--cgroups_enable_cfs="false" --cgroups_hierarchy="/sys/fs/cgroup" --cgroups_limit_swap="false"
--cgroups_root="mesos" --container_disk_watch_interval="15secs" --containerizers="mesos" --credential="/tmp/Endpoint_SlaveEndpointTest_UnauthorizedRequest_0_piqGAN/credential"
--default_role="*" --disk_watch_interval="1mins" --docker="docker" --docker_kill_orphans="true"
--docker_registry="https://registry-1.docker.io" --docker_remove_delay="6hrs" --docker_socket="/var/run/docker.sock"
--docker_stop_timeout="0ns" --docker_store_dir="/tmp/mesos/store/docker" --docker_volume_checkpoint_dir="/var/run/mesos/isolators/docker/volume"
--enforce_container_disk_quota="false" --executor_registration_timeout="1mins" --executor_shutdown_grace_period="5secs"
--fetcher_cache_dir="/tmp/Endpoint_SlaveEndpointTest_UnauthorizedRequest_0_piqGAN/fetch" --fetcher_cache_size="2GB"
--frameworks_home="" --gc_delay="1weeks" --gc_disk_headroom="0.1" --hadoop_home="" --help="false"
--hostname_lookup="true" --http_command_executor="false" --http_credentials="/tmp/Endpoint_SlaveEndpointTest_UnauthorizedRequest_0_piqGAN/http_credentials"
--http_heartbeat_interval="30secs" --initialize_driver_logging="true" --isolation="posix/cpu,posix/mem"
--launcher="posix" --launcher_dir="/mesos/mesos-1.4.0/_build/src" --logbufsecs="0" --logging_level="INFO"
--max_completed_executors_per_framework="150" --oversubscribed_resources_interval="15secs"
--perf_duration="10secs" --perf_interval="1mins" --port="5051" --qos_correction_interval_min="0ns"
--quiet="false" --recover="reconnect" --recovery_timeout="15mins" --registration_backoff_factor="10ms"
--resources="cpus:2;gpus:0;mem:1024;disk:1024;ports:[31000-32000]" --revocable_cpu_low_priority="true"
--runtime_dir="/tmp/Endpoint_SlaveEndpointTest_UnauthorizedRequest_0_piqGAN" --sandbox_directory="/mnt/mesos/sandbox"
--strict="true" --switch_user="true" --systemd_enable_support="true" --systemd_runtime_directory="/run/systemd/system"
--version="false" --work_dir="/tmp/Endpoint_SlaveEndpointTest_UnauthorizedRequest_0_6Z61O2"
I0517 18:46:16.068902 29212 credentials.hpp:86] Loading credential for authentication from
'/tmp/Endpoint_SlaveEndpointTest_UnauthorizedRequest_0_piqGAN/credential'
I0517 18:46:16.069145 29212 slave.cpp:258] Agent using credential for: test-principal
I0517 18:46:16.069171 29212 credentials.hpp:37] Loading credentials for authentication from
'/tmp/Endpoint_SlaveEndpointTest_UnauthorizedRequest_0_piqGAN/http_credentials'
I0517 18:46:16.069449 29212 http.cpp:975] Creating default 'basic' HTTP authenticator for
realm 'mesos-agent-readonly'
I0517 18:46:16.069638 29212 http.cpp:975] Creating default 'basic' HTTP authenticator for
realm 'mesos-agent-readwrite'
I0517 18:46:16.071522 29212 slave.cpp:529] Agent resources: cpus(*):2; mem(*):1024; disk(*):1024;
ports(*):[31000-32000]
I0517 18:46:16.071630 29212 slave.cpp:537] Agent attributes: [  ]
I0517 18:46:16.071650 29212 slave.cpp:542] Agent hostname: 1f8d8f5189a1
I0517 18:46:16.071835 29204 status_update_manager.cpp:177] Pausing sending status updates
I0517 18:46:16.073599 29204 state.cpp:62] Recovering state from '/tmp/Endpoint_SlaveEndpointTest_UnauthorizedRequest_0_6Z61O2/meta'
I0517 18:46:16.073856 29203 status_update_manager.cpp:203] Recovering status update manager
I0517 18:46:16.074061 29209 containerizer.cpp:608] Recovering containerizer
I0517 18:46:16.075429 29206 provisioner.cpp:410] Provisioner recovery complete
I0517 18:46:16.075873 29198 slave.cpp:5974] Finished recovery
I0517 18:46:16.076478 29198 slave.cpp:6156] Querying resource estimator for oversubscribable
resources
I0517 18:46:16.077093 29204 slave.cpp:6170] Received oversubscribable resources {} from the
resource estimator
I0517 18:46:16.080283 29210 process.cpp:3730] Handling HTTP event for process 'slave(747)'
with path: '/slave(747)/monitor/statistics'
I0517 18:46:16.081678 29205 http.cpp:1115] HTTP GET for /slave(747)/monitor/statistics from
172.17.0.2:54681
I0517 18:46:16.081760 29205 http.cpp:936] Authorizing principal 'test-principal' to GET the
'/monitor/statistics' endpoint
I0517 18:46:16.084585 29199 slave.cpp:794] Agent terminating
[       OK ] Endpoint/SlaveEndpointTest.UnauthorizedRequest/0 (29 ms)
[ RUN      ] Endpoint/SlaveEndpointTest.UnauthorizedRequest/1
I0517 18:46:16.093977 29180 containerizer.cpp:221] Using isolation: posix/cpu,posix/mem,filesystem/posix,network/cni
W0517 18:46:16.094460 29180 backend.cpp:76] Failed to create 'aufs' backend: AufsBackend requires
root privileges
W0517 18:46:16.094568 29180 backend.cpp:76] Failed to create 'bind' backend: BindBackend requires
root privileges
I0517 18:46:16.094636 29180 provisioner.cpp:249] Using default backend 'copy'
I0517 18:46:16.097599 29207 slave.cpp:225] Mesos agent started on (748)@172.17.0.2:53016
I0517 18:46:16.097643 29207 slave.cpp:226] Flags at startup: --acls="" --appc_simple_discovery_uri_prefix="http://"
--appc_store_dir="/tmp/mesos/store/appc" --authenticate_http_readonly="true" --authenticate_http_readwrite="true"
--authenticatee="crammd5" --authentication_backoff_factor="1secs" --authorizer="local" --cgroups_cpu_enable_pids_and_tids_count="false"
--cgroups_enable_cfs="false" --cgroups_hierarchy="/sys/fs/cgroup" --cgroups_limit_swap="false"
--cgroups_root="mesos" --container_disk_watch_interval="15secs" --containerizers="mesos" --credential="/tmp/Endpoint_SlaveEndpointTest_UnauthorizedRequest_1_T51wVO/credential"
--default_role="*" --disk_watch_interval="1mins" --docker="docker" --docker_kill_orphans="true"
--docker_registry="https://registry-1.docker.io" --docker_remove_delay="6hrs" --docker_socket="/var/run/docker.sock"
--docker_stop_timeout="0ns" --docker_store_dir="/tmp/mesos/store/docker" --docker_volume_checkpoint_dir="/var/run/mesos/isolators/docker/volume"
--enforce_container_disk_quota="false" --executor_registration_timeout="1mins" --executor_shutdown_grace_period="5secs"
--fetcher_cache_dir="/tmp/Endpoint_SlaveEndpointTest_UnauthorizedRequest_1_T51wVO/fetch" --fetcher_cache_size="2GB"
--frameworks_home="" --gc_delay="1weeks" --gc_disk_headroom="0.1" --hadoop_home="" --help="false"
--hostname_lookup="true" --http_command_executor="false" --http_credentials="/tmp/Endpoint_SlaveEndpointTest_UnauthorizedRequest_1_T51wVO/http_credentials"
--http_heartbeat_interval="30secs" --initialize_driver_logging="true" --isolation="posix/cpu,posix/mem"
--launcher="posix" --launcher_dir="/mesos/mesos-1.4.0/_build/src" --logbufsecs="0" --logging_level="INFO"
--max_completed_executors_per_framework="150" --oversubscribed_resources_interval="15secs"
--perf_duration="10secs" --perf_interval="1mins" --port="5051" --qos_correction_interval_min="0ns"
--quiet="false" --recover="reconnect" --recovery_timeout="15mins" --registration_backoff_factor="10ms"
--resources="cpus:2;gpus:0;mem:1024;disk:1024;ports:[31000-32000]" --revocable_cpu_low_priority="true"
--runtime_dir="/tmp/Endpoint_SlaveEndpointTest_UnauthorizedRequest_1_T51wVO" --sandbox_directory="/mnt/mesos/sandbox"
--strict="true" --switch_user="true" --systemd_enable_support="true" --systemd_runtime_directory="/run/systemd/system"
--version="false" --work_dir="/tmp/Endpoint_SlaveEndpointTest_UnauthorizedRequest_1_eYe643"
I0517 18:46:16.098183 29207 credentials.hpp:86] Loading credential for authentication from
'/tmp/Endpoint_SlaveEndpointTest_UnauthorizedRequest_1_T51wVO/credential'
I0517 18:46:16.098394 29207 slave.cpp:258] Agent using credential for: test-principal
I0517 18:46:16.098423 29207 credentials.hpp:37] Loading credentials for authentication from
'/tmp/Endpoint_SlaveEndpointTest_UnauthorizedRequest_1_T51wVO/http_credentials'
I0517 18:46:16.098753 29207 http.cpp:975] Creating default 'basic' HTTP authenticator for
realm 'mesos-agent-readonly'
I0517 18:46:16.098951 29207 http.cpp:975] Creating default 'basic' HTTP authenticator for
realm 'mesos-agent-readwrite'
I0517 18:46:16.100905 29207 slave.cpp:529] Agent resources: cpus(*):2; mem(*):1024; disk(*):1024;
ports(*):[31000-32000]
I0517 18:46:16.101025 29207 slave.cpp:537] Agent attributes: [  ]
I0517 18:46:16.101049 29207 slave.cpp:542] Agent hostname: 1f8d8f5189a1
I0517 18:46:16.101218 29208 status_update_manager.cpp:177] Pausing sending status updates
I0517 18:46:16.102972 29211 state.cpp:62] Recovering state from '/tmp/Endpoint_SlaveEndpointTest_UnauthorizedRequest_1_eYe643/meta'
I0517 18:46:16.103337 29210 status_update_manager.cpp:203] Recovering status update manager
I0517 18:46:16.103530 29206 containerizer.cpp:608] Recovering containerizer
I0517 18:46:16.104820 29207 provisioner.cpp:410] Provisioner recovery complete
I0517 18:46:16.105221 29209 slave.cpp:5974] Finished recovery
I0517 18:46:16.105808 29209 slave.cpp:6156] Querying resource estimator for oversubscribable
resources
I0517 18:46:16.106091 29200 slave.cpp:6170] Received oversubscribable resources {} from the
resource estimator
I0517 18:46:16.109342 29203 process.cpp:3730] Handling HTTP event for process 'slave(748)'
with path: '/slave(748)/monitor/statistics.json'
I0517 18:46:16.111168 29198 http.cpp:1115] HTTP GET for /slave(748)/monitor/statistics.json
from 172.17.0.2:54683
I0517 18:46:16.111249 29198 http.cpp:936] Authorizing principal 'test-principal' to GET the
'/monitor/statistics.json' endpoint
I0517 18:46:16.113739 29202 slave.cpp:794] Agent terminating
[       OK ] Endpoint/SlaveEndpointTest.UnauthorizedRequest/1 (29 ms)
[ RUN      ] Endpoint/SlaveEndpointTest.UnauthorizedRequest/2
I0517 18:46:16.123543 29180 containerizer.cpp:221] Using isolation: posix/cpu,posix/mem,filesystem/posix,network/cni
W0517 18:46:16.124022 29180 backend.cpp:76] Failed to create 'aufs' backend: AufsBackend requires
root privileges
W0517 18:46:16.124138 29180 backend.cpp:76] Failed to create 'bind' backend: BindBackend requires
root privileges
I0517 18:46:16.124177 29180 provisioner.cpp:249] Using default backend 'copy'
I0517 18:46:16.127152 29203 slave.cpp:225] Mesos agent started on (749)@172.17.0.2:53016
I0517 18:46:16.127311 29203 slave.cpp:226] Flags at startup: --acls="" --appc_simple_discovery_uri_prefix="http://"
--appc_store_dir="/tmp/mesos/store/appc" --authenticate_http_readonly="true" --authenticate_http_readwrite="true"
--authenticatee="crammd5" --authentication_backoff_factor="1secs" --authorizer="local" --cgroups_cpu_enable_pids_and_tids_count="false"
--cgroups_enable_cfs="false" --cgroups_hierarchy="/sys/fs/cgroup" --cgroups_limit_swap="false"
--cgroups_root="mesos" --container_disk_watch_interval="15secs" --containerizers="mesos" --credential="/tmp/Endpoint_SlaveEndpointTest_UnauthorizedRequest_2_nlqxzQ/credential"
--default_role="*" --disk_watch_interval="1mins" --docker="docker" --docker_kill_orphans="true"
--docker_registry="https://registry-1.docker.io" --docker_remove_delay="6hrs" --docker_socket="/var/run/docker.sock"
--docker_stop_timeout="0ns" --docker_store_dir="/tmp/mesos/store/docker" --docker_volume_checkpoint_dir="/var/run/mesos/isolators/docker/volume"
--enforce_container_disk_quota="false" --executor_registration_timeout="1mins" --executor_shutdown_grace_period="5secs"
--fetcher_cache_dir="/tmp/Endpoint_SlaveEndpointTest_UnauthorizedRequest_2_nlqxzQ/fetch" --fetcher_cache_size="2GB"
--frameworks_home="" --gc_delay="1weeks" --gc_disk_headroom="0.1" --hadoop_home="" --help="false"
--hostname_lookup="true" --http_command_executor="false" --http_credentials="/tmp/Endpoint_SlaveEndpointTest_UnauthorizedRequest_2_nlqxzQ/http_credentials"
--http_heartbeat_interval="30secs" --initialize_driver_logging="true" --isolation="posix/cpu,posix/mem"
--launcher="posix" --launcher_dir="/mesos/mesos-1.4.0/_build/src" --logbufsecs="0" --logging_level="INFO"
--max_completed_executors_per_framework="150" --oversubscribed_resources_interval="15secs"
--perf_duration="10secs" --perf_interval="1mins" --port="5051" --qos_correction_interval_min="0ns"
--quiet="false" --recover="reconnect" --recovery_timeout="15mins" --registration_backoff_factor="10ms"
--resources="cpus:2;gpus:0;mem:1024;disk:1024;ports:[31000-32000]" --revocable_cpu_low_priority="true"
--runtime_dir="/tmp/Endpoint_SlaveEndpointTest_UnauthorizedRequest_2_nlqxzQ" --sandbox_directory="/mnt/mesos/sandbox"
--strict="true" --switch_user="true" --systemd_enable_support="true" --systemd_runtime_directory="/run/systemd/system"
--version="false" --work_dir="/tmp/Endpoint_SlaveEndpointTest_UnauthorizedRequest_2_haKjE5"
I0517 18:46:16.127864 29203 credentials.hpp:86] Loading credential for authentication from
'/tmp/Endpoint_SlaveEndpointTest_UnauthorizedRequest_2_nlqxzQ/credential'
I0517 18:46:16.128095 29203 slave.cpp:258] Agent using credential for: test-principal
I0517 18:46:16.128121 29203 credentials.hpp:37] Loading credentials for authentication from
'/tmp/Endpoint_SlaveEndpointTest_UnauthorizedRequest_2_nlqxzQ/http_credentials'
I0517 18:46:16.128376 29203 http.cpp:975] Creating default 'basic' HTTP authenticator for
realm 'mesos-agent-readonly'
I0517 18:46:16.128525 29203 http.cpp:975] Creating default 'basic' HTTP authenticator for
realm 'mesos-agent-readwrite'
I0517 18:46:16.129884 29203 slave.cpp:529] Agent resources: cpus(*):2; mem(*):1024; disk(*):1024;
ports(*):[31000-32000]
I0517 18:46:16.129982 29203 slave.cpp:537] Agent attributes: [  ]
I0517 18:46:16.130033 29203 slave.cpp:542] Agent hostname: 1f8d8f5189a1
I0517 18:46:16.130304 29202 status_update_manager.cpp:177] Pausing sending status updates
I0517 18:46:16.131678 29198 state.cpp:62] Recovering state from '/tmp/Endpoint_SlaveEndpointTest_UnauthorizedRequest_2_haKjE5/meta'
I0517 18:46:16.132057 29202 status_update_manager.cpp:203] Recovering status update manager
I0517 18:46:16.132251 29198 containerizer.cpp:608] Recovering containerizer
I0517 18:46:16.133810 29207 provisioner.cpp:410] Provisioner recovery complete
I0517 18:46:16.134402 29209 slave.cpp:5974] Finished recovery
I0517 18:46:16.135078 29209 slave.cpp:6156] Querying resource estimator for oversubscribable
resources
I0517 18:46:16.135367 29203 slave.cpp:6170] Received oversubscribable resources {} from the
resource estimator
I0517 18:46:16.138238 29212 process.cpp:3730] Handling HTTP event for process 'slave(749)'
with path: '/slave(749)/containers'
I0517 18:46:16.139647 29208 http.cpp:1115] HTTP GET for /slave(749)/containers from 172.17.0.2:54685
I0517 18:46:16.139724 29208 http.cpp:936] Authorizing principal 'test-principal' to GET the
'/containers' endpoint
I0517 18:46:16.142072 29209 slave.cpp:794] Agent terminating
[       OK ] Endpoint/SlaveEndpointTest.UnauthorizedRequest/2 (28 ms)
[ RUN      ] Endpoint/SlaveEndpointTest.NoAuthorizer/0
I0517 18:46:16.154044 29180 containerizer.cpp:221] Using isolation: posix/cpu,posix/mem,filesystem/posix,network/cni
W0517 18:46:16.154758 29180 backend.cpp:76] Failed to create 'aufs' backend: AufsBackend requires
root privileges
W0517 18:46:16.154892 29180 backend.cpp:76] Failed to create 'bind' backend: BindBackend requires
root privileges
I0517 18:46:16.154958 29180 provisioner.cpp:249] Using default backend 'copy'
I0517 18:46:16.156535 29180 cluster.cpp:448] Creating default 'local' authorizer
I0517 18:46:16.158046 29212 slave.cpp:225] Mesos agent started on (750)@172.17.0.2:53016
I0517 18:46:16.158085 29212 slave.cpp:226] Flags at startup: --acls="" --appc_simple_discovery_uri_prefix="http://"
--appc_store_dir="/tmp/mesos/store/appc" --authenticate_http_readonly="true" --authenticate_http_readwrite="true"
--authenticatee="crammd5" --authentication_backoff_factor="1secs" --authorizer="local" --cgroups_cpu_enable_pids_and_tids_count="false"
--cgroups_enable_cfs="false" --cgroups_hierarchy="/sys/fs/cgroup" --cgroups_limit_swap="false"
--cgroups_root="mesos" --container_disk_watch_interval="15secs" --containerizers="mesos" --credential="/tmp/Endpoint_SlaveEndpointTest_NoAuthorizer_0_o4tpwS/credential"
--default_role="*" --disk_watch_interval="1mins" --docker="docker" --docker_kill_orphans="true"
--docker_registry="https://registry-1.docker.io" --docker_remove_delay="6hrs" --docker_socket="/var/run/docker.sock"
--docker_stop_timeout="0ns" --docker_store_dir="/tmp/mesos/store/docker" --docker_volume_checkpoint_dir="/var/run/mesos/isolators/docker/volume"
--enforce_container_disk_quota="false" --executor_registration_timeout="1mins" --executor_shutdown_grace_period="5secs"
--fetcher_cache_dir="/tmp/Endpoint_SlaveEndpointTest_NoAuthorizer_0_o4tpwS/fetch" --fetcher_cache_size="2GB"
--frameworks_home="" --gc_delay="1weeks" --gc_disk_headroom="0.1" --hadoop_home="" --help="false"
--hostname_lookup="true" --http_command_executor="false" --http_credentials="/tmp/Endpoint_SlaveEndpointTest_NoAuthorizer_0_o4tpwS/http_credentials"
--http_heartbeat_interval="30secs" --initialize_driver_logging="true" --isolation="posix/cpu,posix/mem"
--launcher="posix" --launcher_dir="/mesos/mesos-1.4.0/_build/src" --logbufsecs="0" --logging_level="INFO"
--max_completed_executors_per_framework="150" --oversubscribed_resources_interval="15secs"
--perf_duration="10secs" --perf_interval="1mins" --port="5051" --qos_correction_interval_min="0ns"
--quiet="false" --recover="reconnect" --recovery_timeout="15mins" --registration_backoff_factor="10ms"
--resources="cpus:2;gpus:0;mem:1024;disk:1024;ports:[31000-32000]" --revocable_cpu_low_priority="true"
--runtime_dir="/tmp/Endpoint_SlaveEndpointTest_NoAuthorizer_0_o4tpwS" --sandbox_directory="/mnt/mesos/sandbox"
--strict="true" --switch_user="true" --systemd_enable_support="true" --systemd_runtime_directory="/run/systemd/system"
--version="false" --work_dir="/tmp/Endpoint_SlaveEndpointTest_NoAuthorizer_0_JoEqw7"
I0517 18:46:16.158601 29212 credentials.hpp:86] Loading credential for authentication from
'/tmp/Endpoint_SlaveEndpointTest_NoAuthorizer_0_o4tpwS/credential'
I0517 18:46:16.158828 29212 slave.cpp:258] Agent using credential for: test-principal
I0517 18:46:16.158854 29212 credentials.hpp:37] Loading credentials for authentication from
'/tmp/Endpoint_SlaveEndpointTest_NoAuthorizer_0_o4tpwS/http_credentials'
I0517 18:46:16.159143 29212 http.cpp:975] Creating default 'basic' HTTP authenticator for
realm 'mesos-agent-readonly'
I0517 18:46:16.159317 29212 http.cpp:975] Creating default 'basic' HTTP authenticator for
realm 'mesos-agent-readwrite'
I0517 18:46:16.160573 29212 slave.cpp:529] Agent resources: cpus(*):2; mem(*):1024; disk(*):1024;
ports(*):[31000-32000]
I0517 18:46:16.160641 29212 slave.cpp:537] Agent attributes: [  ]
I0517 18:46:16.160655 29212 slave.cpp:542] Agent hostname: 1f8d8f5189a1
I0517 18:46:16.160811 29200 status_update_manager.cpp:177] Pausing sending status updates
I0517 18:46:16.162091 29211 state.cpp:62] Recovering state from '/tmp/Endpoint_SlaveEndpointTest_NoAuthorizer_0_JoEqw7/meta'
I0517 18:46:16.162456 29212 status_update_manager.cpp:203] Recovering status update manager
I0517 18:46:16.162665 29202 containerizer.cpp:608] Recovering containerizer
I0517 18:46:16.164157 29200 provisioner.cpp:410] Provisioner recovery complete
I0517 18:46:16.164554 29208 slave.cpp:5974] Finished recovery
I0517 18:46:16.165144 29208 slave.cpp:6156] Querying resource estimator for oversubscribable
resources
I0517 18:46:16.165419 29212 slave.cpp:6170] Received oversubscribable resources {} from the
resource estimator
I0517 18:46:16.168190 29203 process.cpp:3730] Handling HTTP event for process 'slave(750)'
with path: '/slave(750)/monitor/statistics'
I0517 18:46:16.170234 29200 http.cpp:1115] HTTP GET for /slave(750)/monitor/statistics from
172.17.0.2:54688
I0517 18:46:16.170330 29200 http.cpp:936] Authorizing principal 'test-principal' to GET the
'/monitor/statistics' endpoint
I0517 18:46:16.173672 29200 slave.cpp:794] Agent terminating
[       OK ] Endpoint/SlaveEndpointTest.NoAuthorizer/0 (31 ms)
[ RUN      ] Endpoint/SlaveEndpointTest.NoAuthorizer/1
I0517 18:46:16.182999 29180 containerizer.cpp:221] Using isolation: posix/cpu,posix/mem,filesystem/posix,network/cni
W0517 18:46:16.183434 29180 backend.cpp:76] Failed to create 'aufs' backend: AufsBackend requires
root privileges
W0517 18:46:16.183533 29180 backend.cpp:76] Failed to create 'bind' backend: BindBackend requires
root privileges
I0517 18:46:16.183569 29180 provisioner.cpp:249] Using default backend 'copy'
I0517 18:46:16.184926 29180 cluster.cpp:448] Creating default 'local' authorizer
I0517 18:46:16.186722 29211 slave.cpp:225] Mesos agent started on (751)@172.17.0.2:53016
I0517 18:46:16.186790 29211 slave.cpp:226] Flags at startup: --acls="" --appc_simple_discovery_uri_prefix="http://"
--appc_store_dir="/tmp/mesos/store/appc" --authenticate_http_readonly="true" --authenticate_http_readwrite="true"
--authenticatee="crammd5" --authentication_backoff_factor="1secs" --authorizer="local" --cgroups_cpu_enable_pids_and_tids_count="false"
--cgroups_enable_cfs="false" --cgroups_hierarchy="/sys/fs/cgroup" --cgroups_limit_swap="false"
--cgroups_root="mesos" --container_disk_watch_interval="15secs" --containerizers="mesos" --credential="/tmp/Endpoint_SlaveEndpointTest_NoAuthorizer_1_SbQZMU/credential"
--default_role="*" --disk_watch_interval="1mins" --docker="docker" --docker_kill_orphans="true"
--docker_registry="https://registry-1.docker.io" --docker_remove_delay="6hrs" --docker_socket="/var/run/docker.sock"
--docker_stop_timeout="0ns" --docker_store_dir="/tmp/mesos/store/docker" --docker_volume_checkpoint_dir="/var/run/mesos/isolators/docker/volume"
--enforce_container_disk_quota="false" --executor_registration_timeout="1mins" --executor_shutdown_grace_period="5secs"
--fetcher_cache_dir="/tmp/Endpoint_SlaveEndpointTest_NoAuthorizer_1_SbQZMU/fetch" --fetcher_cache_size="2GB"
--frameworks_home="" --gc_delay="1weeks" --gc_disk_headroom="0.1" --hadoop_home="" --help="false"
--hostname_lookup="true" --http_command_executor="false" --http_credentials="/tmp/Endpoint_SlaveEndpointTest_NoAuthorizer_1_SbQZMU/http_credentials"
--http_heartbeat_interval="30secs" --initialize_driver_logging="true" --isolation="posix/cpu,posix/mem"
--launcher="posix" --launcher_dir="/mesos/mesos-1.4.0/_build/src" --logbufsecs="0" --logging_level="INFO"
--max_completed_executors_per_framework="150" --oversubscribed_resources_interval="15secs"
--perf_duration="10secs" --perf_interval="1mins" --port="5051" --qos_correction_interval_min="0ns"
--quiet="false" --recover="reconnect" --recovery_timeout="15mins" --registration_backoff_factor="10ms"
--resources="cpus:2;gpus:0;mem:1024;disk:1024;ports:[31000-32000]" --revocable_cpu_low_priority="true"
--runtime_dir="/tmp/Endpoint_SlaveEndpointTest_NoAuthorizer_1_SbQZMU" --sandbox_directory="/mnt/mesos/sandbox"
--strict="true" --switch_user="true" --systemd_enable_support="true" --systemd_runtime_directory="/run/systemd/system"
--version="false" --work_dir="/tmp/Endpoint_SlaveEndpointTest_NoAuthorizer_1_tcg8H9"
I0517 18:46:16.187353 29211 credentials.hpp:86] Loading credential for authentication from
'/tmp/Endpoint_SlaveEndpointTest_NoAuthorizer_1_SbQZMU/credential'
I0517 18:46:16.187566 29211 slave.cpp:258] Agent using credential for: test-principal
I0517 18:46:16.187589 29211 credentials.hpp:37] Loading credentials for authentication from
'/tmp/Endpoint_SlaveEndpointTest_NoAuthorizer_1_SbQZMU/http_credentials'
I0517 18:46:16.187954 29211 http.cpp:975] Creating default 'basic' HTTP authenticator for
realm 'mesos-agent-readonly'
I0517 18:46:16.188144 29211 http.cpp:975] Creating default 'basic' HTTP authenticator for
realm 'mesos-agent-readwrite'
I0517 18:46:16.189476 29211 slave.cpp:529] Agent resources: cpus(*):2; mem(*):1024; disk(*):1024;
ports(*):[31000-32000]
I0517 18:46:16.189545 29211 slave.cpp:537] Agent attributes: [  ]
I0517 18:46:16.189558 29211 slave.cpp:542] Agent hostname: 1f8d8f5189a1
I0517 18:46:16.189815 29202 status_update_manager.cpp:177] Pausing sending status updates
I0517 18:46:16.191303 29205 state.cpp:62] Recovering state from '/tmp/Endpoint_SlaveEndpointTest_NoAuthorizer_1_tcg8H9/meta'
I0517 18:46:16.191567 29210 status_update_manager.cpp:203] Recovering status update manager
I0517 18:46:16.191828 29213 containerizer.cpp:608] Recovering containerizer
I0517 18:46:16.193215 29200 provisioner.cpp:410] Provisioner recovery complete
I0517 18:46:16.193692 29201 slave.cpp:5974] Finished recovery
I0517 18:46:16.194402 29201 slave.cpp:6156] Querying resource estimator for oversubscribable
resources
I0517 18:46:16.194643 29203 slave.cpp:6170] Received oversubscribable resources {} from the
resource estimator
I0517 18:46:16.197228 29210 process.cpp:3730] Handling HTTP event for process 'slave(751)'
with path: '/slave(751)/monitor/statistics.json'
I0517 18:46:16.198504 29203 http.cpp:1115] HTTP GET for /slave(751)/monitor/statistics.json
from 172.17.0.2:54691
I0517 18:46:16.198593 29203 http.cpp:936] Authorizing principal 'test-principal' to GET the
'/monitor/statistics.json' endpoint
I0517 18:46:16.201905 29205 slave.cpp:794] Agent terminating
[       OK ] Endpoint/SlaveEndpointTest.NoAuthorizer/1 (29 ms)
[ RUN      ] Endpoint/SlaveEndpointTest.NoAuthorizer/2
I0517 18:46:16.211719 29180 containerizer.cpp:221] Using isolation: posix/cpu,posix/mem,filesystem/posix,network/cni
W0517 18:46:16.212167 29180 backend.cpp:76] Failed to create 'aufs' backend: AufsBackend requires
root privileges
W0517 18:46:16.212262 29180 backend.cpp:76] Failed to create 'bind' backend: BindBackend requires
root privileges
I0517 18:46:16.212296 29180 provisioner.cpp:249] Using default backend 'copy'
I0517 18:46:16.213896 29180 cluster.cpp:448] Creating default 'local' authorizer
I0517 18:46:16.215416 29198 slave.cpp:225] Mesos agent started on (752)@172.17.0.2:53016
I0517 18:46:16.215454 29198 slave.cpp:226] Flags at startup: --acls="" --appc_simple_discovery_uri_prefix="http://"
--appc_store_dir="/tmp/mesos/store/appc" --authenticate_http_readonly="true" --authenticate_http_readwrite="true"
--authenticatee="crammd5" --authentication_backoff_factor="1secs" --authorizer="local" --cgroups_cpu_enable_pids_and_tids_count="false"
--cgroups_enable_cfs="false" --cgroups_hierarchy="/sys/fs/cgroup" --cgroups_limit_swap="false"
--cgroups_root="mesos" --container_disk_watch_interval="15secs" --containerizers="mesos" --credential="/tmp/Endpoint_SlaveEndpointTest_NoAuthorizer_2_A4ThmX/credential"
--default_role="*" --disk_watch_interval="1mins" --docker="docker" --docker_kill_orphans="true"
--docker_registry="https://registry-1.docker.io" --docker_remove_delay="6hrs" --docker_socket="/var/run/docker.sock"
--docker_stop_timeout="0ns" --docker_store_dir="/tmp/mesos/store/docker" --docker_volume_checkpoint_dir="/var/run/mesos/isolators/docker/volume"
--enforce_container_disk_quota="false" --executor_registration_timeout="1mins" --executor_shutdown_grace_period="5secs"
--fetcher_cache_dir="/tmp/Endpoint_SlaveEndpointTest_NoAuthorizer_2_A4ThmX/fetch" --fetcher_cache_size="2GB"
--frameworks_home="" --gc_delay="1weeks" --gc_disk_headroom="0.1" --hadoop_home="" --help="false"
--hostname_lookup="true" --http_command_executor="false" --http_credentials="/tmp/Endpoint_SlaveEndpointTest_NoAuthorizer_2_A4ThmX/http_credentials"
--http_heartbeat_interval="30secs" --initialize_driver_logging="true" --isolation="posix/cpu,posix/mem"
--launcher="posix" --launcher_dir="/mesos/mesos-1.4.0/_build/src" --logbufsecs="0" --logging_level="INFO"
--max_completed_executors_per_framework="150" --oversubscribed_resources_interval="15secs"
--perf_duration="10secs" --perf_interval="1mins" --port="5051" --qos_correction_interval_min="0ns"
--quiet="false" --recover="reconnect" --recovery_timeout="15mins" --registration_backoff_factor="10ms"
--resources="cpus:2;gpus:0;mem:1024;disk:1024;ports:[31000-32000]" --revocable_cpu_low_priority="true"
--runtime_dir="/tmp/Endpoint_SlaveEndpointTest_NoAuthorizer_2_A4ThmX" --sandbox_directory="/mnt/mesos/sandbox"
--strict="true" --switch_user="true" --systemd_enable_support="true" --systemd_runtime_directory="/run/systemd/system"
--version="false" --work_dir="/tmp/Endpoint_SlaveEndpointTest_NoAuthorizer_2_9wyLcc"
I0517 18:46:16.215929 29198 credentials.hpp:86] Loading credential for authentication from
'/tmp/Endpoint_SlaveEndpointTest_NoAuthorizer_2_A4ThmX/credential'
I0517 18:46:16.216080 29198 slave.cpp:258] Agent using credential for: test-principal
I0517 18:46:16.216100 29198 credentials.hpp:37] Loading credentials for authentication from
'/tmp/Endpoint_SlaveEndpointTest_NoAuthorizer_2_A4ThmX/http_credentials'
I0517 18:46:16.216310 29198 http.cpp:975] Creating default 'basic' HTTP authenticator for
realm 'mesos-agent-readonly'
I0517 18:46:16.216454 29198 http.cpp:975] Creating default 'basic' HTTP authenticator for
realm 'mesos-agent-readwrite'
I0517 18:46:16.217566 29198 slave.cpp:529] Agent resources: cpus(*):2; mem(*):1024; disk(*):1024;
ports(*):[31000-32000]
I0517 18:46:16.217633 29198 slave.cpp:537] Agent attributes: [  ]
I0517 18:46:16.217646 29198 slave.cpp:542] Agent hostname: 1f8d8f5189a1
I0517 18:46:16.217784 29200 status_update_manager.cpp:177] Pausing sending status updates
I0517 18:46:16.219210 29211 state.cpp:62] Recovering state from '/tmp/Endpoint_SlaveEndpointTest_NoAuthorizer_2_9wyLcc/meta'
I0517 18:46:16.219554 29200 status_update_manager.cpp:203] Recovering status update manager
I0517 18:46:16.219851 29205 containerizer.cpp:608] Recovering containerizer
I0517 18:46:16.221161 29205 provisioner.cpp:410] Provisioner recovery complete
I0517 18:46:16.221552 29199 slave.cpp:5974] Finished recovery
I0517 18:46:16.222076 29199 slave.cpp:6156] Querying resource estimator for oversubscribable
resources
I0517 18:46:16.222429 29203 slave.cpp:6170] Received oversubscribable resources {} from the
resource estimator
I0517 18:46:16.224995 29202 process.cpp:3730] Handling HTTP event for process 'slave(752)'
with path: '/slave(752)/containers'
I0517 18:46:16.226485 29205 http.cpp:1115] HTTP GET for /slave(752)/containers from 172.17.0.2:54695
I0517 18:46:16.226554 29205 http.cpp:936] Authorizing principal 'test-principal' to GET the
'/containers' endpoint
I0517 18:46:16.230340 29213 slave.cpp:794] Agent terminating
[       OK ] Endpoint/SlaveEndpointTest.NoAuthorizer/2 (27 ms)
[----------] 9 tests from Endpoint/SlaveEndpointTest (261 ms total)

[----------] Global test environment tear-down
[==========] 1575 tests from 175 test cases ran. (482531 ms total)
[  PASSED  ] 1574 tests.
[  FAILED  ] 1 test, listed below:
[  FAILED  ] SlaveTest.HTTPSchedulerSlaveRestart

 1 FAILED TEST
  YOU HAVE 22 DISABLED TESTS

E0517 18:46:16.289108 29214 process.cpp:950] Failed to accept socket: future discarded
make[4]: *** [check-local] Error 1
make[4]: Leaving directory `/mesos/mesos-1.4.0/_build/src'
make[3]: *** [check-am] Error 2
make[3]: Leaving directory `/mesos/mesos-1.4.0/_build/src'
make[2]: *** [check] Error 2
make[2]: Leaving directory `/mesos/mesos-1.4.0/_build/src'
make[1]: *** [check-recursive] Error 1
make[1]: Leaving directory `/mesos/mesos-1.4.0/_build'
make: *** [distcheck] Error 1
+ docker rmi mesos-1495043916-10948
Untagged: mesos-1495043916-10948:latest
Deleted: sha256:87eac4dbe8dc60a7f4616c9b96d2659801c5493c6773e798f9e72923672fa532
Deleted: sha256:4f2fe2bfabd03048e88e08cc1dbf160ff3b7a99a34011932db2e92c84903a934
Deleted: sha256:feebec8ad75a8fbd848293439fd76aee96e5d75ae9244755ecab609fa82dce41
Deleted: sha256:598fe7db56ee887cebb51a63c87b7901d47f8e0f969024376379165b2de5bf0a
Deleted: sha256:1188ff0bdd96e0978963725dc93b48ac05db463cc4f7559ea7fdde62ef7aaa34
Deleted: sha256:ea5c22139f0d45c53f9c36ffd64c3dac027bfcfcaeca0bdc300c41a0fc6ae46b
Deleted: sha256:b565efaa7343751cdcb2d5b4c97b6699cfcf721f0b7ca1e068b4613529dde7d3
Deleted: sha256:150b80801eb4794210277bced4be907e1b9c169525e5e90fe93ac89b09c12197
Deleted: sha256:480e11daadb819106d193b9993a3700b0b41908d4e930b301e8f4405d8e18340
Deleted: sha256:ab714609034f67e2e2e7004a69241a59821a29748cd47be9e93c1d921fb1cd65
Deleted: sha256:e164f16a6b27398d49bc0a577c9d8f094514fc9f3c36789fe5ef325d448787ce
Deleted: sha256:ea09d38702d38900d2244cdc36ae0fd7e87df253507de06ab9f974d890dc0a2b
Deleted: sha256:75cd1cb296e3bf6bfe810ef6db5f66aa0a129e2858bb04904312a311fae0a134
Deleted: sha256:7fff57fb03219afa25d240ed8aaf6b8a27a324d0e2133da84eaaa51cc93ed174
Deleted: sha256:491f0be5b4edf0159082a7634406258afa348220ef37a8e99e865d8683e6204e
Deleted: sha256:c441cfd77a1e3822820c30267b25fbd9ec5c8a5e702a87b879794764f1fe8669
Deleted: sha256:1a2e9f4c1a7175f168dfd4f9095d081f9d0ecb9e45b20ba4fce6083a7c9b5180
Deleted: sha256:a50e388b076a03585d3c7888ddfe0bed29a4a65f7c4d0cf689833a1ca199b8ca
Deleted: sha256:496cadbed034c0c2ae84b83b77bfe8d2ab8679a9d746a8db3a23e568f1798c9d
Deleted: sha256:4607681e8a637f0050be857c337104d844978318903f7fd3e40e1ca3ee54399f
Deleted: sha256:37b27eb0f4360445fa0cf35797784102df3fbd020e7e913bce3f5cd3f1fbc62f
Deleted: sha256:cc21f3f0e959c493ba2d275fbfb23d25e37e72de494538f7ebd08c17aff58718
Deleted: sha256:f14a099a77b6ea3def6995f7a68753b3afca2f9b2efca7a6caf5ad0260d922a6
Deleted: sha256:c85bbcd3ae4f51090247a8b8b9ec1a42556710b51f74e0dac4373fa966f9f464
Build step 'Execute shell' marked build as failure
Not sending mail to unregistered user neil.conway@gmail.com

Mime
View raw message