mesos-builds mailing list archives

Site index · List index
Message view « Date » · « Thread »
Top « Date » · « Thread »
From Apache Jenkins Server <jenk...@builds.apache.org>
Subject Build failed in Jenkins: Mesos-Buildbot » autotools,gcc,--verbose --enable-libevent --enable-ssl,GLOG_v=1 MESOS_VERBOSE=1,ubuntu:14.04,(docker||Hadoop)&&(!ubuntu-us1)&&(!ubuntu-eu2) #3738
Date Sat, 27 May 2017 13:24:41 GMT
See <https://builds.apache.org/job/Mesos-Buildbot/BUILDTOOL=autotools,COMPILER=gcc,CONFIGURATION=--verbose%20--enable-libevent%20--enable-ssl,ENVIRONMENT=GLOG_v=1%20MESOS_VERBOSE=1,OS=ubuntu%3A14.04,label_exp=(docker%7C%7CHadoop)&&(!ubuntu-us1)&&(!ubuntu-eu2)/3738/display/redirect?page=changes>

Changes:

[neil.conway] Made MasterTest.MaxCompletedTasksPerFrameworkFlag less fragile.

------------------------------------------
[...truncated 2.74 MB...]
I0527 13:24:15.775537  1805 openssl.cpp:419] CA file path is unspecified! NOTE: Set CA file
path with LIBPROCESS_SSL_CA_FILE=<filepath>
I0527 13:24:15.775568  1805 openssl.cpp:424] CA directory path unspecified! NOTE: Set CA directory
path with LIBPROCESS_SSL_CA_DIR=<dirpath>
I0527 13:24:15.775576  1805 openssl.cpp:429] Will not verify peer certificate!
NOTE: Set LIBPROCESS_SSL_VERIFY_CERT=1 to enable peer certificate verification
I0527 13:24:15.775584  1805 openssl.cpp:435] Will only verify peer certificate if presented!
NOTE: Set LIBPROCESS_SSL_REQUIRE_CERT=1 to require peer certificate verification
E0527 13:24:15.776152  3037 process.cpp:950] Failed to accept socket: future discarded
I0527 13:24:15.778544  1805 process.cpp:1266] libprocess is initialized on 172.17.0.2:53461
with 16 worker threads
I0527 13:24:15.784082  3048 process.cpp:3730] Handling HTTP event for process '(93)' with
path: '/(93)/delete'
[       OK ] Scheme/HTTPTest.Delete/0 (236 ms)
[ RUN      ] Scheme/HTTPTest.Delete/1
I0527 13:24:15.788350  1805 process.cpp:1266] libprocess is initialized on 172.17.0.2:40249
with 16 worker threads
I0527 13:24:15.789855  3059 process.cpp:3730] Handling HTTP event for process '(94)' with
path: '/(94)/delete'
[       OK ] Scheme/HTTPTest.Delete/1 (5 ms)
[ RUN      ] Scheme/HTTPTest.Request/0
I0527 13:24:16.177470  1805 openssl.cpp:419] CA file path is unspecified! NOTE: Set CA file
path with LIBPROCESS_SSL_CA_FILE=<filepath>
I0527 13:24:16.177492  1805 openssl.cpp:424] CA directory path unspecified! NOTE: Set CA directory
path with LIBPROCESS_SSL_CA_DIR=<dirpath>
I0527 13:24:16.177497  1805 openssl.cpp:429] Will not verify peer certificate!
NOTE: Set LIBPROCESS_SSL_VERIFY_CERT=1 to enable peer certificate verification
I0527 13:24:16.177511  1805 openssl.cpp:435] Will only verify peer certificate if presented!
NOTE: Set LIBPROCESS_SSL_REQUIRE_CERT=1 to require peer certificate verification
E0527 13:24:16.177961  3071 process.cpp:950] Failed to accept socket: future discarded
I0527 13:24:16.180881  1805 process.cpp:1266] libprocess is initialized on 172.17.0.2:43576
with 16 worker threads
I0527 13:24:16.186589  3077 process.cpp:3730] Handling HTTP event for process '(95)' with
path: '/(95)/request'
[       OK ] Scheme/HTTPTest.Request/0 (397 ms)
[ RUN      ] Scheme/HTTPTest.Request/1
I0527 13:24:16.190253  1805 process.cpp:1266] libprocess is initialized on 172.17.0.2:50261
with 16 worker threads
I0527 13:24:16.191818  3094 process.cpp:3730] Handling HTTP event for process '(96)' with
path: '/(96)/request'
[       OK ] Scheme/HTTPTest.Request/1 (5 ms)
[ RUN      ] Scheme/HTTPTest.QueryEncodeDecode/0
I0527 13:24:16.673735  1805 openssl.cpp:419] CA file path is unspecified! NOTE: Set CA file
path with LIBPROCESS_SSL_CA_FILE=<filepath>
I0527 13:24:16.673765  1805 openssl.cpp:424] CA directory path unspecified! NOTE: Set CA directory
path with LIBPROCESS_SSL_CA_DIR=<dirpath>
I0527 13:24:16.673773  1805 openssl.cpp:429] Will not verify peer certificate!
NOTE: Set LIBPROCESS_SSL_VERIFY_CERT=1 to enable peer certificate verification
I0527 13:24:16.673779  1805 openssl.cpp:435] Will only verify peer certificate if presented!
NOTE: Set LIBPROCESS_SSL_REQUIRE_CERT=1 to require peer certificate verification
E0527 13:24:16.674626  3105 process.cpp:950] Failed to accept socket: future discarded
I0527 13:24:16.679592  1805 process.cpp:1266] libprocess is initialized on 172.17.0.2:44121
with 16 worker threads
[       OK ] Scheme/HTTPTest.QueryEncodeDecode/0 (487 ms)
[ RUN      ] Scheme/HTTPTest.QueryEncodeDecode/1
I0527 13:24:16.691840  1805 process.cpp:1266] libprocess is initialized on 172.17.0.2:42606
with 16 worker threads
[       OK ] Scheme/HTTPTest.QueryEncodeDecode/1 (12 ms)
[ RUN      ] Scheme/HTTPTest.Headers/0
I0527 13:24:16.858999  1805 openssl.cpp:419] CA file path is unspecified! NOTE: Set CA file
path with LIBPROCESS_SSL_CA_FILE=<filepath>
I0527 13:24:16.859025  1805 openssl.cpp:424] CA directory path unspecified! NOTE: Set CA directory
path with LIBPROCESS_SSL_CA_DIR=<dirpath>
I0527 13:24:16.859032  1805 openssl.cpp:429] Will not verify peer certificate!
NOTE: Set LIBPROCESS_SSL_VERIFY_CERT=1 to enable peer certificate verification
I0527 13:24:16.859038  1805 openssl.cpp:435] Will only verify peer certificate if presented!
NOTE: Set LIBPROCESS_SSL_REQUIRE_CERT=1 to require peer certificate verification
E0527 13:24:16.859586  3139 process.cpp:950] Failed to accept socket: future discarded
I0527 13:24:16.871878  1805 process.cpp:1266] libprocess is initialized on 172.17.0.2:54296
with 16 worker threads
[       OK ] Scheme/HTTPTest.Headers/0 (180 ms)
[ RUN      ] Scheme/HTTPTest.Headers/1
I0527 13:24:16.875401  1805 process.cpp:1266] libprocess is initialized on 172.17.0.2:36522
with 16 worker threads
[       OK ] Scheme/HTTPTest.Headers/1 (3 ms)
[ RUN      ] Scheme/HTTPTest.CaseInsensitiveHeaders/0
I0527 13:24:17.131479  1805 openssl.cpp:419] CA file path is unspecified! NOTE: Set CA file
path with LIBPROCESS_SSL_CA_FILE=<filepath>
I0527 13:24:17.131503  1805 openssl.cpp:424] CA directory path unspecified! NOTE: Set CA directory
path with LIBPROCESS_SSL_CA_DIR=<dirpath>
I0527 13:24:17.131507  1805 openssl.cpp:429] Will not verify peer certificate!
NOTE: Set LIBPROCESS_SSL_VERIFY_CERT=1 to enable peer certificate verification
I0527 13:24:17.131511  1805 openssl.cpp:435] Will only verify peer certificate if presented!
NOTE: Set LIBPROCESS_SSL_REQUIRE_CERT=1 to require peer certificate verification
E0527 13:24:17.131979  3173 process.cpp:950] Failed to accept socket: future discarded
I0527 13:24:17.134042  1805 process.cpp:1266] libprocess is initialized on 172.17.0.2:38432
with 16 worker threads
[       OK ] Scheme/HTTPTest.CaseInsensitiveHeaders/0 (259 ms)
[ RUN      ] Scheme/HTTPTest.CaseInsensitiveHeaders/1
I0527 13:24:17.155824  1805 process.cpp:1266] libprocess is initialized on 172.17.0.2:40762
with 16 worker threads
[       OK ] Scheme/HTTPTest.CaseInsensitiveHeaders/1 (22 ms)
[ RUN      ] Scheme/HTTPTest.WWWAuthenticateHeader/0
I0527 13:24:17.560052  1805 openssl.cpp:419] CA file path is unspecified! NOTE: Set CA file
path with LIBPROCESS_SSL_CA_FILE=<filepath>
I0527 13:24:17.560081  1805 openssl.cpp:424] CA directory path unspecified! NOTE: Set CA directory
path with LIBPROCESS_SSL_CA_DIR=<dirpath>
I0527 13:24:17.560088  1805 openssl.cpp:429] Will not verify peer certificate!
NOTE: Set LIBPROCESS_SSL_VERIFY_CERT=1 to enable peer certificate verification
I0527 13:24:17.560094  1805 openssl.cpp:435] Will only verify peer certificate if presented!
NOTE: Set LIBPROCESS_SSL_REQUIRE_CERT=1 to require peer certificate verification
E0527 13:24:17.560642  3207 process.cpp:950] Failed to accept socket: future discarded
I0527 13:24:17.568450  1805 process.cpp:1266] libprocess is initialized on 172.17.0.2:53035
with 16 worker threads
[       OK ] Scheme/HTTPTest.WWWAuthenticateHeader/0 (413 ms)
[ RUN      ] Scheme/HTTPTest.WWWAuthenticateHeader/1
I0527 13:24:17.571415  1805 process.cpp:1266] libprocess is initialized on 172.17.0.2:41178
with 16 worker threads
[       OK ] Scheme/HTTPTest.WWWAuthenticateHeader/1 (2 ms)
[ RUN      ] Scheme/HTTPTest.Accepts/0
I0527 13:24:18.124861  1805 openssl.cpp:419] CA file path is unspecified! NOTE: Set CA file
path with LIBPROCESS_SSL_CA_FILE=<filepath>
I0527 13:24:18.124887  1805 openssl.cpp:424] CA directory path unspecified! NOTE: Set CA directory
path with LIBPROCESS_SSL_CA_DIR=<dirpath>
I0527 13:24:18.124892  1805 openssl.cpp:429] Will not verify peer certificate!
NOTE: Set LIBPROCESS_SSL_VERIFY_CERT=1 to enable peer certificate verification
I0527 13:24:18.124897  1805 openssl.cpp:435] Will only verify peer certificate if presented!
NOTE: Set LIBPROCESS_SSL_REQUIRE_CERT=1 to require peer certificate verification
E0527 13:24:18.125468  3241 process.cpp:950] Failed to accept socket: future discarded
I0527 13:24:18.136163  1805 process.cpp:1266] libprocess is initialized on 172.17.0.2:42001
with 16 worker threads
[       OK ] Scheme/HTTPTest.Accepts/0 (566 ms)
[ RUN      ] Scheme/HTTPTest.Accepts/1
I0527 13:24:18.146051  1805 process.cpp:1266] libprocess is initialized on 172.17.0.2:36345
with 16 worker threads
[       OK ] Scheme/HTTPTest.Accepts/1 (10 ms)
E0527 13:24:18.147800  3275 process.cpp:950] Failed to accept socket: future discarded
I0527 13:24:18.149957  1805 process.cpp:1266] libprocess is initialized on 172.17.0.2:49564
with 16 worker threads
[----------] 42 tests from Scheme/HTTPTest (7942 ms total)

[----------] 4 tests from Encryption/NetSocketTest
[ RUN      ] Encryption/NetSocketTest.EOFBeforeRecv/0
I0527 13:24:18.503727  1805 openssl.cpp:419] CA file path is unspecified! NOTE: Set CA file
path with LIBPROCESS_SSL_CA_FILE=<filepath>
I0527 13:24:18.503760  1805 openssl.cpp:424] CA directory path unspecified! NOTE: Set CA directory
path with LIBPROCESS_SSL_CA_DIR=<dirpath>
I0527 13:24:18.503770  1805 openssl.cpp:429] Will not verify peer certificate!
NOTE: Set LIBPROCESS_SSL_VERIFY_CERT=1 to enable peer certificate verification
I0527 13:24:18.503778  1805 openssl.cpp:435] Will only verify peer certificate if presented!
NOTE: Set LIBPROCESS_SSL_REQUIRE_CERT=1 to require peer certificate verification
E0527 13:24:18.504369  3292 process.cpp:950] Failed to accept socket: future discarded
I0527 13:24:18.507376  1805 process.cpp:1266] libprocess is initialized on 172.17.0.2:48962
with 16 worker threads
../../../3rdparty/libprocess/src/tests/socket_tests.cpp:196: Failure
Failed to wait 15secs for client->recv()
[  FAILED  ] Encryption/NetSocketTest.EOFBeforeRecv/0, where GetParam() = "SSL" (15401 ms)
[ RUN      ] Encryption/NetSocketTest.EOFBeforeRecv/1
I0527 13:24:33.555815  1805 process.cpp:1266] libprocess is initialized on 172.17.0.2:50793
with 16 worker threads
[       OK ] Encryption/NetSocketTest.EOFBeforeRecv/1 (18 ms)
[ RUN      ] Encryption/NetSocketTest.EOFAfterRecv/0
I0527 13:24:33.958465  1805 openssl.cpp:419] CA file path is unspecified! NOTE: Set CA file
path with LIBPROCESS_SSL_CA_FILE=<filepath>
I0527 13:24:33.958493  1805 openssl.cpp:424] CA directory path unspecified! NOTE: Set CA directory
path with LIBPROCESS_SSL_CA_DIR=<dirpath>
I0527 13:24:33.958500  1805 openssl.cpp:429] Will not verify peer certificate!
NOTE: Set LIBPROCESS_SSL_VERIFY_CERT=1 to enable peer certificate verification
I0527 13:24:33.958506  1805 openssl.cpp:435] Will only verify peer certificate if presented!
NOTE: Set LIBPROCESS_SSL_REQUIRE_CERT=1 to require peer certificate verification
E0527 13:24:33.959017  3326 process.cpp:950] Failed to accept socket: future discarded
I0527 13:24:33.964889  1805 process.cpp:1266] libprocess is initialized on 172.17.0.2:39937
with 16 worker threads
[       OK ] Encryption/NetSocketTest.EOFAfterRecv/0 (444 ms)
[ RUN      ] Encryption/NetSocketTest.EOFAfterRecv/1
I0527 13:24:34.018409  1805 process.cpp:1266] libprocess is initialized on 172.17.0.2:59920
with 16 worker threads
[       OK ] Encryption/NetSocketTest.EOFAfterRecv/1 (4 ms)
E0527 13:24:34.020035  3360 process.cpp:950] Failed to accept socket: future discarded
I0527 13:24:34.021654  1805 process.cpp:1266] libprocess is initialized on 172.17.0.2:52799
with 16 worker threads
[----------] 4 tests from Encryption/NetSocketTest (15869 ms total)

[----------] 6 tests from SSLVerifyIPAdd/SSLTest
[ RUN      ] SSLVerifyIPAdd/SSLTest.BasicSameProcess/0
I0527 13:24:34.308056  1805 openssl.cpp:429] Will not verify peer certificate!
NOTE: Set LIBPROCESS_SSL_VERIFY_CERT=1 to enable peer certificate verification
I0527 13:24:34.308079  1805 openssl.cpp:449] LIBPROCESS_SSL_REQUIRE_CERT implies peer certificate
verification.
LIBPROCESS_SSL_VERIFY_CERT set to true
I0527 13:24:34.308179  1805 openssl.cpp:478] Using CA file: /tmp/bzwfsq/cert.pem
I0527 13:24:34.308189  1805 openssl.cpp:481] Using CA dir: /tmp/bzwfsq
[       OK ] SSLVerifyIPAdd/SSLTest.BasicSameProcess/0 (297 ms)
[ RUN      ] SSLVerifyIPAdd/SSLTest.BasicSameProcess/1
I0527 13:24:34.655498  1805 openssl.cpp:429] Will not verify peer certificate!
NOTE: Set LIBPROCESS_SSL_VERIFY_CERT=1 to enable peer certificate verification
I0527 13:24:34.655524  1805 openssl.cpp:441] Will use IP address verification in subject alternative
name certificate extension.
I0527 13:24:34.655529  1805 openssl.cpp:449] LIBPROCESS_SSL_REQUIRE_CERT implies peer certificate
verification.
LIBPROCESS_SSL_VERIFY_CERT set to true
I0527 13:24:34.655628  1805 openssl.cpp:478] Using CA file: /tmp/2pZ2v3/cert.pem
I0527 13:24:34.655640  1805 openssl.cpp:481] Using CA dir: /tmp/2pZ2v3
[       OK ] SSLVerifyIPAdd/SSLTest.BasicSameProcess/1 (346 ms)
[ RUN      ] SSLVerifyIPAdd/SSLTest.BasicSameProcessUnix/0
I0527 13:24:34.891696  1805 openssl.cpp:429] Will not verify peer certificate!
NOTE: Set LIBPROCESS_SSL_VERIFY_CERT=1 to enable peer certificate verification
I0527 13:24:34.891721  1805 openssl.cpp:435] Will only verify peer certificate if presented!
NOTE: Set LIBPROCESS_SSL_REQUIRE_CERT=1 to require peer certificate verification
[       OK ] SSLVerifyIPAdd/SSLTest.BasicSameProcessUnix/0 (233 ms)
[ RUN      ] SSLVerifyIPAdd/SSLTest.BasicSameProcessUnix/1
I0527 13:24:35.267350  1805 openssl.cpp:429] Will not verify peer certificate!
NOTE: Set LIBPROCESS_SSL_VERIFY_CERT=1 to enable peer certificate verification
I0527 13:24:35.267374  1805 openssl.cpp:435] Will only verify peer certificate if presented!
NOTE: Set LIBPROCESS_SSL_REQUIRE_CERT=1 to require peer certificate verification
I0527 13:24:35.267379  1805 openssl.cpp:441] Will use IP address verification in subject alternative
name certificate extension.
[       OK ] SSLVerifyIPAdd/SSLTest.BasicSameProcessUnix/1 (378 ms)
[ RUN      ] SSLVerifyIPAdd/SSLTest.RequireCertificate/0
I0527 13:24:35.711443  1805 openssl.cpp:424] CA directory path unspecified! NOTE: Set CA directory
path with LIBPROCESS_SSL_CA_DIR=<dirpath>
I0527 13:24:35.711469  1805 openssl.cpp:429] Will not verify peer certificate!
NOTE: Set LIBPROCESS_SSL_VERIFY_CERT=1 to enable peer certificate verification
I0527 13:24:35.711474  1805 openssl.cpp:449] LIBPROCESS_SSL_REQUIRE_CERT implies peer certificate
verification.
LIBPROCESS_SSL_VERIFY_CERT set to true
I0527 13:24:35.711580  1805 openssl.cpp:478] Using CA file: /tmp/Ea74C1/cert.pem
WARNING: Logging before InitGoogleLogging() is written to STDERR
I0527 13:24:35.718566  3378 openssl.cpp:424] CA directory path unspecified! NOTE: Set CA directory
path with LIBPROCESS_SSL_CA_DIR=<dirpath>
I0527 13:24:35.718660  3378 openssl.cpp:429] Will not verify peer certificate!
NOTE: Set LIBPROCESS_SSL_VERIFY_CERT=1 to enable peer certificate verification
I0527 13:24:35.718668  3378 openssl.cpp:449] LIBPROCESS_SSL_REQUIRE_CERT implies peer certificate
verification.
LIBPROCESS_SSL_VERIFY_CERT set to true
I0527 13:24:35.718946  3378 openssl.cpp:478] Using CA file: /tmp/Ea74C1/cert.pem
[       OK ] SSLVerifyIPAdd/SSLTest.RequireCertificate/0 (557 ms)
[ RUN      ] SSLVerifyIPAdd/SSLTest.RequireCertificate/1
I0527 13:24:36.505630  1805 openssl.cpp:424] CA directory path unspecified! NOTE: Set CA directory
path with LIBPROCESS_SSL_CA_DIR=<dirpath>
I0527 13:24:36.505658  1805 openssl.cpp:429] Will not verify peer certificate!
NOTE: Set LIBPROCESS_SSL_VERIFY_CERT=1 to enable peer certificate verification
I0527 13:24:36.505666  1805 openssl.cpp:441] Will use IP address verification in subject alternative
name certificate extension.
I0527 13:24:36.505671  1805 openssl.cpp:449] LIBPROCESS_SSL_REQUIRE_CERT implies peer certificate
verification.
LIBPROCESS_SSL_VERIFY_CERT set to true
I0527 13:24:36.505808  1805 openssl.cpp:478] Using CA file: /tmp/x7lGEI/cert.pem
WARNING: Logging before InitGoogleLogging() is written to STDERR
I0527 13:24:36.512866  3396 openssl.cpp:424] CA directory path unspecified! NOTE: Set CA directory
path with LIBPROCESS_SSL_CA_DIR=<dirpath>
I0527 13:24:36.512961  3396 openssl.cpp:429] Will not verify peer certificate!
NOTE: Set LIBPROCESS_SSL_VERIFY_CERT=1 to enable peer certificate verification
I0527 13:24:36.512965  3396 openssl.cpp:441] Will use IP address verification in subject alternative
name certificate extension.
I0527 13:24:36.512969  3396 openssl.cpp:449] LIBPROCESS_SSL_REQUIRE_CERT implies peer certificate
verification.
LIBPROCESS_SSL_VERIFY_CERT set to true
I0527 13:24:36.513126  3396 openssl.cpp:478] Using CA file: /tmp/x7lGEI/cert.pem
[       OK ] SSLVerifyIPAdd/SSLTest.RequireCertificate/1 (819 ms)
[----------] 6 tests from SSLVerifyIPAdd/SSLTest (2630 ms total)

[----------] Global test environment tear-down
[==========] 242 tests from 37 test cases ran. (39338 ms total)
[  PASSED  ] 241 tests.
[  FAILED  ] 1 test, listed below:
[  FAILED  ] Encryption/NetSocketTest.EOFBeforeRecv/0, where GetParam() = "SSL"

 1 FAILED TEST
  YOU HAVE 2 DISABLED TESTS

E0527 13:24:36.669822  3377 process.cpp:950] Failed to accept socket: future discarded
make[7]: *** [check-local] Error 1
make[7]: Leaving directory `/mesos/mesos-1.4.0/_build/3rdparty/libprocess'
make[6]: *** [check-am] Error 2
make[6]: Leaving directory `/mesos/mesos-1.4.0/_build/3rdparty/libprocess'
make[5]: *** [check-recursive] Error 1
make[5]: Leaving directory `/mesos/mesos-1.4.0/_build/3rdparty/libprocess'
make[4]: *** [check] Error 2
make[4]: Leaving directory `/mesos/mesos-1.4.0/_build/3rdparty/libprocess'
make[3]: *** [check-recursive] Error 1
make[3]: Leaving directory `/mesos/mesos-1.4.0/_build/3rdparty'
make[2]: *** [check] Error 2
make[2]: Leaving directory `/mesos/mesos-1.4.0/_build/3rdparty'
make[1]: *** [check-recursive] Error 1
make[1]: Leaving directory `/mesos/mesos-1.4.0/_build'
make: *** [distcheck] Error 1
+ docker rmi mesos-1495889376-28606
Untagged: mesos-1495889376-28606:latest
Deleted: sha256:8a0b64c3c3baa10798c9bda36fc1c5493f6174a488ff6b527de8d277ee4bc043
Deleted: sha256:b2b8fbf27955f1977cfc263a313f6aecc764f99665a0262a06a0c1a9774c8606
Deleted: sha256:b4f67659f1cabbf19820d4f726c6e5c32e037a4a307fa033def89fa4b6782d15
Deleted: sha256:de8268a53b506bb701d5fb130aa5f5e653d5b9a98b5824570eeaff7e841c9aa3
Deleted: sha256:a5e0cddb43024d5c336d7ab6099225d76aebba457fdeed3748bbbca45f62fa4c
Deleted: sha256:64fd84b638a280887f79eea44c1afbc5f9a4ba571a8735bb7b23b7ef0febb1bd
Deleted: sha256:90773b02646e7f4a429e2927d5e7609b42536375f576accf2c5fc4b44b68d8a1
Deleted: sha256:2be853b7e23c440844b2a116dac80481d81ea31ccc7307a70de9471bc87dfedf
Deleted: sha256:b1df6d4e5c23d6823ead662d866612e3167bad53b5804eb403dd7f7bc2c5b99a
Deleted: sha256:7598ab5e0b39974a40b94d4b6cf28078e047b3f721e39193c173a3045e9747e6
Deleted: sha256:357413c6f35cdb08c966aece6acdd2593b8f5980d242e25b30d45c694bdd2ea6
Deleted: sha256:68e2a1f9a9699c7dc7e1e44e0c4256bc790faf4625a68e6094e6cb157d9be649
Deleted: sha256:40cd746bf759b3815ab2ad9fed149cbc147e6464d0b8d0364b0e2f8e094fd0f3
Deleted: sha256:b97e8c48afc25b7ba63ea75e134f121a8b4bdf528d3ed51ffc9160eaa925d3e1
Deleted: sha256:7638a1d0c06b34b7aabad16a4d52f4ea8421ca234ccde6866eefc9552e13be17
Deleted: sha256:7dd07ea45c1ca5e4d2104d6cea8e5ea3812e8f6c6d350f7892af555a31d34fe1
Deleted: sha256:368d633c8b3b5267323c8321c63883096757693ce5c651a29567c17c0585728e
Deleted: sha256:c9556e10838ce3a8f17fef99861e8267c7675587abfe3e07602683f870fff93f
Deleted: sha256:d9141d6d669372a397f75eb802c14d0d6b5c5ced30258fc6802725bf2d1a2e90
Deleted: sha256:1af0effa320d31aaef906f144be14b429407290b7e99a84d60e4cdd1dcaf14ce
Deleted: sha256:bc388d9d8d0cdcdc3f626b1e668a371add6b328f326be707ba4f3113c40133ea
Deleted: sha256:ade013d31fa72e427871ca459d65cea4486bb08f9a61d190a0a4881272e5c2a5
Deleted: sha256:46f3a1ef712d905b05c1ea12d58225d496ba4ba73a391067f237c9ecb66bb3e4
Deleted: sha256:b0f0415f88cb17d40581397a6b9b607079607da5858cb96cd5272d4adbd66546
Build step 'Execute shell' marked build as failure
Not sending mail to unregistered user neil.conway@gmail.com

Mime
View raw message