mesos-builds mailing list archives

Site index · List index
Message view « Date » · « Thread »
Top « Date » · « Thread »
From Apache Jenkins Server <jenk...@builds.apache.org>
Subject Build failed in Jenkins: Mesos-Buildbot » autotools,gcc,--verbose,GLOG_v=1 MESOS_VERBOSE=1,centos:7,(docker||Hadoop)&&(!ubuntu-us1)&&(!ubuntu-eu2) #3626
Date Mon, 08 May 2017 21:02:28 GMT
See <https://builds.apache.org/job/Mesos-Buildbot/BUILDTOOL=autotools,COMPILER=gcc,CONFIGURATION=--verbose,ENVIRONMENT=GLOG_v=1%20MESOS_VERBOSE=1,OS=centos%3A7,label_exp=(docker%7C%7CHadoop)&&(!ubuntu-us1)&&(!ubuntu-eu2)/3626/display/redirect>

------------------------------------------
[...truncated 26.93 MB...]
[       OK ] Endpoint/SlaveEndpointTest.AuthorizedRequest/1 (31 ms)
[ RUN      ] Endpoint/SlaveEndpointTest.AuthorizedRequest/2
I0508 21:02:18.638542 31667 containerizer.cpp:221] Using isolation: posix/cpu,posix/mem,filesystem/posix,network/cni
W0508 21:02:18.639066 31667 backend.cpp:76] Failed to create 'aufs' backend: AufsBackend requires
root privileges
W0508 21:02:18.639168 31667 backend.cpp:76] Failed to create 'bind' backend: BindBackend requires
root privileges
I0508 21:02:18.639212 31667 provisioner.cpp:249] Using default backend 'copy'
I0508 21:02:18.643443 31694 slave.cpp:225] Mesos agent started on (744)@172.17.0.3:44700
I0508 21:02:18.643482 31694 slave.cpp:226] Flags at startup: --acls="" --appc_simple_discovery_uri_prefix="http://"
--appc_store_dir="/tmp/mesos/store/appc" --authenticate_http_readonly="true" --authenticate_http_readwrite="true"
--authenticatee="crammd5" --authentication_backoff_factor="1secs" --authorizer="local" --cgroups_cpu_enable_pids_and_tids_count="false"
--cgroups_enable_cfs="false" --cgroups_hierarchy="/sys/fs/cgroup" --cgroups_limit_swap="false"
--cgroups_root="mesos" --container_disk_watch_interval="15secs" --containerizers="mesos" --credential="/tmp/Endpoint_SlaveEndpointTest_AuthorizedRequest_2_9x9eUc/credential"
--default_role="*" --disk_watch_interval="1mins" --docker="docker" --docker_kill_orphans="true"
--docker_registry="https://registry-1.docker.io" --docker_remove_delay="6hrs" --docker_socket="/var/run/docker.sock"
--docker_stop_timeout="0ns" --docker_store_dir="/tmp/mesos/store/docker" --docker_volume_checkpoint_dir="/var/run/mesos/isolators/docker/volume"
--enforce_container_disk_quota="false" --executor_registration_timeout="1mins" --executor_shutdown_grace_period="5secs"
--fetcher_cache_dir="/tmp/Endpoint_SlaveEndpointTest_AuthorizedRequest_2_9x9eUc/fetch" --fetcher_cache_size="2GB"
--frameworks_home="" --gc_delay="1weeks" --gc_disk_headroom="0.1" --hadoop_home="" --help="false"
--hostname_lookup="true" --http_command_executor="false" --http_credentials="/tmp/Endpoint_SlaveEndpointTest_AuthorizedRequest_2_9x9eUc/http_credentials"
--http_heartbeat_interval="30secs" --initialize_driver_logging="true" --isolation="posix/cpu,posix/mem"
--launcher="posix" --launcher_dir="/mesos/mesos-1.4.0/_build/src" --logbufsecs="0" --logging_level="INFO"
--max_completed_executors_per_framework="150" --oversubscribed_resources_interval="15secs"
--perf_duration="10secs" --perf_interval="1mins" --port="5051" --qos_correction_interval_min="0ns"
--quiet="false" --recover="reconnect" --recovery_timeout="15mins" --registration_backoff_factor="10ms"
--resources="cpus:2;gpus:0;mem:1024;disk:1024;ports:[31000-32000]" --revocable_cpu_low_priority="true"
--runtime_dir="/tmp/Endpoint_SlaveEndpointTest_AuthorizedRequest_2_9x9eUc" --sandbox_directory="/mnt/mesos/sandbox"
--strict="true" --switch_user="true" --systemd_enable_support="true" --systemd_runtime_directory="/run/systemd/system"
--version="false" --work_dir="/tmp/Endpoint_SlaveEndpointTest_AuthorizedRequest_2_RrD2wm"
I0508 21:02:18.643919 31694 credentials.hpp:86] Loading credential for authentication from
'/tmp/Endpoint_SlaveEndpointTest_AuthorizedRequest_2_9x9eUc/credential'
I0508 21:02:18.644136 31694 slave.cpp:258] Agent using credential for: test-principal
I0508 21:02:18.644162 31694 credentials.hpp:37] Loading credentials for authentication from
'/tmp/Endpoint_SlaveEndpointTest_AuthorizedRequest_2_9x9eUc/http_credentials'
I0508 21:02:18.644407 31694 http.cpp:975] Creating default 'basic' HTTP authenticator for
realm 'mesos-agent-readonly'
I0508 21:02:18.644570 31694 http.cpp:975] Creating default 'basic' HTTP authenticator for
realm 'mesos-agent-readwrite'
I0508 21:02:18.646134 31694 slave.cpp:525] Agent resources: cpus(*):2; mem(*):1024; disk(*):1024;
ports(*):[31000-32000]
I0508 21:02:18.646354 31694 slave.cpp:533] Agent attributes: [  ]
I0508 21:02:18.646368 31694 slave.cpp:538] Agent hostname: 4814ff1db1a7
I0508 21:02:18.646503 31692 status_update_manager.cpp:177] Pausing sending status updates
I0508 21:02:18.648267 31700 state.cpp:62] Recovering state from '/tmp/Endpoint_SlaveEndpointTest_AuthorizedRequest_2_RrD2wm/meta'
I0508 21:02:18.648620 31687 status_update_manager.cpp:203] Recovering status update manager
I0508 21:02:18.648805 31687 containerizer.cpp:608] Recovering containerizer
I0508 21:02:18.650887 31699 provisioner.cpp:410] Provisioner recovery complete
I0508 21:02:18.651551 31699 slave.cpp:5963] Finished recovery
I0508 21:02:18.652128 31699 slave.cpp:6145] Querying resource estimator for oversubscribable
resources
I0508 21:02:18.652711 31699 slave.cpp:6159] Received oversubscribable resources {} from the
resource estimator
I0508 21:02:18.656906 31687 process.cpp:3730] Handling HTTP event for process 'slave(744)'
with path: '/slave(744)/containers'
I0508 21:02:18.658726 31695 http.cpp:1115] HTTP GET for /slave(744)/containers from 172.17.0.3:51962
I0508 21:02:18.658830 31695 http.cpp:936] Authorizing principal 'test-principal' to GET the
'/containers' endpoint
I0508 21:02:18.663393 31698 slave.cpp:790] Agent terminating
[       OK ] Endpoint/SlaveEndpointTest.AuthorizedRequest/2 (36 ms)
[ RUN      ] Endpoint/SlaveEndpointTest.UnauthorizedRequest/0
I0508 21:02:18.673796 31667 containerizer.cpp:221] Using isolation: posix/cpu,posix/mem,filesystem/posix,network/cni
W0508 21:02:18.674295 31667 backend.cpp:76] Failed to create 'aufs' backend: AufsBackend requires
root privileges
W0508 21:02:18.674391 31667 backend.cpp:76] Failed to create 'bind' backend: BindBackend requires
root privileges
I0508 21:02:18.674429 31667 provisioner.cpp:249] Using default backend 'copy'
I0508 21:02:18.677553 31698 slave.cpp:225] Mesos agent started on (745)@172.17.0.3:44700
I0508 21:02:18.677572 31698 slave.cpp:226] Flags at startup: --acls="" --appc_simple_discovery_uri_prefix="http://"
--appc_store_dir="/tmp/mesos/store/appc" --authenticate_http_readonly="true" --authenticate_http_readwrite="true"
--authenticatee="crammd5" --authentication_backoff_factor="1secs" --authorizer="local" --cgroups_cpu_enable_pids_and_tids_count="false"
--cgroups_enable_cfs="false" --cgroups_hierarchy="/sys/fs/cgroup" --cgroups_limit_swap="false"
--cgroups_root="mesos" --container_disk_watch_interval="15secs" --containerizers="mesos" --credential="/tmp/Endpoint_SlaveEndpointTest_UnauthorizedRequest_0_wkovIA/credential"
--default_role="*" --disk_watch_interval="1mins" --docker="docker" --docker_kill_orphans="true"
--docker_registry="https://registry-1.docker.io" --docker_remove_delay="6hrs" --docker_socket="/var/run/docker.sock"
--docker_stop_timeout="0ns" --docker_store_dir="/tmp/mesos/store/docker" --docker_volume_checkpoint_dir="/var/run/mesos/isolators/docker/volume"
--enforce_container_disk_quota="false" --executor_registration_timeout="1mins" --executor_shutdown_grace_period="5secs"
--fetcher_cache_dir="/tmp/Endpoint_SlaveEndpointTest_UnauthorizedRequest_0_wkovIA/fetch" --fetcher_cache_size="2GB"
--frameworks_home="" --gc_delay="1weeks" --gc_disk_headroom="0.1" --hadoop_home="" --help="false"
--hostname_lookup="true" --http_command_executor="false" --http_credentials="/tmp/Endpoint_SlaveEndpointTest_UnauthorizedRequest_0_wkovIA/http_credentials"
--http_heartbeat_interval="30secs" --initialize_driver_logging="true" --isolation="posix/cpu,posix/mem"
--launcher="posix" --launcher_dir="/mesos/mesos-1.4.0/_build/src" --logbufsecs="0" --logging_level="INFO"
--max_completed_executors_per_framework="150" --oversubscribed_resources_interval="15secs"
--perf_duration="10secs" --perf_interval="1mins" --port="5051" --qos_correction_interval_min="0ns"
--quiet="false" --recover="reconnect" --recovery_timeout="15mins" --registration_backoff_factor="10ms"
--resources="cpus:2;gpus:0;mem:1024;disk:1024;ports:[31000-32000]" --revocable_cpu_low_priority="true"
--runtime_dir="/tmp/Endpoint_SlaveEndpointTest_UnauthorizedRequest_0_wkovIA" --sandbox_directory="/mnt/mesos/sandbox"
--strict="true" --switch_user="true" --systemd_enable_support="true" --systemd_runtime_directory="/run/systemd/system"
--version="false" --work_dir="/tmp/Endpoint_SlaveEndpointTest_UnauthorizedRequest_0_xBzyfK"
I0508 21:02:18.678017 31698 credentials.hpp:86] Loading credential for authentication from
'/tmp/Endpoint_SlaveEndpointTest_UnauthorizedRequest_0_wkovIA/credential'
I0508 21:02:18.678256 31698 slave.cpp:258] Agent using credential for: test-principal
I0508 21:02:18.678277 31698 credentials.hpp:37] Loading credentials for authentication from
'/tmp/Endpoint_SlaveEndpointTest_UnauthorizedRequest_0_wkovIA/http_credentials'
I0508 21:02:18.678539 31698 http.cpp:975] Creating default 'basic' HTTP authenticator for
realm 'mesos-agent-readonly'
I0508 21:02:18.678694 31698 http.cpp:975] Creating default 'basic' HTTP authenticator for
realm 'mesos-agent-readwrite'
I0508 21:02:18.681035 31698 slave.cpp:525] Agent resources: cpus(*):2; mem(*):1024; disk(*):1024;
ports(*):[31000-32000]
I0508 21:02:18.681187 31698 slave.cpp:533] Agent attributes: [  ]
I0508 21:02:18.681211 31698 slave.cpp:538] Agent hostname: 4814ff1db1a7
I0508 21:02:18.681375 31693 status_update_manager.cpp:177] Pausing sending status updates
I0508 21:02:18.684649 31698 state.cpp:62] Recovering state from '/tmp/Endpoint_SlaveEndpointTest_UnauthorizedRequest_0_xBzyfK/meta'
I0508 21:02:18.685284 31698 status_update_manager.cpp:203] Recovering status update manager
I0508 21:02:18.685508 31698 containerizer.cpp:608] Recovering containerizer
I0508 21:02:18.687960 31699 provisioner.cpp:410] Provisioner recovery complete
I0508 21:02:18.688652 31699 slave.cpp:5963] Finished recovery
I0508 21:02:18.689293 31699 slave.cpp:6145] Querying resource estimator for oversubscribable
resources
I0508 21:02:18.690116 31699 slave.cpp:6159] Received oversubscribable resources {} from the
resource estimator
I0508 21:02:18.697085 31686 process.cpp:3730] Handling HTTP event for process 'slave(745)'
with path: '/slave(745)/monitor/statistics'
I0508 21:02:18.698323 31688 http.cpp:1115] HTTP GET for /slave(745)/monitor/statistics from
172.17.0.3:51969
I0508 21:02:18.698392 31688 http.cpp:936] Authorizing principal 'test-principal' to GET the
'/monitor/statistics' endpoint
I0508 21:02:18.700845 31694 slave.cpp:790] Agent terminating
[       OK ] Endpoint/SlaveEndpointTest.UnauthorizedRequest/0 (39 ms)
[ RUN      ] Endpoint/SlaveEndpointTest.UnauthorizedRequest/1
I0508 21:02:18.713104 31667 containerizer.cpp:221] Using isolation: posix/cpu,posix/mem,filesystem/posix,network/cni
W0508 21:02:18.713546 31667 backend.cpp:76] Failed to create 'aufs' backend: AufsBackend requires
root privileges
W0508 21:02:18.713645 31667 backend.cpp:76] Failed to create 'bind' backend: BindBackend requires
root privileges
I0508 21:02:18.713677 31667 provisioner.cpp:249] Using default backend 'copy'
I0508 21:02:18.718241 31691 slave.cpp:225] Mesos agent started on (746)@172.17.0.3:44700
I0508 21:02:18.718291 31691 slave.cpp:226] Flags at startup: --acls="" --appc_simple_discovery_uri_prefix="http://"
--appc_store_dir="/tmp/mesos/store/appc" --authenticate_http_readonly="true" --authenticate_http_readwrite="true"
--authenticatee="crammd5" --authentication_backoff_factor="1secs" --authorizer="local" --cgroups_cpu_enable_pids_and_tids_count="false"
--cgroups_enable_cfs="false" --cgroups_hierarchy="/sys/fs/cgroup" --cgroups_limit_swap="false"
--cgroups_root="mesos" --container_disk_watch_interval="15secs" --containerizers="mesos" --credential="/tmp/Endpoint_SlaveEndpointTest_UnauthorizedRequest_1_8yK0VY/credential"
--default_role="*" --disk_watch_interval="1mins" --docker="docker" --docker_kill_orphans="true"
--docker_registry="https://registry-1.docker.io" --docker_remove_delay="6hrs" --docker_socket="/var/run/docker.sock"
--docker_stop_timeout="0ns" --docker_store_dir="/tmp/mesos/store/docker" --docker_volume_checkpoint_dir="/var/run/mesos/isolators/docker/volume"
--enforce_container_disk_quota="false" --executor_registration_timeout="1mins" --executor_shutdown_grace_period="5secs"
--fetcher_cache_dir="/tmp/Endpoint_SlaveEndpointTest_UnauthorizedRequest_1_8yK0VY/fetch" --fetcher_cache_size="2GB"
--frameworks_home="" --gc_delay="1weeks" --gc_disk_headroom="0.1" --hadoop_home="" --help="false"
--hostname_lookup="true" --http_command_executor="false" --http_credentials="/tmp/Endpoint_SlaveEndpointTest_UnauthorizedRequest_1_8yK0VY/http_credentials"
--http_heartbeat_interval="30secs" --initialize_driver_logging="true" --isolation="posix/cpu,posix/mem"
--launcher="posix" --launcher_dir="/mesos/mesos-1.4.0/_build/src" --logbufsecs="0" --logging_level="INFO"
--max_completed_executors_per_framework="150" --oversubscribed_resources_interval="15secs"
--perf_duration="10secs" --perf_interval="1mins" --port="5051" --qos_correction_interval_min="0ns"
--quiet="false" --recover="reconnect" --recovery_timeout="15mins" --registration_backoff_factor="10ms"
--resources="cpus:2;gpus:0;mem:1024;disk:1024;ports:[31000-32000]" --revocable_cpu_low_priority="true"
--runtime_dir="/tmp/Endpoint_SlaveEndpointTest_UnauthorizedRequest_1_8yK0VY" --sandbox_directory="/mnt/mesos/sandbox"
--strict="true" --switch_user="true" --systemd_enable_support="true" --systemd_runtime_directory="/run/systemd/system"
--version="false" --work_dir="/tmp/Endpoint_SlaveEndpointTest_UnauthorizedRequest_1_mq5Em8"
I0508 21:02:18.718945 31691 credentials.hpp:86] Loading credential for authentication from
'/tmp/Endpoint_SlaveEndpointTest_UnauthorizedRequest_1_8yK0VY/credential'
I0508 21:02:18.719202 31691 slave.cpp:258] Agent using credential for: test-principal
I0508 21:02:18.719233 31691 credentials.hpp:37] Loading credentials for authentication from
'/tmp/Endpoint_SlaveEndpointTest_UnauthorizedRequest_1_8yK0VY/http_credentials'
I0508 21:02:18.719564 31691 http.cpp:975] Creating default 'basic' HTTP authenticator for
realm 'mesos-agent-readonly'
I0508 21:02:18.719804 31691 http.cpp:975] Creating default 'basic' HTTP authenticator for
realm 'mesos-agent-readwrite'
I0508 21:02:18.721927 31691 slave.cpp:525] Agent resources: cpus(*):2; mem(*):1024; disk(*):1024;
ports(*):[31000-32000]
I0508 21:02:18.722070 31691 slave.cpp:533] Agent attributes: [  ]
I0508 21:02:18.722095 31691 slave.cpp:538] Agent hostname: 4814ff1db1a7
I0508 21:02:18.724686 31691 status_update_manager.cpp:177] Pausing sending status updates
I0508 21:02:18.725057 31696 state.cpp:62] Recovering state from '/tmp/Endpoint_SlaveEndpointTest_UnauthorizedRequest_1_mq5Em8/meta'
I0508 21:02:18.725481 31692 status_update_manager.cpp:203] Recovering status update manager
I0508 21:02:18.725759 31692 containerizer.cpp:608] Recovering containerizer
I0508 21:02:18.727560 31687 provisioner.cpp:410] Provisioner recovery complete
I0508 21:02:18.727969 31700 slave.cpp:5963] Finished recovery
I0508 21:02:18.728588 31700 slave.cpp:6145] Querying resource estimator for oversubscribable
resources
I0508 21:02:18.728937 31700 slave.cpp:6159] Received oversubscribable resources {} from the
resource estimator
I0508 21:02:18.733350 31689 process.cpp:3730] Handling HTTP event for process 'slave(746)'
with path: '/slave(746)/monitor/statistics.json'
I0508 21:02:18.735258 31697 http.cpp:1115] HTTP GET for /slave(746)/monitor/statistics.json
from 172.17.0.3:51972
I0508 21:02:18.735363 31697 http.cpp:936] Authorizing principal 'test-principal' to GET the
'/monitor/statistics.json' endpoint
I0508 21:02:18.738868 31691 slave.cpp:790] Agent terminating
[       OK ] Endpoint/SlaveEndpointTest.UnauthorizedRequest/1 (35 ms)
[ RUN      ] Endpoint/SlaveEndpointTest.UnauthorizedRequest/2
I0508 21:02:18.749200 31667 containerizer.cpp:221] Using isolation: posix/cpu,posix/mem,filesystem/posix,network/cni
W0508 21:02:18.749779 31667 backend.cpp:76] Failed to create 'aufs' backend: AufsBackend requires
root privileges
W0508 21:02:18.749905 31667 backend.cpp:76] Failed to create 'bind' backend: BindBackend requires
root privileges
I0508 21:02:18.749948 31667 provisioner.cpp:249] Using default backend 'copy'
I0508 21:02:18.753484 31696 slave.cpp:225] Mesos agent started on (747)@172.17.0.3:44700
I0508 21:02:18.753509 31696 slave.cpp:226] Flags at startup: --acls="" --appc_simple_discovery_uri_prefix="http://"
--appc_store_dir="/tmp/mesos/store/appc" --authenticate_http_readonly="true" --authenticate_http_readwrite="true"
--authenticatee="crammd5" --authentication_backoff_factor="1secs" --authorizer="local" --cgroups_cpu_enable_pids_and_tids_count="false"
--cgroups_enable_cfs="false" --cgroups_hierarchy="/sys/fs/cgroup" --cgroups_limit_swap="false"
--cgroups_root="mesos" --container_disk_watch_interval="15secs" --containerizers="mesos" --credential="/tmp/Endpoint_SlaveEndpointTest_UnauthorizedRequest_2_YkKoxn/credential"
--default_role="*" --disk_watch_interval="1mins" --docker="docker" --docker_kill_orphans="true"
--docker_registry="https://registry-1.docker.io" --docker_remove_delay="6hrs" --docker_socket="/var/run/docker.sock"
--docker_stop_timeout="0ns" --docker_store_dir="/tmp/mesos/store/docker" --docker_volume_checkpoint_dir="/var/run/mesos/isolators/docker/volume"
--enforce_container_disk_quota="false" --executor_registration_timeout="1mins" --executor_shutdown_grace_period="5secs"
--fetcher_cache_dir="/tmp/Endpoint_SlaveEndpointTest_UnauthorizedRequest_2_YkKoxn/fetch" --fetcher_cache_size="2GB"
--frameworks_home="" --gc_delay="1weeks" --gc_disk_headroom="0.1" --hadoop_home="" --help="false"
--hostname_lookup="true" --http_command_executor="false" --http_credentials="/tmp/Endpoint_SlaveEndpointTest_UnauthorizedRequest_2_YkKoxn/http_credentials"
--http_heartbeat_interval="30secs" --initialize_driver_logging="true" --isolation="posix/cpu,posix/mem"
--launcher="posix" --launcher_dir="/mesos/mesos-1.4.0/_build/src" --logbufsecs="0" --logging_level="INFO"
--max_completed_executors_per_framework="150" --oversubscribed_resources_interval="15secs"
--perf_duration="10secs" --perf_interval="1mins" --port="5051" --qos_correction_interval_min="0ns"
--quiet="false" --recover="reconnect" --recovery_timeout="15mins" --registration_backoff_factor="10ms"
--resources="cpus:2;gpus:0;mem:1024;disk:1024;ports:[31000-32000]" --revocable_cpu_low_priority="true"
--runtime_dir="/tmp/Endpoint_SlaveEndpointTest_UnauthorizedRequest_2_YkKoxn" --sandbox_directory="/mnt/mesos/sandbox"
--strict="true" --switch_user="true" --systemd_enable_support="true" --systemd_runtime_directory="/run/systemd/system"
--version="false" --work_dir="/tmp/Endpoint_SlaveEndpointTest_UnauthorizedRequest_2_wVhcSw"
I0508 21:02:18.754017 31696 credentials.hpp:86] Loading credential for authentication from
'/tmp/Endpoint_SlaveEndpointTest_UnauthorizedRequest_2_YkKoxn/credential'
I0508 21:02:18.754209 31696 slave.cpp:258] Agent using credential for: test-principal
I0508 21:02:18.754231 31696 credentials.hpp:37] Loading credentials for authentication from
'/tmp/Endpoint_SlaveEndpointTest_UnauthorizedRequest_2_YkKoxn/http_credentials'
I0508 21:02:18.754488 31696 http.cpp:975] Creating default 'basic' HTTP authenticator for
realm 'mesos-agent-readonly'
I0508 21:02:18.754643 31696 http.cpp:975] Creating default 'basic' HTTP authenticator for
realm 'mesos-agent-readwrite'
I0508 21:02:18.755813 31696 slave.cpp:525] Agent resources: cpus(*):2; mem(*):1024; disk(*):1024;
ports(*):[31000-32000]
I0508 21:02:18.755884 31696 slave.cpp:533] Agent attributes: [  ]
I0508 21:02:18.755898 31696 slave.cpp:538] Agent hostname: 4814ff1db1a7
I0508 21:02:18.756034 31691 status_update_manager.cpp:177] Pausing sending status updates
I0508 21:02:18.757709 31696 state.cpp:62] Recovering state from '/tmp/Endpoint_SlaveEndpointTest_UnauthorizedRequest_2_wVhcSw/meta'
I0508 21:02:18.758285 31701 status_update_manager.cpp:203] Recovering status update manager
I0508 21:02:18.758504 31701 containerizer.cpp:608] Recovering containerizer
I0508 21:02:18.760809 31701 provisioner.cpp:410] Provisioner recovery complete
I0508 21:02:18.761432 31701 slave.cpp:5963] Finished recovery
I0508 21:02:18.761996 31701 slave.cpp:6145] Querying resource estimator for oversubscribable
resources
I0508 21:02:18.762465 31693 slave.cpp:6159] Received oversubscribable resources {} from the
resource estimator
I0508 21:02:18.765045 31694 process.cpp:3730] Handling HTTP event for process 'slave(747)'
with path: '/slave(747)/containers'
I0508 21:02:18.766412 31690 http.cpp:1115] HTTP GET for /slave(747)/containers from 172.17.0.3:51975
I0508 21:02:18.766535 31690 http.cpp:936] Authorizing principal 'test-principal' to GET the
'/containers' endpoint
I0508 21:02:18.768803 31689 slave.cpp:790] Agent terminating
[       OK ] Endpoint/SlaveEndpointTest.UnauthorizedRequest/2 (29 ms)
[ RUN      ] Endpoint/SlaveEndpointTest.NoAuthorizer/0
I0508 21:02:18.780436 31667 containerizer.cpp:221] Using isolation: posix/cpu,posix/mem,filesystem/posix,network/cni
W0508 21:02:18.781106 31667 backend.cpp:76] Failed to create 'aufs' backend: AufsBackend requires
root privileges
W0508 21:02:18.781224 31667 backend.cpp:76] Failed to create 'bind' backend: BindBackend requires
root privileges
I0508 21:02:18.781267 31667 provisioner.cpp:249] Using default backend 'copy'
I0508 21:02:18.783109 31667 cluster.cpp:448] Creating default 'local' authorizer
I0508 21:02:18.785226 31688 slave.cpp:225] Mesos agent started on (748)@172.17.0.3:44700
I0508 21:02:18.785249 31688 slave.cpp:226] Flags at startup: --acls="" --appc_simple_discovery_uri_prefix="http://"
--appc_store_dir="/tmp/mesos/store/appc" --authenticate_http_readonly="true" --authenticate_http_readwrite="true"
--authenticatee="crammd5" --authentication_backoff_factor="1secs" --authorizer="local" --cgroups_cpu_enable_pids_and_tids_count="false"
--cgroups_enable_cfs="false" --cgroups_hierarchy="/sys/fs/cgroup" --cgroups_limit_swap="false"
--cgroups_root="mesos" --container_disk_watch_interval="15secs" --containerizers="mesos" --credential="/tmp/Endpoint_SlaveEndpointTest_NoAuthorizer_0_VrBJsM/credential"
--default_role="*" --disk_watch_interval="1mins" --docker="docker" --docker_kill_orphans="true"
--docker_registry="https://registry-1.docker.io" --docker_remove_delay="6hrs" --docker_socket="/var/run/docker.sock"
--docker_stop_timeout="0ns" --docker_store_dir="/tmp/mesos/store/docker" --docker_volume_checkpoint_dir="/var/run/mesos/isolators/docker/volume"
--enforce_container_disk_quota="false" --executor_registration_timeout="1mins" --executor_shutdown_grace_period="5secs"
--fetcher_cache_dir="/tmp/Endpoint_SlaveEndpointTest_NoAuthorizer_0_VrBJsM/fetch" --fetcher_cache_size="2GB"
--frameworks_home="" --gc_delay="1weeks" --gc_disk_headroom="0.1" --hadoop_home="" --help="false"
--hostname_lookup="true" --http_command_executor="false" --http_credentials="/tmp/Endpoint_SlaveEndpointTest_NoAuthorizer_0_VrBJsM/http_credentials"
--http_heartbeat_interval="30secs" --initialize_driver_logging="true" --isolation="posix/cpu,posix/mem"
--launcher="posix" --launcher_dir="/mesos/mesos-1.4.0/_build/src" --logbufsecs="0" --logging_level="INFO"
--max_completed_executors_per_framework="150" --oversubscribed_resources_interval="15secs"
--perf_duration="10secs" --perf_interval="1mins" --port="5051" --qos_correction_interval_min="0ns"
--quiet="false" --recover="reconnect" --recovery_timeout="15mins" --registration_backoff_factor="10ms"
--resources="cpus:2;gpus:0;mem:1024;disk:1024;ports:[31000-32000]" --revocable_cpu_low_priority="true"
--runtime_dir="/tmp/Endpoint_SlaveEndpointTest_NoAuthorizer_0_VrBJsM" --sandbox_directory="/mnt/mesos/sandbox"
--strict="true" --switch_user="true" --systemd_enable_support="true" --systemd_runtime_directory="/run/systemd/system"
--version="false" --work_dir="/tmp/Endpoint_SlaveEndpointTest_NoAuthorizer_0_gMIFIV"
I0508 21:02:18.785748 31688 credentials.hpp:86] Loading credential for authentication from
'/tmp/Endpoint_SlaveEndpointTest_NoAuthorizer_0_VrBJsM/credential'
I0508 21:02:18.785926 31688 slave.cpp:258] Agent using credential for: test-principal
I0508 21:02:18.785953 31688 credentials.hpp:37] Loading credentials for authentication from
'/tmp/Endpoint_SlaveEndpointTest_NoAuthorizer_0_VrBJsM/http_credentials'
I0508 21:02:18.786245 31688 http.cpp:975] Creating default 'basic' HTTP authenticator for
realm 'mesos-agent-readonly'
I0508 21:02:18.786388 31688 http.cpp:975] Creating default 'basic' HTTP authenticator for
realm 'mesos-agent-readwrite'
I0508 21:02:18.787605 31688 slave.cpp:525] Agent resources: cpus(*):2; mem(*):1024; disk(*):1024;
ports(*):[31000-32000]
I0508 21:02:18.787673 31688 slave.cpp:533] Agent attributes: [  ]
I0508 21:02:18.787688 31688 slave.cpp:538] Agent hostname: 4814ff1db1a7
I0508 21:02:18.787888 31701 status_update_manager.cpp:177] Pausing sending status updates
I0508 21:02:18.789067 31696 state.cpp:62] Recovering state from '/tmp/Endpoint_SlaveEndpointTest_NoAuthorizer_0_gMIFIV/meta'
I0508 21:02:18.789527 31692 status_update_manager.cpp:203] Recovering status update manager
I0508 21:02:18.789723 31697 containerizer.cpp:608] Recovering containerizer
I0508 21:02:18.791029 31687 provisioner.cpp:410] Provisioner recovery complete
I0508 21:02:18.791451 31700 slave.cpp:5963] Finished recovery
I0508 21:02:18.791985 31700 slave.cpp:6145] Querying resource estimator for oversubscribable
resources
I0508 21:02:18.792328 31693 slave.cpp:6159] Received oversubscribable resources {} from the
resource estimator
I0508 21:02:18.794680 31687 process.cpp:3730] Handling HTTP event for process 'slave(748)'
with path: '/slave(748)/monitor/statistics'
I0508 21:02:18.795970 31686 http.cpp:1115] HTTP GET for /slave(748)/monitor/statistics from
172.17.0.3:51978
I0508 21:02:18.796074 31686 http.cpp:936] Authorizing principal 'test-principal' to GET the
'/monitor/statistics' endpoint
I0508 21:02:18.799338 31687 slave.cpp:790] Agent terminating
[       OK ] Endpoint/SlaveEndpointTest.NoAuthorizer/0 (29 ms)
[ RUN      ] Endpoint/SlaveEndpointTest.NoAuthorizer/1
I0508 21:02:18.808737 31667 containerizer.cpp:221] Using isolation: posix/cpu,posix/mem,filesystem/posix,network/cni
W0508 21:02:18.809231 31667 backend.cpp:76] Failed to create 'aufs' backend: AufsBackend requires
root privileges
W0508 21:02:18.809329 31667 backend.cpp:76] Failed to create 'bind' backend: BindBackend requires
root privileges
I0508 21:02:18.809372 31667 provisioner.cpp:249] Using default backend 'copy'
I0508 21:02:18.810845 31667 cluster.cpp:448] Creating default 'local' authorizer
I0508 21:02:18.812306 31691 slave.cpp:225] Mesos agent started on (749)@172.17.0.3:44700
I0508 21:02:18.812330 31691 slave.cpp:226] Flags at startup: --acls="" --appc_simple_discovery_uri_prefix="http://"
--appc_store_dir="/tmp/mesos/store/appc" --authenticate_http_readonly="true" --authenticate_http_readwrite="true"
--authenticatee="crammd5" --authentication_backoff_factor="1secs" --authorizer="local" --cgroups_cpu_enable_pids_and_tids_count="false"
--cgroups_enable_cfs="false" --cgroups_hierarchy="/sys/fs/cgroup" --cgroups_limit_swap="false"
--cgroups_root="mesos" --container_disk_watch_interval="15secs" --containerizers="mesos" --credential="/tmp/Endpoint_SlaveEndpointTest_NoAuthorizer_1_kLmaBa/credential"
--default_role="*" --disk_watch_interval="1mins" --docker="docker" --docker_kill_orphans="true"
--docker_registry="https://registry-1.docker.io" --docker_remove_delay="6hrs" --docker_socket="/var/run/docker.sock"
--docker_stop_timeout="0ns" --docker_store_dir="/tmp/mesos/store/docker" --docker_volume_checkpoint_dir="/var/run/mesos/isolators/docker/volume"
--enforce_container_disk_quota="false" --executor_registration_timeout="1mins" --executor_shutdown_grace_period="5secs"
--fetcher_cache_dir="/tmp/Endpoint_SlaveEndpointTest_NoAuthorizer_1_kLmaBa/fetch" --fetcher_cache_size="2GB"
--frameworks_home="" --gc_delay="1weeks" --gc_disk_headroom="0.1" --hadoop_home="" --help="false"
--hostname_lookup="true" --http_command_executor="false" --http_credentials="/tmp/Endpoint_SlaveEndpointTest_NoAuthorizer_1_kLmaBa/http_credentials"
--http_heartbeat_interval="30secs" --initialize_driver_logging="true" --isolation="posix/cpu,posix/mem"
--launcher="posix" --launcher_dir="/mesos/mesos-1.4.0/_build/src" --logbufsecs="0" --logging_level="INFO"
--max_completed_executors_per_framework="150" --oversubscribed_resources_interval="15secs"
--perf_duration="10secs" --perf_interval="1mins" --port="5051" --qos_correction_interval_min="0ns"
--quiet="false" --recover="reconnect" --recovery_timeout="15mins" --registration_backoff_factor="10ms"
--resources="cpus:2;gpus:0;mem:1024;disk:1024;ports:[31000-32000]" --revocable_cpu_low_priority="true"
--runtime_dir="/tmp/Endpoint_SlaveEndpointTest_NoAuthorizer_1_kLmaBa" --sandbox_directory="/mnt/mesos/sandbox"
--strict="true" --switch_user="true" --systemd_enable_support="true" --systemd_runtime_directory="/run/systemd/system"
--version="false" --work_dir="/tmp/Endpoint_SlaveEndpointTest_NoAuthorizer_1_YQ1lMj"
I0508 21:02:18.812839 31691 credentials.hpp:86] Loading credential for authentication from
'/tmp/Endpoint_SlaveEndpointTest_NoAuthorizer_1_kLmaBa/credential'
I0508 21:02:18.812991 31691 slave.cpp:258] Agent using credential for: test-principal
I0508 21:02:18.813021 31691 credentials.hpp:37] Loading credentials for authentication from
'/tmp/Endpoint_SlaveEndpointTest_NoAuthorizer_1_kLmaBa/http_credentials'
I0508 21:02:18.813288 31691 http.cpp:975] Creating default 'basic' HTTP authenticator for
realm 'mesos-agent-readonly'
I0508 21:02:18.813411 31691 http.cpp:975] Creating default 'basic' HTTP authenticator for
realm 'mesos-agent-readwrite'
I0508 21:02:18.814607 31691 slave.cpp:525] Agent resources: cpus(*):2; mem(*):1024; disk(*):1024;
ports(*):[31000-32000]
I0508 21:02:18.814677 31691 slave.cpp:533] Agent attributes: [  ]
I0508 21:02:18.814687 31691 slave.cpp:538] Agent hostname: 4814ff1db1a7
I0508 21:02:18.814810 31689 status_update_manager.cpp:177] Pausing sending status updates
I0508 21:02:18.816035 31697 state.cpp:62] Recovering state from '/tmp/Endpoint_SlaveEndpointTest_NoAuthorizer_1_YQ1lMj/meta'
I0508 21:02:18.816324 31689 status_update_manager.cpp:203] Recovering status update manager
I0508 21:02:18.816539 31692 containerizer.cpp:608] Recovering containerizer
I0508 21:02:18.818053 31696 provisioner.cpp:410] Provisioner recovery complete
I0508 21:02:18.818483 31694 slave.cpp:5963] Finished recovery
I0508 21:02:18.819052 31694 slave.cpp:6145] Querying resource estimator for oversubscribable
resources
I0508 21:02:18.819294 31694 slave.cpp:6159] Received oversubscribable resources {} from the
resource estimator
I0508 21:02:18.821771 31696 process.cpp:3730] Handling HTTP event for process 'slave(749)'
with path: '/slave(749)/monitor/statistics.json'
I0508 21:02:18.823112 31701 http.cpp:1115] HTTP GET for /slave(749)/monitor/statistics.json
from 172.17.0.3:51982
I0508 21:02:18.823231 31701 http.cpp:936] Authorizing principal 'test-principal' to GET the
'/monitor/statistics.json' endpoint
I0508 21:02:18.827046 31695 slave.cpp:790] Agent terminating
[       OK ] Endpoint/SlaveEndpointTest.NoAuthorizer/1 (27 ms)
[ RUN      ] Endpoint/SlaveEndpointTest.NoAuthorizer/2
I0508 21:02:18.837409 31667 containerizer.cpp:221] Using isolation: posix/cpu,posix/mem,filesystem/posix,network/cni
W0508 21:02:18.837852 31667 backend.cpp:76] Failed to create 'aufs' backend: AufsBackend requires
root privileges
W0508 21:02:18.837946 31667 backend.cpp:76] Failed to create 'bind' backend: BindBackend requires
root privileges
I0508 21:02:18.837977 31667 provisioner.cpp:249] Using default backend 'copy'
I0508 21:02:18.839320 31667 cluster.cpp:448] Creating default 'local' authorizer
I0508 21:02:18.841261 31697 slave.cpp:225] Mesos agent started on (750)@172.17.0.3:44700
I0508 21:02:18.841302 31697 slave.cpp:226] Flags at startup: --acls="" --appc_simple_discovery_uri_prefix="http://"
--appc_store_dir="/tmp/mesos/store/appc" --authenticate_http_readonly="true" --authenticate_http_readwrite="true"
--authenticatee="crammd5" --authentication_backoff_factor="1secs" --authorizer="local" --cgroups_cpu_enable_pids_and_tids_count="false"
--cgroups_enable_cfs="false" --cgroups_hierarchy="/sys/fs/cgroup" --cgroups_limit_swap="false"
--cgroups_root="mesos" --container_disk_watch_interval="15secs" --containerizers="mesos" --credential="/tmp/Endpoint_SlaveEndpointTest_NoAuthorizer_2_9zzZ7z/credential"
--default_role="*" --disk_watch_interval="1mins" --docker="docker" --docker_kill_orphans="true"
--docker_registry="https://registry-1.docker.io" --docker_remove_delay="6hrs" --docker_socket="/var/run/docker.sock"
--docker_stop_timeout="0ns" --docker_store_dir="/tmp/mesos/store/docker" --docker_volume_checkpoint_dir="/var/run/mesos/isolators/docker/volume"
--enforce_container_disk_quota="false" --executor_registration_timeout="1mins" --executor_shutdown_grace_period="5secs"
--fetcher_cache_dir="/tmp/Endpoint_SlaveEndpointTest_NoAuthorizer_2_9zzZ7z/fetch" --fetcher_cache_size="2GB"
--frameworks_home="" --gc_delay="1weeks" --gc_disk_headroom="0.1" --hadoop_home="" --help="false"
--hostname_lookup="true" --http_command_executor="false" --http_credentials="/tmp/Endpoint_SlaveEndpointTest_NoAuthorizer_2_9zzZ7z/http_credentials"
--http_heartbeat_interval="30secs" --initialize_driver_logging="true" --isolation="posix/cpu,posix/mem"
--launcher="posix" --launcher_dir="/mesos/mesos-1.4.0/_build/src" --logbufsecs="0" --logging_level="INFO"
--max_completed_executors_per_framework="150" --oversubscribed_resources_interval="15secs"
--perf_duration="10secs" --perf_interval="1mins" --port="5051" --qos_correction_interval_min="0ns"
--quiet="false" --recover="reconnect" --recovery_timeout="15mins" --registration_backoff_factor="10ms"
--resources="cpus:2;gpus:0;mem:1024;disk:1024;ports:[31000-32000]" --revocable_cpu_low_priority="true"
--runtime_dir="/tmp/Endpoint_SlaveEndpointTest_NoAuthorizer_2_9zzZ7z" --sandbox_directory="/mnt/mesos/sandbox"
--strict="true" --switch_user="true" --systemd_enable_support="true" --systemd_runtime_directory="/run/systemd/system"
--version="false" --work_dir="/tmp/Endpoint_SlaveEndpointTest_NoAuthorizer_2_pNVweJ"
I0508 21:02:18.841784 31697 credentials.hpp:86] Loading credential for authentication from
'/tmp/Endpoint_SlaveEndpointTest_NoAuthorizer_2_9zzZ7z/credential'
I0508 21:02:18.841975 31697 slave.cpp:258] Agent using credential for: test-principal
I0508 21:02:18.841997 31697 credentials.hpp:37] Loading credentials for authentication from
'/tmp/Endpoint_SlaveEndpointTest_NoAuthorizer_2_9zzZ7z/http_credentials'
I0508 21:02:18.842291 31697 http.cpp:975] Creating default 'basic' HTTP authenticator for
realm 'mesos-agent-readonly'
I0508 21:02:18.842514 31697 http.cpp:975] Creating default 'basic' HTTP authenticator for
realm 'mesos-agent-readwrite'
I0508 21:02:18.843828 31697 slave.cpp:525] Agent resources: cpus(*):2; mem(*):1024; disk(*):1024;
ports(*):[31000-32000]
I0508 21:02:18.843900 31697 slave.cpp:533] Agent attributes: [  ]
I0508 21:02:18.843914 31697 slave.cpp:538] Agent hostname: 4814ff1db1a7
I0508 21:02:18.844056 31686 status_update_manager.cpp:177] Pausing sending status updates
I0508 21:02:18.845526 31693 state.cpp:62] Recovering state from '/tmp/Endpoint_SlaveEndpointTest_NoAuthorizer_2_pNVweJ/meta'
I0508 21:02:18.845872 31693 status_update_manager.cpp:203] Recovering status update manager
I0508 21:02:18.846277 31701 containerizer.cpp:608] Recovering containerizer
I0508 21:02:18.847846 31699 provisioner.cpp:410] Provisioner recovery complete
I0508 21:02:18.848263 31698 slave.cpp:5963] Finished recovery
I0508 21:02:18.848856 31698 slave.cpp:6145] Querying resource estimator for oversubscribable
resources
I0508 21:02:18.849105 31697 slave.cpp:6159] Received oversubscribable resources {} from the
resource estimator
I0508 21:02:18.856765 31693 process.cpp:3730] Handling HTTP event for process 'slave(750)'
with path: '/slave(750)/containers'
I0508 21:02:18.858206 31698 http.cpp:1115] HTTP GET for /slave(750)/containers from 172.17.0.3:51983
I0508 21:02:18.858288 31698 http.cpp:936] Authorizing principal 'test-principal' to GET the
'/containers' endpoint
I0508 21:02:18.862114 31692 slave.cpp:790] Agent terminating
[       OK ] Endpoint/SlaveEndpointTest.NoAuthorizer/2 (35 ms)
[----------] 9 tests from Endpoint/SlaveEndpointTest (303 ms total)

[----------] Global test environment tear-down
[==========] 1566 tests from 174 test cases ran. (464619 ms total)
[  PASSED  ] 1565 tests.
[  FAILED  ] 1 test, listed below:
[  FAILED  ] RegisterSlaveValidationTest.DropInvalidRegistration

 1 FAILED TEST
  YOU HAVE 19 DISABLED TESTS

E0508 21:02:18.919826 31702 process.cpp:950] Failed to accept socket: future discarded
make[4]: *** [check-local] Error 1
make[4]: Leaving directory `/mesos/mesos-1.4.0/_build/src'
make[3]: *** [check-am] Error 2
make[3]: Leaving directory `/mesos/mesos-1.4.0/_build/src'
make[2]: *** [check] Error 2
make[2]: Leaving directory `/mesos/mesos-1.4.0/_build/src'
make[1]: *** [check-recursive] Error 1
make[1]: Leaving directory `/mesos/mesos-1.4.0/_build'
make: *** [distcheck] Error 1
+ docker rmi mesos-1494274889-30296
Untagged: mesos-1494274889-30296:latest
Deleted: sha256:c366f168a189675a50571d18628ef69e87f48d7b2ffb2900921494a9c8aace3c
Deleted: sha256:0cf587d18e93260e68bdad1459f098cd49b7c4c19a25552fa6172d790d4cd67b
Deleted: sha256:2be16f0023a2c27b959ee877fc480b020a04fb788c3a7bff9c32e481ab930728
Deleted: sha256:65f8671532316d14e8f5c1f584b03dd7a6515ca468555f95dd34c380ecb4b663
Deleted: sha256:e8a572f5b4b30703fd35bf776f2219715dff3b9e4f2d167b77a89140c6c53662
Deleted: sha256:03e5fbfbd42c1b1aaaf22fa7da7721fa12e153158c9d45e01062d76b1306cc74
Deleted: sha256:cb44244b250ed18b21a0cc31a9880cc9e4f2019d2ea4f7712da0b2b9d86331b6
Deleted: sha256:f2f59d677d9b6ec9b724bbf7d9257802c5f98073851ec3a2d137785cd56c1758
Deleted: sha256:d5534077ca738d155e057ea20ea7a031fab3e12139d8e308b85bd16e6c79c9da
Deleted: sha256:4b3a0bb2ef35d7f5cfacff2c99b1d0772a327f9843e64024900f8f8513aeaf9d
Deleted: sha256:bf4213ce60f093421afa017d0edbe065319421034de92c8405d5f2a10eea0c49
Deleted: sha256:cef01be21171c4e7029eb2a7b51946702ff0cc7755720dc4ff81acd04f55de3a
Deleted: sha256:2409e7122195657245d19c96dd7d235d73e1c9e85a9148bb6794ee7a88675a26
Deleted: sha256:7e2f52199050446203adb1f71c9e4be0c62732fb43fc00be4a958123d1e180b5
Deleted: sha256:e9692d8ebd3ab5159b9bfdfe6427ff8db60273c6ff13ebb81da3fa5ddad3a926
Deleted: sha256:240ed5de96219677e37a6b2d9a5a6a2ffa5736aaa036100392e322aa618ca4f2
Deleted: sha256:537a7342609307872a88accbc3d42232badb8dfd39c387b6a893f22fd98e6734
Deleted: sha256:3fcee0cacf2d9a5f8dcb3ba95f184be0df0296c2a59e587b1e1912308eddd2c4
Deleted: sha256:43833600069cf30b252d6935f39de16cbdaa92cfdde25988e2941d123d297880
Deleted: sha256:6e3d7f96077e674588d6dafd7243c949e6e0f037dea1db715d653ac76f00767a
Deleted: sha256:62c2f00d8db731ade3a3bda2e73b9df934bbe3743a7a7a25c9bc96d9317fc891
Deleted: sha256:7acd3ab77c42e0953f0a0cad78f5afa208d7b3432c1b9f04baec49c99960e643
Deleted: sha256:3ea54ada637ec26c805f0e7c0bbda3496b0215ddb4d494face6632819083cf4e
Deleted: sha256:04cf9a02920c3b437f72dff89353600f5e2db150aea7cb3d9635efd93689e8ec
Deleted: sha256:0dae2801a9ef52ea684bbe3068861c26932dd14775ea4c276d28d8123abb337c
Build step 'Execute shell' marked build as failure

Mime
View raw message