mesos-builds mailing list archives

Site index · List index
Message view « Date » · « Thread »
Top « Date » · « Thread »
From Apache Jenkins Server <jenk...@builds.apache.org>
Subject Build failed in Jenkins: Mesos-Buildbot » cmake,gcc,--verbose --enable-libevent --enable-ssl,GLOG_v=1 MESOS_VERBOSE=1,centos:7,(docker||Hadoop)&&(!ubuntu-us1)&&(!ubuntu-eu2) #3618
Date Sat, 06 May 2017 22:16:42 GMT
See <https://builds.apache.org/job/Mesos-Buildbot/BUILDTOOL=cmake,COMPILER=gcc,CONFIGURATION=--verbose%20--enable-libevent%20--enable-ssl,ENVIRONMENT=GLOG_v=1%20MESOS_VERBOSE=1,OS=centos%3A7,label_exp=(docker%7C%7CHadoop)&&(!ubuntu-us1)&&(!ubuntu-eu2)/3618/display/redirect?page=changes>

Changes:

[yujie.jay] Fixed a typo that detects if the platform is linux.

------------------------------------------
[...truncated 24.12 MB...]
I0506 22:16:35.223776 26217 http.cpp:871] Authorizing principal 'test-principal' to GET the
'/monitor/statistics.json' endpoint
I0506 22:16:35.225070 26229 slave.cpp:803] Agent terminating
[       OK ] Endpoint/SlaveEndpointTest.AuthorizedRequest/1 (13 ms)
[ RUN      ] Endpoint/SlaveEndpointTest.AuthorizedRequest/2
I0506 22:16:35.231276 26214 containerizer.cpp:221] Using isolation: posix/cpu,posix/mem,filesystem/posix,network/cni
W0506 22:16:35.231648 26214 backend.cpp:76] Failed to create 'aufs' backend: AufsBackend requires
root privileges
W0506 22:16:35.231696 26214 backend.cpp:76] Failed to create 'bind' backend: BindBackend requires
root privileges
I0506 22:16:35.231719 26214 provisioner.cpp:249] Using default backend 'copy'
I0506 22:16:35.232952 26219 slave.cpp:211] Mesos agent started on (694)@172.17.0.2:42154
I0506 22:16:35.232970 26219 slave.cpp:212] Flags at startup: --acls="" --appc_simple_discovery_uri_prefix="http://"
--appc_store_dir="/tmp/mesos/store/appc" --authenticate_http_readonly="true" --authenticate_http_readwrite="true"
--authenticatee="crammd5" --authentication_backoff_factor="1secs" --authorizer="local" --cgroups_cpu_enable_pids_and_tids_count="false"
--cgroups_enable_cfs="false" --cgroups_hierarchy="/sys/fs/cgroup" --cgroups_limit_swap="false"
--cgroups_root="mesos" --container_disk_watch_interval="15secs" --containerizers="mesos" --credential="/tmp/Endpoint_SlaveEndpointTest_AuthorizedRequest_2_FkDEty/credential"
--default_role="*" --disk_watch_interval="1mins" --docker="docker" --docker_kill_orphans="true"
--docker_registry="https://registry-1.docker.io" --docker_remove_delay="6hrs" --docker_socket="/var/run/docker.sock"
--docker_stop_timeout="0ns" --docker_store_dir="/tmp/mesos/store/docker" --docker_volume_checkpoint_dir="/var/run/mesos/isolators/docker/volume"
--enforce_container_disk_quota="false" --executor_registration_timeout="1mins" --executor_shutdown_grace_period="5secs"
--fetcher_cache_dir="/tmp/Endpoint_SlaveEndpointTest_AuthorizedRequest_2_FkDEty/fetch" --fetcher_cache_size="2GB"
--frameworks_home="" --gc_delay="1weeks" --gc_disk_headroom="0.1" --hadoop_home="" --help="false"
--hostname_lookup="true" --http_authenticators="basic" --http_command_executor="false" --http_credentials="/tmp/Endpoint_SlaveEndpointTest_AuthorizedRequest_2_FkDEty/http_credentials"
--http_heartbeat_interval="30secs" --initialize_driver_logging="true" --isolation="posix/cpu,posix/mem"
--launcher="posix" --launcher_dir="/mesos/build/src" --logbufsecs="0" --logging_level="INFO"
--max_completed_executors_per_framework="150" --oversubscribed_resources_interval="15secs"
--perf_duration="10secs" --perf_interval="1mins" --port="5051" --qos_correction_interval_min="0ns"
--quiet="false" --recover="reconnect" --recovery_timeout="15mins" --registration_backoff_factor="10ms"
--resources="cpus:2;gpus:0;mem:1024;disk:1024;ports:[31000-32000]" --revocable_cpu_low_priority="true"
--runtime_dir="/tmp/Endpoint_SlaveEndpointTest_AuthorizedRequest_2_FkDEty" --sandbox_directory="/mnt/mesos/sandbox"
--strict="true" --switch_user="true" --systemd_enable_support="true" --systemd_runtime_directory="/run/systemd/system"
--version="false" --work_dir="/tmp/Endpoint_SlaveEndpointTest_AuthorizedRequest_2_PUymjS"
I0506 22:16:35.233240 26219 credentials.hpp:86] Loading credential for authentication from
'/tmp/Endpoint_SlaveEndpointTest_AuthorizedRequest_2_FkDEty/credential'
I0506 22:16:35.233330 26219 slave.cpp:354] Agent using credential for: test-principal
I0506 22:16:35.233340 26219 credentials.hpp:37] Loading credentials for authentication from
'/tmp/Endpoint_SlaveEndpointTest_AuthorizedRequest_2_FkDEty/http_credentials'
I0506 22:16:35.233422 26219 http.cpp:919] Using default 'basic' HTTP authenticator for realm
'mesos-agent-readonly'
I0506 22:16:35.233461 26219 http.cpp:919] Using default 'basic' HTTP authenticator for realm
'mesos-agent-readwrite'
I0506 22:16:35.233804 26219 slave.cpp:541] Agent resources: cpus(*):2; mem(*):1024; disk(*):1024;
ports(*):[31000-32000]
I0506 22:16:35.234035 26219 slave.cpp:549] Agent attributes: [  ]
I0506 22:16:35.234072 26219 slave.cpp:554] Agent hostname: 821eb21ba004
I0506 22:16:35.234143 26216 status_update_manager.cpp:177] Pausing sending status updates
I0506 22:16:35.234542 26228 state.cpp:62] Recovering state from '/tmp/Endpoint_SlaveEndpointTest_AuthorizedRequest_2_PUymjS/meta'
I0506 22:16:35.234683 26225 status_update_manager.cpp:203] Recovering status update manager
I0506 22:16:35.234829 26225 containerizer.cpp:600] Recovering containerizer
I0506 22:16:35.235492 26223 provisioner.cpp:410] Provisioner recovery complete
I0506 22:16:35.235692 26215 slave.cpp:5550] Finished recovery
I0506 22:16:35.236021 26215 slave.cpp:5724] Querying resource estimator for oversubscribable
resources
I0506 22:16:35.236147 26229 slave.cpp:5738] Received oversubscribable resources {} from the
resource estimator
I0506 22:16:35.236944 26217 process.cpp:3704] Handling HTTP event for process 'slave(694)'
with path: '/slave(694)/containers'
I0506 22:16:35.237339 26220 http.cpp:871] Authorizing principal 'test-principal' to GET the
'/containers' endpoint
I0506 22:16:35.238775 26226 slave.cpp:803] Agent terminating
[       OK ] Endpoint/SlaveEndpointTest.AuthorizedRequest/2 (13 ms)
[ RUN      ] Endpoint/SlaveEndpointTest.UnauthorizedRequest/0
I0506 22:16:35.244779 26214 containerizer.cpp:221] Using isolation: posix/cpu,posix/mem,filesystem/posix,network/cni
W0506 22:16:35.245177 26214 backend.cpp:76] Failed to create 'aufs' backend: AufsBackend requires
root privileges
W0506 22:16:35.245234 26214 backend.cpp:76] Failed to create 'bind' backend: BindBackend requires
root privileges
I0506 22:16:35.245334 26214 provisioner.cpp:249] Using default backend 'copy'
I0506 22:16:35.246493 26219 slave.cpp:211] Mesos agent started on (695)@172.17.0.2:42154
I0506 22:16:35.246515 26219 slave.cpp:212] Flags at startup: --acls="" --appc_simple_discovery_uri_prefix="http://"
--appc_store_dir="/tmp/mesos/store/appc" --authenticate_http_readonly="true" --authenticate_http_readwrite="true"
--authenticatee="crammd5" --authentication_backoff_factor="1secs" --authorizer="local" --cgroups_cpu_enable_pids_and_tids_count="false"
--cgroups_enable_cfs="false" --cgroups_hierarchy="/sys/fs/cgroup" --cgroups_limit_swap="false"
--cgroups_root="mesos" --container_disk_watch_interval="15secs" --containerizers="mesos" --credential="/tmp/Endpoint_SlaveEndpointTest_UnauthorizedRequest_0_xrIjgh/credential"
--default_role="*" --disk_watch_interval="1mins" --docker="docker" --docker_kill_orphans="true"
--docker_registry="https://registry-1.docker.io" --docker_remove_delay="6hrs" --docker_socket="/var/run/docker.sock"
--docker_stop_timeout="0ns" --docker_store_dir="/tmp/mesos/store/docker" --docker_volume_checkpoint_dir="/var/run/mesos/isolators/docker/volume"
--enforce_container_disk_quota="false" --executor_registration_timeout="1mins" --executor_shutdown_grace_period="5secs"
--fetcher_cache_dir="/tmp/Endpoint_SlaveEndpointTest_UnauthorizedRequest_0_xrIjgh/fetch" --fetcher_cache_size="2GB"
--frameworks_home="" --gc_delay="1weeks" --gc_disk_headroom="0.1" --hadoop_home="" --help="false"
--hostname_lookup="true" --http_authenticators="basic" --http_command_executor="false" --http_credentials="/tmp/Endpoint_SlaveEndpointTest_UnauthorizedRequest_0_xrIjgh/http_credentials"
--http_heartbeat_interval="30secs" --initialize_driver_logging="true" --isolation="posix/cpu,posix/mem"
--launcher="posix" --launcher_dir="/mesos/build/src" --logbufsecs="0" --logging_level="INFO"
--max_completed_executors_per_framework="150" --oversubscribed_resources_interval="15secs"
--perf_duration="10secs" --perf_interval="1mins" --port="5051" --qos_correction_interval_min="0ns"
--quiet="false" --recover="reconnect" --recovery_timeout="15mins" --registration_backoff_factor="10ms"
--resources="cpus:2;gpus:0;mem:1024;disk:1024;ports:[31000-32000]" --revocable_cpu_low_priority="true"
--runtime_dir="/tmp/Endpoint_SlaveEndpointTest_UnauthorizedRequest_0_xrIjgh" --sandbox_directory="/mnt/mesos/sandbox"
--strict="true" --switch_user="true" --systemd_enable_support="true" --systemd_runtime_directory="/run/systemd/system"
--version="false" --work_dir="/tmp/Endpoint_SlaveEndpointTest_UnauthorizedRequest_0_DpLN3A"
I0506 22:16:35.246819 26219 credentials.hpp:86] Loading credential for authentication from
'/tmp/Endpoint_SlaveEndpointTest_UnauthorizedRequest_0_xrIjgh/credential'
I0506 22:16:35.246896 26219 slave.cpp:354] Agent using credential for: test-principal
I0506 22:16:35.246909 26219 credentials.hpp:37] Loading credentials for authentication from
'/tmp/Endpoint_SlaveEndpointTest_UnauthorizedRequest_0_xrIjgh/http_credentials'
I0506 22:16:35.247038 26219 http.cpp:919] Using default 'basic' HTTP authenticator for realm
'mesos-agent-readonly'
I0506 22:16:35.247087 26219 http.cpp:919] Using default 'basic' HTTP authenticator for realm
'mesos-agent-readwrite'
I0506 22:16:35.247406 26219 slave.cpp:541] Agent resources: cpus(*):2; mem(*):1024; disk(*):1024;
ports(*):[31000-32000]
I0506 22:16:35.247437 26219 slave.cpp:549] Agent attributes: [  ]
I0506 22:16:35.247445 26219 slave.cpp:554] Agent hostname: 821eb21ba004
I0506 22:16:35.247509 26224 status_update_manager.cpp:177] Pausing sending status updates
I0506 22:16:35.247792 26219 state.cpp:62] Recovering state from '/tmp/Endpoint_SlaveEndpointTest_UnauthorizedRequest_0_DpLN3A/meta'
I0506 22:16:35.248008 26225 status_update_manager.cpp:203] Recovering status update manager
I0506 22:16:35.248148 26221 containerizer.cpp:600] Recovering containerizer
I0506 22:16:35.248750 26221 provisioner.cpp:410] Provisioner recovery complete
I0506 22:16:35.248898 26219 slave.cpp:5550] Finished recovery
I0506 22:16:35.249378 26219 slave.cpp:5724] Querying resource estimator for oversubscribable
resources
I0506 22:16:35.254134 26216 slave.cpp:5738] Received oversubscribable resources {} from the
resource estimator
I0506 22:16:35.254993 26230 process.cpp:3704] Handling HTTP event for process 'slave(695)'
with path: '/slave(695)/monitor/statistics'
I0506 22:16:35.255453 26216 http.cpp:871] Authorizing principal 'test-principal' to GET the
'/monitor/statistics' endpoint
I0506 22:16:35.256556 26214 slave.cpp:803] Agent terminating
[       OK ] Endpoint/SlaveEndpointTest.UnauthorizedRequest/0 (16 ms)
[ RUN      ] Endpoint/SlaveEndpointTest.UnauthorizedRequest/1
I0506 22:16:35.261076 26214 containerizer.cpp:221] Using isolation: posix/cpu,posix/mem,filesystem/posix,network/cni
W0506 22:16:35.261343 26214 backend.cpp:76] Failed to create 'aufs' backend: AufsBackend requires
root privileges
W0506 22:16:35.261376 26214 backend.cpp:76] Failed to create 'bind' backend: BindBackend requires
root privileges
I0506 22:16:35.261389 26214 provisioner.cpp:249] Using default backend 'copy'
I0506 22:16:35.262320 26230 slave.cpp:211] Mesos agent started on (696)@172.17.0.2:42154
I0506 22:16:35.262361 26230 slave.cpp:212] Flags at startup: --acls="" --appc_simple_discovery_uri_prefix="http://"
--appc_store_dir="/tmp/mesos/store/appc" --authenticate_http_readonly="true" --authenticate_http_readwrite="true"
--authenticatee="crammd5" --authentication_backoff_factor="1secs" --authorizer="local" --cgroups_cpu_enable_pids_and_tids_count="false"
--cgroups_enable_cfs="false" --cgroups_hierarchy="/sys/fs/cgroup" --cgroups_limit_swap="false"
--cgroups_root="mesos" --container_disk_watch_interval="15secs" --containerizers="mesos" --credential="/tmp/Endpoint_SlaveEndpointTest_UnauthorizedRequest_1_zKhfd0/credential"
--default_role="*" --disk_watch_interval="1mins" --docker="docker" --docker_kill_orphans="true"
--docker_registry="https://registry-1.docker.io" --docker_remove_delay="6hrs" --docker_socket="/var/run/docker.sock"
--docker_stop_timeout="0ns" --docker_store_dir="/tmp/mesos/store/docker" --docker_volume_checkpoint_dir="/var/run/mesos/isolators/docker/volume"
--enforce_container_disk_quota="false" --executor_registration_timeout="1mins" --executor_shutdown_grace_period="5secs"
--fetcher_cache_dir="/tmp/Endpoint_SlaveEndpointTest_UnauthorizedRequest_1_zKhfd0/fetch" --fetcher_cache_size="2GB"
--frameworks_home="" --gc_delay="1weeks" --gc_disk_headroom="0.1" --hadoop_home="" --help="false"
--hostname_lookup="true" --http_authenticators="basic" --http_command_executor="false" --http_credentials="/tmp/Endpoint_SlaveEndpointTest_UnauthorizedRequest_1_zKhfd0/http_credentials"
--http_heartbeat_interval="30secs" --initialize_driver_logging="true" --isolation="posix/cpu,posix/mem"
--launcher="posix" --launcher_dir="/mesos/build/src" --logbufsecs="0" --logging_level="INFO"
--max_completed_executors_per_framework="150" --oversubscribed_resources_interval="15secs"
--perf_duration="10secs" --perf_interval="1mins" --port="5051" --qos_correction_interval_min="0ns"
--quiet="false" --recover="reconnect" --recovery_timeout="15mins" --registration_backoff_factor="10ms"
--resources="cpus:2;gpus:0;mem:1024;disk:1024;ports:[31000-32000]" --revocable_cpu_low_priority="true"
--runtime_dir="/tmp/Endpoint_SlaveEndpointTest_UnauthorizedRequest_1_zKhfd0" --sandbox_directory="/mnt/mesos/sandbox"
--strict="true" --switch_user="true" --systemd_enable_support="true" --systemd_runtime_directory="/run/systemd/system"
--version="false" --work_dir="/tmp/Endpoint_SlaveEndpointTest_UnauthorizedRequest_1_JNB1Xj"
I0506 22:16:35.262670 26230 credentials.hpp:86] Loading credential for authentication from
'/tmp/Endpoint_SlaveEndpointTest_UnauthorizedRequest_1_zKhfd0/credential'
I0506 22:16:35.262773 26230 slave.cpp:354] Agent using credential for: test-principal
I0506 22:16:35.262790 26230 credentials.hpp:37] Loading credentials for authentication from
'/tmp/Endpoint_SlaveEndpointTest_UnauthorizedRequest_1_zKhfd0/http_credentials'
I0506 22:16:35.262899 26230 http.cpp:919] Using default 'basic' HTTP authenticator for realm
'mesos-agent-readonly'
I0506 22:16:35.262950 26230 http.cpp:919] Using default 'basic' HTTP authenticator for realm
'mesos-agent-readwrite'
I0506 22:16:35.263362 26230 slave.cpp:541] Agent resources: cpus(*):2; mem(*):1024; disk(*):1024;
ports(*):[31000-32000]
I0506 22:16:35.263396 26230 slave.cpp:549] Agent attributes: [  ]
I0506 22:16:35.263402 26230 slave.cpp:554] Agent hostname: 821eb21ba004
I0506 22:16:35.263479 26221 status_update_manager.cpp:177] Pausing sending status updates
I0506 22:16:35.263870 26216 state.cpp:62] Recovering state from '/tmp/Endpoint_SlaveEndpointTest_UnauthorizedRequest_1_JNB1Xj/meta'
I0506 22:16:35.264051 26216 status_update_manager.cpp:203] Recovering status update manager
I0506 22:16:35.264241 26223 containerizer.cpp:600] Recovering containerizer
I0506 22:16:35.264726 26229 provisioner.cpp:410] Provisioner recovery complete
I0506 22:16:35.264878 26225 slave.cpp:5550] Finished recovery
I0506 22:16:35.265218 26225 slave.cpp:5724] Querying resource estimator for oversubscribable
resources
I0506 22:16:35.265346 26225 slave.cpp:5738] Received oversubscribable resources {} from the
resource estimator
I0506 22:16:35.266186 26218 process.cpp:3704] Handling HTTP event for process 'slave(696)'
with path: '/slave(696)/monitor/statistics.json'
I0506 22:16:35.266806 26224 http.cpp:871] Authorizing principal 'test-principal' to GET the
'/monitor/statistics.json' endpoint
I0506 22:16:35.267768 26227 slave.cpp:803] Agent terminating
[       OK ] Endpoint/SlaveEndpointTest.UnauthorizedRequest/1 (11 ms)
[ RUN      ] Endpoint/SlaveEndpointTest.UnauthorizedRequest/2
I0506 22:16:35.272248 26214 containerizer.cpp:221] Using isolation: posix/cpu,posix/mem,filesystem/posix,network/cni
W0506 22:16:35.272511 26214 backend.cpp:76] Failed to create 'aufs' backend: AufsBackend requires
root privileges
W0506 22:16:35.272554 26214 backend.cpp:76] Failed to create 'bind' backend: BindBackend requires
root privileges
I0506 22:16:35.272574 26214 provisioner.cpp:249] Using default backend 'copy'
I0506 22:16:35.273530 26227 slave.cpp:211] Mesos agent started on (697)@172.17.0.2:42154
I0506 22:16:35.273545 26227 slave.cpp:212] Flags at startup: --acls="" --appc_simple_discovery_uri_prefix="http://"
--appc_store_dir="/tmp/mesos/store/appc" --authenticate_http_readonly="true" --authenticate_http_readwrite="true"
--authenticatee="crammd5" --authentication_backoff_factor="1secs" --authorizer="local" --cgroups_cpu_enable_pids_and_tids_count="false"
--cgroups_enable_cfs="false" --cgroups_hierarchy="/sys/fs/cgroup" --cgroups_limit_swap="false"
--cgroups_root="mesos" --container_disk_watch_interval="15secs" --containerizers="mesos" --credential="/tmp/Endpoint_SlaveEndpointTest_UnauthorizedRequest_2_dfPhiJ/credential"
--default_role="*" --disk_watch_interval="1mins" --docker="docker" --docker_kill_orphans="true"
--docker_registry="https://registry-1.docker.io" --docker_remove_delay="6hrs" --docker_socket="/var/run/docker.sock"
--docker_stop_timeout="0ns" --docker_store_dir="/tmp/mesos/store/docker" --docker_volume_checkpoint_dir="/var/run/mesos/isolators/docker/volume"
--enforce_container_disk_quota="false" --executor_registration_timeout="1mins" --executor_shutdown_grace_period="5secs"
--fetcher_cache_dir="/tmp/Endpoint_SlaveEndpointTest_UnauthorizedRequest_2_dfPhiJ/fetch" --fetcher_cache_size="2GB"
--frameworks_home="" --gc_delay="1weeks" --gc_disk_headroom="0.1" --hadoop_home="" --help="false"
--hostname_lookup="true" --http_authenticators="basic" --http_command_executor="false" --http_credentials="/tmp/Endpoint_SlaveEndpointTest_UnauthorizedRequest_2_dfPhiJ/http_credentials"
--http_heartbeat_interval="30secs" --initialize_driver_logging="true" --isolation="posix/cpu,posix/mem"
--launcher="posix" --launcher_dir="/mesos/build/src" --logbufsecs="0" --logging_level="INFO"
--max_completed_executors_per_framework="150" --oversubscribed_resources_interval="15secs"
--perf_duration="10secs" --perf_interval="1mins" --port="5051" --qos_correction_interval_min="0ns"
--quiet="false" --recover="reconnect" --recovery_timeout="15mins" --registration_backoff_factor="10ms"
--resources="cpus:2;gpus:0;mem:1024;disk:1024;ports:[31000-32000]" --revocable_cpu_low_priority="true"
--runtime_dir="/tmp/Endpoint_SlaveEndpointTest_UnauthorizedRequest_2_dfPhiJ" --sandbox_directory="/mnt/mesos/sandbox"
--strict="true" --switch_user="true" --systemd_enable_support="true" --systemd_runtime_directory="/run/systemd/system"
--version="false" --work_dir="/tmp/Endpoint_SlaveEndpointTest_UnauthorizedRequest_2_j4Ze12"
I0506 22:16:35.274029 26227 credentials.hpp:86] Loading credential for authentication from
'/tmp/Endpoint_SlaveEndpointTest_UnauthorizedRequest_2_dfPhiJ/credential'
I0506 22:16:35.274116 26227 slave.cpp:354] Agent using credential for: test-principal
I0506 22:16:35.274132 26227 credentials.hpp:37] Loading credentials for authentication from
'/tmp/Endpoint_SlaveEndpointTest_UnauthorizedRequest_2_dfPhiJ/http_credentials'
I0506 22:16:35.274227 26227 http.cpp:919] Using default 'basic' HTTP authenticator for realm
'mesos-agent-readonly'
I0506 22:16:35.274299 26227 http.cpp:919] Using default 'basic' HTTP authenticator for realm
'mesos-agent-readwrite'
I0506 22:16:35.274691 26227 slave.cpp:541] Agent resources: cpus(*):2; mem(*):1024; disk(*):1024;
ports(*):[31000-32000]
I0506 22:16:35.274727 26227 slave.cpp:549] Agent attributes: [  ]
I0506 22:16:35.274735 26227 slave.cpp:554] Agent hostname: 821eb21ba004
I0506 22:16:35.274857 26228 status_update_manager.cpp:177] Pausing sending status updates
I0506 22:16:35.275269 26216 state.cpp:62] Recovering state from '/tmp/Endpoint_SlaveEndpointTest_UnauthorizedRequest_2_j4Ze12/meta'
I0506 22:16:35.275423 26216 status_update_manager.cpp:203] Recovering status update manager
I0506 22:16:35.275571 26225 containerizer.cpp:600] Recovering containerizer
I0506 22:16:35.276223 26223 provisioner.cpp:410] Provisioner recovery complete
I0506 22:16:35.276373 26223 slave.cpp:5550] Finished recovery
I0506 22:16:35.276711 26223 slave.cpp:5724] Querying resource estimator for oversubscribable
resources
I0506 22:16:35.276810 26229 slave.cpp:5738] Received oversubscribable resources {} from the
resource estimator
I0506 22:16:35.278517 26224 process.cpp:3704] Handling HTTP event for process 'slave(697)'
with path: '/slave(697)/containers'
I0506 22:16:35.278894 26226 http.cpp:871] Authorizing principal 'test-principal' to GET the
'/containers' endpoint
I0506 22:16:35.279729 26215 slave.cpp:803] Agent terminating
[       OK ] Endpoint/SlaveEndpointTest.UnauthorizedRequest/2 (11 ms)
[ RUN      ] Endpoint/SlaveEndpointTest.NoAuthorizer/0
I0506 22:16:35.284076 26214 containerizer.cpp:221] Using isolation: posix/cpu,posix/mem,filesystem/posix,network/cni
W0506 22:16:35.284344 26214 backend.cpp:76] Failed to create 'aufs' backend: AufsBackend requires
root privileges
W0506 22:16:35.284387 26214 backend.cpp:76] Failed to create 'bind' backend: BindBackend requires
root privileges
I0506 22:16:35.284407 26214 provisioner.cpp:249] Using default backend 'copy'
I0506 22:16:35.285137 26214 cluster.cpp:446] Creating default 'local' authorizer
I0506 22:16:35.285781 26229 slave.cpp:211] Mesos agent started on (698)@172.17.0.2:42154
I0506 22:16:35.285796 26229 slave.cpp:212] Flags at startup: --acls="" --appc_simple_discovery_uri_prefix="http://"
--appc_store_dir="/tmp/mesos/store/appc" --authenticate_http_readonly="true" --authenticate_http_readwrite="true"
--authenticatee="crammd5" --authentication_backoff_factor="1secs" --authorizer="local" --cgroups_cpu_enable_pids_and_tids_count="false"
--cgroups_enable_cfs="false" --cgroups_hierarchy="/sys/fs/cgroup" --cgroups_limit_swap="false"
--cgroups_root="mesos" --container_disk_watch_interval="15secs" --containerizers="mesos" --credential="/tmp/Endpoint_SlaveEndpointTest_NoAuthorizer_0_T69Rus/credential"
--default_role="*" --disk_watch_interval="1mins" --docker="docker" --docker_kill_orphans="true"
--docker_registry="https://registry-1.docker.io" --docker_remove_delay="6hrs" --docker_socket="/var/run/docker.sock"
--docker_stop_timeout="0ns" --docker_store_dir="/tmp/mesos/store/docker" --docker_volume_checkpoint_dir="/var/run/mesos/isolators/docker/volume"
--enforce_container_disk_quota="false" --executor_registration_timeout="1mins" --executor_shutdown_grace_period="5secs"
--fetcher_cache_dir="/tmp/Endpoint_SlaveEndpointTest_NoAuthorizer_0_T69Rus/fetch" --fetcher_cache_size="2GB"
--frameworks_home="" --gc_delay="1weeks" --gc_disk_headroom="0.1" --hadoop_home="" --help="false"
--hostname_lookup="true" --http_authenticators="basic" --http_command_executor="false" --http_credentials="/tmp/Endpoint_SlaveEndpointTest_NoAuthorizer_0_T69Rus/http_credentials"
--http_heartbeat_interval="30secs" --initialize_driver_logging="true" --isolation="posix/cpu,posix/mem"
--launcher="posix" --launcher_dir="/mesos/build/src" --logbufsecs="0" --logging_level="INFO"
--max_completed_executors_per_framework="150" --oversubscribed_resources_interval="15secs"
--perf_duration="10secs" --perf_interval="1mins" --port="5051" --qos_correction_interval_min="0ns"
--quiet="false" --recover="reconnect" --recovery_timeout="15mins" --registration_backoff_factor="10ms"
--resources="cpus:2;gpus:0;mem:1024;disk:1024;ports:[31000-32000]" --revocable_cpu_low_priority="true"
--runtime_dir="/tmp/Endpoint_SlaveEndpointTest_NoAuthorizer_0_T69Rus" --sandbox_directory="/mnt/mesos/sandbox"
--strict="true" --switch_user="true" --systemd_enable_support="true" --systemd_runtime_directory="/run/systemd/system"
--version="false" --work_dir="/tmp/Endpoint_SlaveEndpointTest_NoAuthorizer_0_pecWbM"
I0506 22:16:35.286119 26229 credentials.hpp:86] Loading credential for authentication from
'/tmp/Endpoint_SlaveEndpointTest_NoAuthorizer_0_T69Rus/credential'
I0506 22:16:35.286217 26229 slave.cpp:354] Agent using credential for: test-principal
I0506 22:16:35.286231 26229 credentials.hpp:37] Loading credentials for authentication from
'/tmp/Endpoint_SlaveEndpointTest_NoAuthorizer_0_T69Rus/http_credentials'
I0506 22:16:35.286336 26229 http.cpp:919] Using default 'basic' HTTP authenticator for realm
'mesos-agent-readonly'
I0506 22:16:35.286398 26229 http.cpp:919] Using default 'basic' HTTP authenticator for realm
'mesos-agent-readwrite'
I0506 22:16:35.286793 26229 slave.cpp:541] Agent resources: cpus(*):2; mem(*):1024; disk(*):1024;
ports(*):[31000-32000]
I0506 22:16:35.286828 26229 slave.cpp:549] Agent attributes: [  ]
I0506 22:16:35.286836 26229 slave.cpp:554] Agent hostname: 821eb21ba004
I0506 22:16:35.286983 26227 status_update_manager.cpp:177] Pausing sending status updates
I0506 22:16:35.287297 26219 state.cpp:62] Recovering state from '/tmp/Endpoint_SlaveEndpointTest_NoAuthorizer_0_pecWbM/meta'
I0506 22:16:35.287449 26228 status_update_manager.cpp:203] Recovering status update manager
I0506 22:16:35.287601 26216 containerizer.cpp:600] Recovering containerizer
I0506 22:16:35.288123 26227 provisioner.cpp:410] Provisioner recovery complete
I0506 22:16:35.288311 26223 slave.cpp:5550] Finished recovery
I0506 22:16:35.288667 26223 slave.cpp:5724] Querying resource estimator for oversubscribable
resources
I0506 22:16:35.288887 26222 slave.cpp:5738] Received oversubscribable resources {} from the
resource estimator
I0506 22:16:35.289600 26223 process.cpp:3704] Handling HTTP event for process 'slave(698)'
with path: '/slave(698)/monitor/statistics'
I0506 22:16:35.290037 26223 http.cpp:871] Authorizing principal 'test-principal' to GET the
'/monitor/statistics' endpoint
I0506 22:16:35.291558 26229 slave.cpp:803] Agent terminating
[       OK ] Endpoint/SlaveEndpointTest.NoAuthorizer/0 (12 ms)
[ RUN      ] Endpoint/SlaveEndpointTest.NoAuthorizer/1
I0506 22:16:35.296802 26214 containerizer.cpp:221] Using isolation: posix/cpu,posix/mem,filesystem/posix,network/cni
W0506 22:16:35.297092 26214 backend.cpp:76] Failed to create 'aufs' backend: AufsBackend requires
root privileges
W0506 22:16:35.297130 26214 backend.cpp:76] Failed to create 'bind' backend: BindBackend requires
root privileges
I0506 22:16:35.297145 26214 provisioner.cpp:249] Using default backend 'copy'
I0506 22:16:35.297766 26214 cluster.cpp:446] Creating default 'local' authorizer
I0506 22:16:35.298344 26218 slave.cpp:211] Mesos agent started on (699)@172.17.0.2:42154
I0506 22:16:35.298364 26218 slave.cpp:212] Flags at startup: --acls="" --appc_simple_discovery_uri_prefix="http://"
--appc_store_dir="/tmp/mesos/store/appc" --authenticate_http_readonly="true" --authenticate_http_readwrite="true"
--authenticatee="crammd5" --authentication_backoff_factor="1secs" --authorizer="local" --cgroups_cpu_enable_pids_and_tids_count="false"
--cgroups_enable_cfs="false" --cgroups_hierarchy="/sys/fs/cgroup" --cgroups_limit_swap="false"
--cgroups_root="mesos" --container_disk_watch_interval="15secs" --containerizers="mesos" --credential="/tmp/Endpoint_SlaveEndpointTest_NoAuthorizer_1_kLuoPb/credential"
--default_role="*" --disk_watch_interval="1mins" --docker="docker" --docker_kill_orphans="true"
--docker_registry="https://registry-1.docker.io" --docker_remove_delay="6hrs" --docker_socket="/var/run/docker.sock"
--docker_stop_timeout="0ns" --docker_store_dir="/tmp/mesos/store/docker" --docker_volume_checkpoint_dir="/var/run/mesos/isolators/docker/volume"
--enforce_container_disk_quota="false" --executor_registration_timeout="1mins" --executor_shutdown_grace_period="5secs"
--fetcher_cache_dir="/tmp/Endpoint_SlaveEndpointTest_NoAuthorizer_1_kLuoPb/fetch" --fetcher_cache_size="2GB"
--frameworks_home="" --gc_delay="1weeks" --gc_disk_headroom="0.1" --hadoop_home="" --help="false"
--hostname_lookup="true" --http_authenticators="basic" --http_command_executor="false" --http_credentials="/tmp/Endpoint_SlaveEndpointTest_NoAuthorizer_1_kLuoPb/http_credentials"
--http_heartbeat_interval="30secs" --initialize_driver_logging="true" --isolation="posix/cpu,posix/mem"
--launcher="posix" --launcher_dir="/mesos/build/src" --logbufsecs="0" --logging_level="INFO"
--max_completed_executors_per_framework="150" --oversubscribed_resources_interval="15secs"
--perf_duration="10secs" --perf_interval="1mins" --port="5051" --qos_correction_interval_min="0ns"
--quiet="false" --recover="reconnect" --recovery_timeout="15mins" --registration_backoff_factor="10ms"
--resources="cpus:2;gpus:0;mem:1024;disk:1024;ports:[31000-32000]" --revocable_cpu_low_priority="true"
--runtime_dir="/tmp/Endpoint_SlaveEndpointTest_NoAuthorizer_1_kLuoPb" --sandbox_directory="/mnt/mesos/sandbox"
--strict="true" --switch_user="true" --systemd_enable_support="true" --systemd_runtime_directory="/run/systemd/system"
--version="false" --work_dir="/tmp/Endpoint_SlaveEndpointTest_NoAuthorizer_1_sBLruv"
I0506 22:16:35.298791 26218 credentials.hpp:86] Loading credential for authentication from
'/tmp/Endpoint_SlaveEndpointTest_NoAuthorizer_1_kLuoPb/credential'
I0506 22:16:35.298938 26218 slave.cpp:354] Agent using credential for: test-principal
I0506 22:16:35.298964 26218 credentials.hpp:37] Loading credentials for authentication from
'/tmp/Endpoint_SlaveEndpointTest_NoAuthorizer_1_kLuoPb/http_credentials'
I0506 22:16:35.299126 26218 http.cpp:919] Using default 'basic' HTTP authenticator for realm
'mesos-agent-readonly'
I0506 22:16:35.299204 26218 http.cpp:919] Using default 'basic' HTTP authenticator for realm
'mesos-agent-readwrite'
I0506 22:16:35.299715 26218 slave.cpp:541] Agent resources: cpus(*):2; mem(*):1024; disk(*):1024;
ports(*):[31000-32000]
I0506 22:16:35.299762 26218 slave.cpp:549] Agent attributes: [  ]
I0506 22:16:35.299772 26218 slave.cpp:554] Agent hostname: 821eb21ba004
I0506 22:16:35.299887 26217 status_update_manager.cpp:177] Pausing sending status updates
I0506 22:16:35.300248 26226 state.cpp:62] Recovering state from '/tmp/Endpoint_SlaveEndpointTest_NoAuthorizer_1_sBLruv/meta'
I0506 22:16:35.300469 26218 status_update_manager.cpp:203] Recovering status update manager
I0506 22:16:35.300607 26215 containerizer.cpp:600] Recovering containerizer
I0506 22:16:35.301295 26227 provisioner.cpp:410] Provisioner recovery complete
I0506 22:16:35.301589 26229 slave.cpp:5550] Finished recovery
I0506 22:16:35.302266 26229 slave.cpp:5724] Querying resource estimator for oversubscribable
resources
I0506 22:16:35.302486 26218 slave.cpp:5738] Received oversubscribable resources {} from the
resource estimator
I0506 22:16:35.303350 26226 process.cpp:3704] Handling HTTP event for process 'slave(699)'
with path: '/slave(699)/monitor/statistics.json'
I0506 22:16:35.303839 26217 http.cpp:871] Authorizing principal 'test-principal' to GET the
'/monitor/statistics.json' endpoint
I0506 22:16:35.305552 26221 slave.cpp:803] Agent terminating
[       OK ] Endpoint/SlaveEndpointTest.NoAuthorizer/1 (13 ms)
[ RUN      ] Endpoint/SlaveEndpointTest.NoAuthorizer/2
I0506 22:16:35.309520 26214 containerizer.cpp:221] Using isolation: posix/cpu,posix/mem,filesystem/posix,network/cni
W0506 22:16:35.309764 26214 backend.cpp:76] Failed to create 'aufs' backend: AufsBackend requires
root privileges
W0506 22:16:35.309795 26214 backend.cpp:76] Failed to create 'bind' backend: BindBackend requires
root privileges
I0506 22:16:35.309805 26214 provisioner.cpp:249] Using default backend 'copy'
I0506 22:16:35.310534 26214 cluster.cpp:446] Creating default 'local' authorizer
I0506 22:16:35.311389 26220 slave.cpp:211] Mesos agent started on (700)@172.17.0.2:42154
I0506 22:16:35.311408 26220 slave.cpp:212] Flags at startup: --acls="" --appc_simple_discovery_uri_prefix="http://"
--appc_store_dir="/tmp/mesos/store/appc" --authenticate_http_readonly="true" --authenticate_http_readwrite="true"
--authenticatee="crammd5" --authentication_backoff_factor="1secs" --authorizer="local" --cgroups_cpu_enable_pids_and_tids_count="false"
--cgroups_enable_cfs="false" --cgroups_hierarchy="/sys/fs/cgroup" --cgroups_limit_swap="false"
--cgroups_root="mesos" --container_disk_watch_interval="15secs" --containerizers="mesos" --credential="/tmp/Endpoint_SlaveEndpointTest_NoAuthorizer_2_O1UziV/credential"
--default_role="*" --disk_watch_interval="1mins" --docker="docker" --docker_kill_orphans="true"
--docker_registry="https://registry-1.docker.io" --docker_remove_delay="6hrs" --docker_socket="/var/run/docker.sock"
--docker_stop_timeout="0ns" --docker_store_dir="/tmp/mesos/store/docker" --docker_volume_checkpoint_dir="/var/run/mesos/isolators/docker/volume"
--enforce_container_disk_quota="false" --executor_registration_timeout="1mins" --executor_shutdown_grace_period="5secs"
--fetcher_cache_dir="/tmp/Endpoint_SlaveEndpointTest_NoAuthorizer_2_O1UziV/fetch" --fetcher_cache_size="2GB"
--frameworks_home="" --gc_delay="1weeks" --gc_disk_headroom="0.1" --hadoop_home="" --help="false"
--hostname_lookup="true" --http_authenticators="basic" --http_command_executor="false" --http_credentials="/tmp/Endpoint_SlaveEndpointTest_NoAuthorizer_2_O1UziV/http_credentials"
--http_heartbeat_interval="30secs" --initialize_driver_logging="true" --isolation="posix/cpu,posix/mem"
--launcher="posix" --launcher_dir="/mesos/build/src" --logbufsecs="0" --logging_level="INFO"
--max_completed_executors_per_framework="150" --oversubscribed_resources_interval="15secs"
--perf_duration="10secs" --perf_interval="1mins" --port="5051" --qos_correction_interval_min="0ns"
--quiet="false" --recover="reconnect" --recovery_timeout="15mins" --registration_backoff_factor="10ms"
--resources="cpus:2;gpus:0;mem:1024;disk:1024;ports:[31000-32000]" --revocable_cpu_low_priority="true"
--runtime_dir="/tmp/Endpoint_SlaveEndpointTest_NoAuthorizer_2_O1UziV" --sandbox_directory="/mnt/mesos/sandbox"
--strict="true" --switch_user="true" --systemd_enable_support="true" --systemd_runtime_directory="/run/systemd/system"
--version="false" --work_dir="/tmp/Endpoint_SlaveEndpointTest_NoAuthorizer_2_i0vuVe"
I0506 22:16:35.311728 26220 credentials.hpp:86] Loading credential for authentication from
'/tmp/Endpoint_SlaveEndpointTest_NoAuthorizer_2_O1UziV/credential'
I0506 22:16:35.311832 26220 slave.cpp:354] Agent using credential for: test-principal
I0506 22:16:35.311872 26220 credentials.hpp:37] Loading credentials for authentication from
'/tmp/Endpoint_SlaveEndpointTest_NoAuthorizer_2_O1UziV/http_credentials'
I0506 22:16:35.312010 26220 http.cpp:919] Using default 'basic' HTTP authenticator for realm
'mesos-agent-readonly'
I0506 22:16:35.312054 26220 http.cpp:919] Using default 'basic' HTTP authenticator for realm
'mesos-agent-readwrite'
I0506 22:16:35.312422 26220 slave.cpp:541] Agent resources: cpus(*):2; mem(*):1024; disk(*):1024;
ports(*):[31000-32000]
I0506 22:16:35.312453 26220 slave.cpp:549] Agent attributes: [  ]
I0506 22:16:35.312458 26220 slave.cpp:554] Agent hostname: 821eb21ba004
I0506 22:16:35.312515 26230 status_update_manager.cpp:177] Pausing sending status updates
I0506 22:16:35.312821 26220 state.cpp:62] Recovering state from '/tmp/Endpoint_SlaveEndpointTest_NoAuthorizer_2_i0vuVe/meta'
I0506 22:16:35.312937 26223 status_update_manager.cpp:203] Recovering status update manager
I0506 22:16:35.313153 26226 containerizer.cpp:600] Recovering containerizer
I0506 22:16:35.313719 26230 provisioner.cpp:410] Provisioner recovery complete
I0506 22:16:35.313949 26228 slave.cpp:5550] Finished recovery
I0506 22:16:35.314402 26228 slave.cpp:5724] Querying resource estimator for oversubscribable
resources
I0506 22:16:35.314530 26224 slave.cpp:5738] Received oversubscribable resources {} from the
resource estimator
I0506 22:16:35.315277 26227 process.cpp:3704] Handling HTTP event for process 'slave(700)'
with path: '/slave(700)/containers'
I0506 22:16:35.316009 26228 http.cpp:871] Authorizing principal 'test-principal' to GET the
'/containers' endpoint
I0506 22:16:35.317523 26218 slave.cpp:803] Agent terminating
[       OK ] Endpoint/SlaveEndpointTest.NoAuthorizer/2 (12 ms)
[----------] 9 tests from Endpoint/SlaveEndpointTest (120 ms total)

[----------] Global test environment tear-down
/mesos/src/tests/environment.cpp:836: Failure
Failed
Tests completed with child processes remaining:
-+- 26214 src/mesos-tests 
 \-+- 29700 /mesos/build/src/mesos-containerizer launch 
   \--- 29701 mesos-executor --launcher_dir=/mesos/build/src 
[==========] 1441 tests from 159 test cases ran. (187337 ms total)
[  PASSED  ] 1440 tests.
[  FAILED  ] 1 test, listed below:
[  FAILED  ] MesosContainerizerSlaveRecoveryTest.ResourceStatistics

 1 FAILED TEST
  YOU HAVE 11 DISABLED TESTS

make[3]: *** [CMakeFiles/check] Error 1
I0506 22:16:35.401485 29709 exec.cpp:488] Agent exited, but framework has checkpointing enabled.
Waiting 15mins to reconnect with agent ce039b4f-660d-4375-a7f7-9233626f663e-S0
make[3]: Leaving directory `/mesos/build'
make[2]: *** [CMakeFiles/check.dir/all] Error 2
make[2]: Leaving directory `/mesos/build'
make[1]: *** [CMakeFiles/check.dir/rule] Error 2
make[1]: Leaving directory `/mesos/build'
make: *** [check] Error 2
+ docker rmi mesos-1494106333-25306
Untagged: mesos-1494106333-25306:latest
Deleted: sha256:6f2bbab6545e23b08db8f68428bd3d5b0afd50b199565f77674d95e1581a57ae
Deleted: sha256:b1a1f556ad363ed0cac7517ee624401c1bb8958a7eea52f0051fb93507c3ebf4
Deleted: sha256:97c5c9249aab32d15437781aeb61a3d346d65da035ed8b8acbd24054c139ded1
Deleted: sha256:acbbcc5c24b6f38a43926f82d22ce0e69db95e8073d9e4145176fec2dbcf8e05
Deleted: sha256:f0dca2b44ab18998a08c6cebaa3732063e4d93c38fc04887cdf7ebca7ca10b96
Deleted: sha256:d05dbf3ca89fa075cd7f91e4c670e044c29aad858c44a3b1134ac1cbe7bbf530
Deleted: sha256:d75770162bcb3a7ae69fcec85f3486d2aa3d4d7674365dca331ffcacab105522
Deleted: sha256:ed1de5a0a3799b6a5ec37022b0ba1990024d5c8751508debd10cdfdfe753ca1f
Deleted: sha256:d9b20c7e64579bf0823e3bf6b07ff9dc3ad9fdb4de1271670458109d06aabd23
Deleted: sha256:205322521430b3af9e7dd27c353c4e757589c7c61f34beb0e1a88d15526c6d86
Deleted: sha256:d3181bbb5e84ec93e1bd1cacc3d295b3023ead998f986c3d047b35056b5fd289
Deleted: sha256:e1a6fdcd7544e95dc7b6bee705b850c6fab4ccb74dbd2bcf52591e34c0659728
Deleted: sha256:f30de9814eb7535161f7b8bd6875b377e7f7329b2f96a28299c4aa5779779aa8
Deleted: sha256:bb8f2994a861c89bb67c9e816f8503b051e8d9e006f360f6ca09a4e2410db418
Deleted: sha256:6be7fbc68a39379b8552b979e4182049a429b60b1197643845007796b9cc3143
Deleted: sha256:4b1f4c09f05d092344ddd91ad932a81807afdf3f5c5ef8a7f28b79e79be5effb
Deleted: sha256:718287b8a33107d5b840c5ba6eab0a4270a32d283d3a6e3dcc6d44799c61e1f4
Deleted: sha256:2e9c48221b170f4a70a39ee5e669ae1170071b0e5ec1506eb171537e7b5c2513
Deleted: sha256:d8f228e96b9121855d641615cdbf2cb95fcfc9e9ae1f9e41fa1f69b16975aab3
Deleted: sha256:70616fb72eaf1832fd5d4bbcb55c4eaa9c800187b17fb137e9782cea63cec152
Deleted: sha256:1f05b1857289d501904fddf70a5fa863126eca37ba95cc898e9e4325932a51b1
Deleted: sha256:488892bee6dda60c00cc664818875f3ea476832a676be5aa9bbb701cc8a24599
Deleted: sha256:9bec1fd89f19fa3bffbc874d0c81329459fa7088e177854363dd1ae7479e1ba2
Deleted: sha256:c51f044c01eda55e8a063590d60e199ab3e35a4171a29942e5d3044f5e789b77
Deleted: sha256:eb60684fd034e11e073552584fad5cc228413605d801299513f4792cd12641c4
Build step 'Execute shell' marked build as failure
Not sending mail to unregistered user yujie.jay@gmail.com

Mime
View raw message