mesos-builds mailing list archives

Site index · List index
Message view « Date » · « Thread »
Top « Date » · « Thread »
From Apache Jenkins Server <jenk...@builds.apache.org>
Subject Build failed in Jenkins: Mesos-Buildbot » autotools,gcc,--verbose --enable-libevent --enable-ssl,GLOG_v=1 MESOS_VERBOSE=1,centos:7,(docker||Hadoop)&&(!ubuntu-us1)&&(!ubuntu-eu2) #3732
Date Fri, 26 May 2017 22:59:45 GMT
See <https://builds.apache.org/job/Mesos-Buildbot/BUILDTOOL=autotools,COMPILER=gcc,CONFIGURATION=--verbose%20--enable-libevent%20--enable-ssl,ENVIRONMENT=GLOG_v=1%20MESOS_VERBOSE=1,OS=centos%3A7,label_exp=(docker%7C%7CHadoop)&&(!ubuntu-us1)&&(!ubuntu-eu2)/3732/display/redirect?page=changes>

Changes:

[neil.conway] Fixed flakiness in MasterTest.EndpointsForHalfRemovedSlave.

------------------------------------------
[...truncated 28.57 MB...]
I0526 22:59:39.653759 25607 http.cpp:936] Authorizing principal 'test-principal' to GET the
'/containers' endpoint
I0526 22:59:39.657562 25610 slave.cpp:801] Agent terminating
[       OK ] Endpoint/SlaveEndpointTest.AuthorizedRequest/2 (34 ms)
[ RUN      ] Endpoint/SlaveEndpointTest.UnauthorizedRequest/0
I0526 22:59:39.669189  7901 containerizer.cpp:230] Using isolation: posix/cpu,posix/mem,filesystem/posix,network/cni,environment_secret
W0526 22:59:39.669679  7901 backend.cpp:76] Failed to create 'aufs' backend: AufsBackend requires
root privileges
W0526 22:59:39.669828  7901 backend.cpp:76] Failed to create 'bind' backend: BindBackend requires
root privileges
I0526 22:59:39.669865  7901 provisioner.cpp:255] Using default backend 'copy'
I0526 22:59:39.674221 25615 slave.cpp:232] Mesos agent started on (751)@172.17.0.2:52405
I0526 22:59:39.674248 25615 slave.cpp:233] Flags at startup: --acls="" --appc_simple_discovery_uri_prefix="http://"
--appc_store_dir="/tmp/mesos/store/appc" --authenticate_http_executors="true" --authenticate_http_readonly="true"
--authenticate_http_readwrite="true" --authenticatee="crammd5" --authentication_backoff_factor="1secs"
--authorizer="local" --cgroups_cpu_enable_pids_and_tids_count="false" --cgroups_enable_cfs="false"
--cgroups_hierarchy="/sys/fs/cgroup" --cgroups_limit_swap="false" --cgroups_root="mesos" --container_disk_watch_interval="15secs"
--containerizers="mesos" --credential="/tmp/Endpoint_SlaveEndpointTest_UnauthorizedRequest_0_DtZ5wt/credential"
--default_role="*" --disk_watch_interval="1mins" --docker="docker" --docker_kill_orphans="true"
--docker_registry="https://registry-1.docker.io" --docker_remove_delay="6hrs" --docker_socket="/var/run/docker.sock"
--docker_stop_timeout="0ns" --docker_store_dir="/tmp/mesos/store/docker" --docker_volume_checkpoint_dir="/var/run/mesos/isolators/docker/volume"
--enforce_container_disk_quota="false" --executor_registration_timeout="1mins" --executor_reregistration_timeout="2secs"
--executor_secret_key="/tmp/Endpoint_SlaveEndpointTest_UnauthorizedRequest_0_DtZ5wt/executor_secret_key"
--executor_shutdown_grace_period="5secs" --fetcher_cache_dir="/tmp/Endpoint_SlaveEndpointTest_UnauthorizedRequest_0_DtZ5wt/fetch"
--fetcher_cache_size="2GB" --frameworks_home="" --gc_delay="1weeks" --gc_disk_headroom="0.1"
--hadoop_home="" --help="false" --hostname_lookup="true" --http_command_executor="false" --http_credentials="/tmp/Endpoint_SlaveEndpointTest_UnauthorizedRequest_0_DtZ5wt/http_credentials"
--http_heartbeat_interval="30secs" --initialize_driver_logging="true" --isolation="posix/cpu,posix/mem"
--launcher="posix" --launcher_dir="/mesos/mesos-1.4.0/_build/src" --logbufsecs="0" --logging_level="INFO"
--max_completed_executors_per_framework="150" --oversubscribed_resources_interval="15secs"
--perf_duration="10secs" --perf_interval="1mins" --port="5051" --qos_correction_interval_min="0ns"
--quiet="false" --recover="reconnect" --recovery_timeout="15mins" --registration_backoff_factor="10ms"
--resources="cpus:2;gpus:0;mem:1024;disk:1024;ports:[31000-32000]" --revocable_cpu_low_priority="true"
--runtime_dir="/tmp/Endpoint_SlaveEndpointTest_UnauthorizedRequest_0_DtZ5wt" --sandbox_directory="/mnt/mesos/sandbox"
--strict="true" --switch_user="true" --systemd_enable_support="true" --systemd_runtime_directory="/run/systemd/system"
--version="false" --work_dir="/tmp/Endpoint_SlaveEndpointTest_UnauthorizedRequest_0_lw29Cu"
I0526 22:59:39.674777 25615 credentials.hpp:86] Loading credential for authentication from
'/tmp/Endpoint_SlaveEndpointTest_UnauthorizedRequest_0_DtZ5wt/credential'
I0526 22:59:39.674939 25615 slave.cpp:265] Agent using credential for: test-principal
I0526 22:59:39.674960 25615 credentials.hpp:37] Loading credentials for authentication from
'/tmp/Endpoint_SlaveEndpointTest_UnauthorizedRequest_0_DtZ5wt/http_credentials'
I0526 22:59:39.675222 25615 http.cpp:975] Creating default 'basic' HTTP authenticator for
realm 'mesos-agent-executor'
I0526 22:59:39.675376 25615 http.cpp:996] Creating default 'jwt' HTTP authenticator for realm
'mesos-agent-executor'
I0526 22:59:39.675592 25615 http.cpp:975] Creating default 'basic' HTTP authenticator for
realm 'mesos-agent-readonly'
I0526 22:59:39.675695 25615 http.cpp:996] Creating default 'jwt' HTTP authenticator for realm
'mesos-agent-readonly'
I0526 22:59:39.675886 25615 http.cpp:975] Creating default 'basic' HTTP authenticator for
realm 'mesos-agent-readwrite'
I0526 22:59:39.675979 25615 http.cpp:996] Creating default 'jwt' HTTP authenticator for realm
'mesos-agent-readwrite'
I0526 22:59:39.677284 25615 slave.cpp:536] Agent resources: cpus(*):2; mem(*):1024; disk(*):1024;
ports(*):[31000-32000]
I0526 22:59:39.677353 25615 slave.cpp:544] Agent attributes: [  ]
I0526 22:59:39.677366 25615 slave.cpp:549] Agent hostname: ee75eac24e06
I0526 22:59:39.677503 25608 status_update_manager.cpp:177] Pausing sending status updates
I0526 22:59:39.679715 25610 state.cpp:62] Recovering state from '/tmp/Endpoint_SlaveEndpointTest_UnauthorizedRequest_0_lw29Cu/meta'
I0526 22:59:39.680197 25602 status_update_manager.cpp:203] Recovering status update manager
I0526 22:59:39.680444 25607 containerizer.cpp:582] Recovering containerizer
I0526 22:59:39.681833 25610 provisioner.cpp:416] Provisioner recovery complete
I0526 22:59:39.682206 25608 slave.cpp:6073] Finished recovery
I0526 22:59:39.682761 25608 slave.cpp:6255] Querying resource estimator for oversubscribable
resources
I0526 22:59:39.683017 25610 slave.cpp:6269] Received oversubscribable resources {} from the
resource estimator
I0526 22:59:39.686368 25612 process.cpp:3730] Handling HTTP event for process 'slave(751)'
with path: '/slave(751)/monitor/statistics'
I0526 22:59:39.688138 25613 http.cpp:1115] HTTP GET for /slave(751)/monitor/statistics from
172.17.0.2:41815
I0526 22:59:39.688385 25613 http.cpp:936] Authorizing principal 'test-principal' to GET the
'/monitor/statistics' endpoint
I0526 22:59:39.691373 25615 slave.cpp:801] Agent terminating
[       OK ] Endpoint/SlaveEndpointTest.UnauthorizedRequest/0 (32 ms)
[ RUN      ] Endpoint/SlaveEndpointTest.UnauthorizedRequest/1
I0526 22:59:39.701851  7901 containerizer.cpp:230] Using isolation: posix/cpu,posix/mem,filesystem/posix,network/cni,environment_secret
W0526 22:59:39.702353  7901 backend.cpp:76] Failed to create 'aufs' backend: AufsBackend requires
root privileges
W0526 22:59:39.702461  7901 backend.cpp:76] Failed to create 'bind' backend: BindBackend requires
root privileges
I0526 22:59:39.702502  7901 provisioner.cpp:255] Using default backend 'copy'
I0526 22:59:39.705739 25608 slave.cpp:232] Mesos agent started on (752)@172.17.0.2:52405
I0526 22:59:39.705778 25608 slave.cpp:233] Flags at startup: --acls="" --appc_simple_discovery_uri_prefix="http://"
--appc_store_dir="/tmp/mesos/store/appc" --authenticate_http_executors="true" --authenticate_http_readonly="true"
--authenticate_http_readwrite="true" --authenticatee="crammd5" --authentication_backoff_factor="1secs"
--authorizer="local" --cgroups_cpu_enable_pids_and_tids_count="false" --cgroups_enable_cfs="false"
--cgroups_hierarchy="/sys/fs/cgroup" --cgroups_limit_swap="false" --cgroups_root="mesos" --container_disk_watch_interval="15secs"
--containerizers="mesos" --credential="/tmp/Endpoint_SlaveEndpointTest_UnauthorizedRequest_1_ioV6qp/credential"
--default_role="*" --disk_watch_interval="1mins" --docker="docker" --docker_kill_orphans="true"
--docker_registry="https://registry-1.docker.io" --docker_remove_delay="6hrs" --docker_socket="/var/run/docker.sock"
--docker_stop_timeout="0ns" --docker_store_dir="/tmp/mesos/store/docker" --docker_volume_checkpoint_dir="/var/run/mesos/isolators/docker/volume"
--enforce_container_disk_quota="false" --executor_registration_timeout="1mins" --executor_reregistration_timeout="2secs"
--executor_secret_key="/tmp/Endpoint_SlaveEndpointTest_UnauthorizedRequest_1_ioV6qp/executor_secret_key"
--executor_shutdown_grace_period="5secs" --fetcher_cache_dir="/tmp/Endpoint_SlaveEndpointTest_UnauthorizedRequest_1_ioV6qp/fetch"
--fetcher_cache_size="2GB" --frameworks_home="" --gc_delay="1weeks" --gc_disk_headroom="0.1"
--hadoop_home="" --help="false" --hostname_lookup="true" --http_command_executor="false" --http_credentials="/tmp/Endpoint_SlaveEndpointTest_UnauthorizedRequest_1_ioV6qp/http_credentials"
--http_heartbeat_interval="30secs" --initialize_driver_logging="true" --isolation="posix/cpu,posix/mem"
--launcher="posix" --launcher_dir="/mesos/mesos-1.4.0/_build/src" --logbufsecs="0" --logging_level="INFO"
--max_completed_executors_per_framework="150" --oversubscribed_resources_interval="15secs"
--perf_duration="10secs" --perf_interval="1mins" --port="5051" --qos_correction_interval_min="0ns"
--quiet="false" --recover="reconnect" --recovery_timeout="15mins" --registration_backoff_factor="10ms"
--resources="cpus:2;gpus:0;mem:1024;disk:1024;ports:[31000-32000]" --revocable_cpu_low_priority="true"
--runtime_dir="/tmp/Endpoint_SlaveEndpointTest_UnauthorizedRequest_1_ioV6qp" --sandbox_directory="/mnt/mesos/sandbox"
--strict="true" --switch_user="true" --systemd_enable_support="true" --systemd_runtime_directory="/run/systemd/system"
--version="false" --work_dir="/tmp/Endpoint_SlaveEndpointTest_UnauthorizedRequest_1_kA8Prq"
I0526 22:59:39.706377 25608 credentials.hpp:86] Loading credential for authentication from
'/tmp/Endpoint_SlaveEndpointTest_UnauthorizedRequest_1_ioV6qp/credential'
I0526 22:59:39.706600 25608 slave.cpp:265] Agent using credential for: test-principal
I0526 22:59:39.706624 25608 credentials.hpp:37] Loading credentials for authentication from
'/tmp/Endpoint_SlaveEndpointTest_UnauthorizedRequest_1_ioV6qp/http_credentials'
I0526 22:59:39.706920 25608 http.cpp:975] Creating default 'basic' HTTP authenticator for
realm 'mesos-agent-executor'
I0526 22:59:39.707062 25608 http.cpp:996] Creating default 'jwt' HTTP authenticator for realm
'mesos-agent-executor'
I0526 22:59:39.707290 25608 http.cpp:975] Creating default 'basic' HTTP authenticator for
realm 'mesos-agent-readonly'
I0526 22:59:39.707399 25608 http.cpp:996] Creating default 'jwt' HTTP authenticator for realm
'mesos-agent-readonly'
I0526 22:59:39.707617 25608 http.cpp:975] Creating default 'basic' HTTP authenticator for
realm 'mesos-agent-readwrite'
I0526 22:59:39.707762 25608 http.cpp:996] Creating default 'jwt' HTTP authenticator for realm
'mesos-agent-readwrite'
I0526 22:59:39.709153 25608 slave.cpp:536] Agent resources: cpus(*):2; mem(*):1024; disk(*):1024;
ports(*):[31000-32000]
I0526 22:59:39.709226 25608 slave.cpp:544] Agent attributes: [  ]
I0526 22:59:39.709242 25608 slave.cpp:549] Agent hostname: ee75eac24e06
I0526 22:59:39.709424 25611 status_update_manager.cpp:177] Pausing sending status updates
I0526 22:59:39.711570 25608 state.cpp:62] Recovering state from '/tmp/Endpoint_SlaveEndpointTest_UnauthorizedRequest_1_kA8Prq/meta'
I0526 22:59:39.711982 25601 status_update_manager.cpp:203] Recovering status update manager
I0526 22:59:39.712229 25613 containerizer.cpp:582] Recovering containerizer
I0526 22:59:39.714190 25601 provisioner.cpp:416] Provisioner recovery complete
I0526 22:59:39.714638 25616 slave.cpp:6073] Finished recovery
I0526 22:59:39.715306 25616 slave.cpp:6255] Querying resource estimator for oversubscribable
resources
I0526 22:59:39.715725 25616 slave.cpp:6269] Received oversubscribable resources {} from the
resource estimator
I0526 22:59:39.718621 25603 process.cpp:3730] Handling HTTP event for process 'slave(752)'
with path: '/slave(752)/monitor/statistics.json'
I0526 22:59:39.720829 25607 http.cpp:1115] HTTP GET for /slave(752)/monitor/statistics.json
from 172.17.0.2:41816
I0526 22:59:39.720901 25607 http.cpp:936] Authorizing principal 'test-principal' to GET the
'/monitor/statistics.json' endpoint
I0526 22:59:39.724992 25601 slave.cpp:801] Agent terminating
[       OK ] Endpoint/SlaveEndpointTest.UnauthorizedRequest/1 (37 ms)
[ RUN      ] Endpoint/SlaveEndpointTest.UnauthorizedRequest/2
I0526 22:59:39.739588  7901 containerizer.cpp:230] Using isolation: posix/cpu,posix/mem,filesystem/posix,network/cni,environment_secret
W0526 22:59:39.740052  7901 backend.cpp:76] Failed to create 'aufs' backend: AufsBackend requires
root privileges
W0526 22:59:39.740160  7901 backend.cpp:76] Failed to create 'bind' backend: BindBackend requires
root privileges
I0526 22:59:39.740202  7901 provisioner.cpp:255] Using default backend 'copy'
I0526 22:59:39.745131 25610 slave.cpp:232] Mesos agent started on (753)@172.17.0.2:52405
I0526 22:59:39.745179 25610 slave.cpp:233] Flags at startup: --acls="" --appc_simple_discovery_uri_prefix="http://"
--appc_store_dir="/tmp/mesos/store/appc" --authenticate_http_executors="true" --authenticate_http_readonly="true"
--authenticate_http_readwrite="true" --authenticatee="crammd5" --authentication_backoff_factor="1secs"
--authorizer="local" --cgroups_cpu_enable_pids_and_tids_count="false" --cgroups_enable_cfs="false"
--cgroups_hierarchy="/sys/fs/cgroup" --cgroups_limit_swap="false" --cgroups_root="mesos" --container_disk_watch_interval="15secs"
--containerizers="mesos" --credential="/tmp/Endpoint_SlaveEndpointTest_UnauthorizedRequest_2_i4FOIl/credential"
--default_role="*" --disk_watch_interval="1mins" --docker="docker" --docker_kill_orphans="true"
--docker_registry="https://registry-1.docker.io" --docker_remove_delay="6hrs" --docker_socket="/var/run/docker.sock"
--docker_stop_timeout="0ns" --docker_store_dir="/tmp/mesos/store/docker" --docker_volume_checkpoint_dir="/var/run/mesos/isolators/docker/volume"
--enforce_container_disk_quota="false" --executor_registration_timeout="1mins" --executor_reregistration_timeout="2secs"
--executor_secret_key="/tmp/Endpoint_SlaveEndpointTest_UnauthorizedRequest_2_i4FOIl/executor_secret_key"
--executor_shutdown_grace_period="5secs" --fetcher_cache_dir="/tmp/Endpoint_SlaveEndpointTest_UnauthorizedRequest_2_i4FOIl/fetch"
--fetcher_cache_size="2GB" --frameworks_home="" --gc_delay="1weeks" --gc_disk_headroom="0.1"
--hadoop_home="" --help="false" --hostname_lookup="true" --http_command_executor="false" --http_credentials="/tmp/Endpoint_SlaveEndpointTest_UnauthorizedRequest_2_i4FOIl/http_credentials"
--http_heartbeat_interval="30secs" --initialize_driver_logging="true" --isolation="posix/cpu,posix/mem"
--launcher="posix" --launcher_dir="/mesos/mesos-1.4.0/_build/src" --logbufsecs="0" --logging_level="INFO"
--max_completed_executors_per_framework="150" --oversubscribed_resources_interval="15secs"
--perf_duration="10secs" --perf_interval="1mins" --port="5051" --qos_correction_interval_min="0ns"
--quiet="false" --recover="reconnect" --recovery_timeout="15mins" --registration_backoff_factor="10ms"
--resources="cpus:2;gpus:0;mem:1024;disk:1024;ports:[31000-32000]" --revocable_cpu_low_priority="true"
--runtime_dir="/tmp/Endpoint_SlaveEndpointTest_UnauthorizedRequest_2_i4FOIl" --sandbox_directory="/mnt/mesos/sandbox"
--strict="true" --switch_user="true" --systemd_enable_support="true" --systemd_runtime_directory="/run/systemd/system"
--version="false" --work_dir="/tmp/Endpoint_SlaveEndpointTest_UnauthorizedRequest_2_CUmpDm"
I0526 22:59:39.746472 25610 credentials.hpp:86] Loading credential for authentication from
'/tmp/Endpoint_SlaveEndpointTest_UnauthorizedRequest_2_i4FOIl/credential'
I0526 22:59:39.746879 25610 slave.cpp:265] Agent using credential for: test-principal
I0526 22:59:39.746911 25610 credentials.hpp:37] Loading credentials for authentication from
'/tmp/Endpoint_SlaveEndpointTest_UnauthorizedRequest_2_i4FOIl/http_credentials'
I0526 22:59:39.747400 25610 http.cpp:975] Creating default 'basic' HTTP authenticator for
realm 'mesos-agent-executor'
I0526 22:59:39.747673 25610 http.cpp:996] Creating default 'jwt' HTTP authenticator for realm
'mesos-agent-executor'
I0526 22:59:39.748046 25610 http.cpp:975] Creating default 'basic' HTTP authenticator for
realm 'mesos-agent-readonly'
I0526 22:59:39.748148 25610 http.cpp:996] Creating default 'jwt' HTTP authenticator for realm
'mesos-agent-readonly'
I0526 22:59:39.748572 25610 http.cpp:975] Creating default 'basic' HTTP authenticator for
realm 'mesos-agent-readwrite'
I0526 22:59:39.748687 25610 http.cpp:996] Creating default 'jwt' HTTP authenticator for realm
'mesos-agent-readwrite'
I0526 22:59:39.750982 25610 slave.cpp:536] Agent resources: cpus(*):2; mem(*):1024; disk(*):1024;
ports(*):[31000-32000]
I0526 22:59:39.751235 25610 slave.cpp:544] Agent attributes: [  ]
I0526 22:59:39.751366 25610 slave.cpp:549] Agent hostname: ee75eac24e06
I0526 22:59:39.751641 25614 status_update_manager.cpp:177] Pausing sending status updates
I0526 22:59:39.754241 25616 state.cpp:62] Recovering state from '/tmp/Endpoint_SlaveEndpointTest_UnauthorizedRequest_2_CUmpDm/meta'
I0526 22:59:39.756889 25607 status_update_manager.cpp:203] Recovering status update manager
I0526 22:59:39.757359 25604 containerizer.cpp:582] Recovering containerizer
I0526 22:59:39.759485 25614 provisioner.cpp:416] Provisioner recovery complete
I0526 22:59:39.760160 25614 slave.cpp:6073] Finished recovery
I0526 22:59:39.760778 25614 slave.cpp:6255] Querying resource estimator for oversubscribable
resources
I0526 22:59:39.761579 25614 slave.cpp:6269] Received oversubscribable resources {} from the
resource estimator
I0526 22:59:39.764683 25607 process.cpp:3730] Handling HTTP event for process 'slave(753)'
with path: '/slave(753)/containers'
I0526 22:59:39.767251 25607 http.cpp:1115] HTTP GET for /slave(753)/containers from 172.17.0.2:41819
I0526 22:59:39.767335 25607 http.cpp:936] Authorizing principal 'test-principal' to GET the
'/containers' endpoint
I0526 22:59:39.770612 25614 slave.cpp:801] Agent terminating
[       OK ] Endpoint/SlaveEndpointTest.UnauthorizedRequest/2 (41 ms)
[ RUN      ] Endpoint/SlaveEndpointTest.NoAuthorizer/0
I0526 22:59:39.781654  7901 containerizer.cpp:230] Using isolation: posix/cpu,posix/mem,filesystem/posix,network/cni,environment_secret
W0526 22:59:39.782124  7901 backend.cpp:76] Failed to create 'aufs' backend: AufsBackend requires
root privileges
W0526 22:59:39.782243  7901 backend.cpp:76] Failed to create 'bind' backend: BindBackend requires
root privileges
I0526 22:59:39.782282  7901 provisioner.cpp:255] Using default backend 'copy'
I0526 22:59:39.783987  7901 cluster.cpp:448] Creating default 'local' authorizer
I0526 22:59:39.785497 25601 slave.cpp:232] Mesos agent started on (754)@172.17.0.2:52405
I0526 22:59:39.785656 25601 slave.cpp:233] Flags at startup: --acls="" --appc_simple_discovery_uri_prefix="http://"
--appc_store_dir="/tmp/mesos/store/appc" --authenticate_http_executors="true" --authenticate_http_readonly="true"
--authenticate_http_readwrite="true" --authenticatee="crammd5" --authentication_backoff_factor="1secs"
--authorizer="local" --cgroups_cpu_enable_pids_and_tids_count="false" --cgroups_enable_cfs="false"
--cgroups_hierarchy="/sys/fs/cgroup" --cgroups_limit_swap="false" --cgroups_root="mesos" --container_disk_watch_interval="15secs"
--containerizers="mesos" --credential="/tmp/Endpoint_SlaveEndpointTest_NoAuthorizer_0_6klesi/credential"
--default_role="*" --disk_watch_interval="1mins" --docker="docker" --docker_kill_orphans="true"
--docker_registry="https://registry-1.docker.io" --docker_remove_delay="6hrs" --docker_socket="/var/run/docker.sock"
--docker_stop_timeout="0ns" --docker_store_dir="/tmp/mesos/store/docker" --docker_volume_checkpoint_dir="/var/run/mesos/isolators/docker/volume"
--enforce_container_disk_quota="false" --executor_registration_timeout="1mins" --executor_reregistration_timeout="2secs"
--executor_secret_key="/tmp/Endpoint_SlaveEndpointTest_NoAuthorizer_0_6klesi/executor_secret_key"
--executor_shutdown_grace_period="5secs" --fetcher_cache_dir="/tmp/Endpoint_SlaveEndpointTest_NoAuthorizer_0_6klesi/fetch"
--fetcher_cache_size="2GB" --frameworks_home="" --gc_delay="1weeks" --gc_disk_headroom="0.1"
--hadoop_home="" --help="false" --hostname_lookup="true" --http_command_executor="false" --http_credentials="/tmp/Endpoint_SlaveEndpointTest_NoAuthorizer_0_6klesi/http_credentials"
--http_heartbeat_interval="30secs" --initialize_driver_logging="true" --isolation="posix/cpu,posix/mem"
--launcher="posix" --launcher_dir="/mesos/mesos-1.4.0/_build/src" --logbufsecs="0" --logging_level="INFO"
--max_completed_executors_per_framework="150" --oversubscribed_resources_interval="15secs"
--perf_duration="10secs" --perf_interval="1mins" --port="5051" --qos_correction_interval_min="0ns"
--quiet="false" --recover="reconnect" --recovery_timeout="15mins" --registration_backoff_factor="10ms"
--resources="cpus:2;gpus:0;mem:1024;disk:1024;ports:[31000-32000]" --revocable_cpu_low_priority="true"
--runtime_dir="/tmp/Endpoint_SlaveEndpointTest_NoAuthorizer_0_6klesi" --sandbox_directory="/mnt/mesos/sandbox"
--strict="true" --switch_user="true" --systemd_enable_support="true" --systemd_runtime_directory="/run/systemd/system"
--version="false" --work_dir="/tmp/Endpoint_SlaveEndpointTest_NoAuthorizer_0_rcY2fj"
I0526 22:59:39.786188 25601 credentials.hpp:86] Loading credential for authentication from
'/tmp/Endpoint_SlaveEndpointTest_NoAuthorizer_0_6klesi/credential'
I0526 22:59:39.786419 25601 slave.cpp:265] Agent using credential for: test-principal
I0526 22:59:39.786444 25601 credentials.hpp:37] Loading credentials for authentication from
'/tmp/Endpoint_SlaveEndpointTest_NoAuthorizer_0_6klesi/http_credentials'
I0526 22:59:39.786775 25601 http.cpp:975] Creating default 'basic' HTTP authenticator for
realm 'mesos-agent-executor'
I0526 22:59:39.786907 25601 http.cpp:996] Creating default 'jwt' HTTP authenticator for realm
'mesos-agent-executor'
I0526 22:59:39.787114 25601 http.cpp:975] Creating default 'basic' HTTP authenticator for
realm 'mesos-agent-readonly'
I0526 22:59:39.787243 25601 http.cpp:996] Creating default 'jwt' HTTP authenticator for realm
'mesos-agent-readonly'
I0526 22:59:39.787509 25601 http.cpp:975] Creating default 'basic' HTTP authenticator for
realm 'mesos-agent-readwrite'
I0526 22:59:39.787631 25601 http.cpp:996] Creating default 'jwt' HTTP authenticator for realm
'mesos-agent-readwrite'
I0526 22:59:39.788895 25601 slave.cpp:536] Agent resources: cpus(*):2; mem(*):1024; disk(*):1024;
ports(*):[31000-32000]
I0526 22:59:39.788967 25601 slave.cpp:544] Agent attributes: [  ]
I0526 22:59:39.788990 25601 slave.cpp:549] Agent hostname: ee75eac24e06
I0526 22:59:39.789161 25612 status_update_manager.cpp:177] Pausing sending status updates
I0526 22:59:39.791206 25605 state.cpp:62] Recovering state from '/tmp/Endpoint_SlaveEndpointTest_NoAuthorizer_0_rcY2fj/meta'
I0526 22:59:39.791647 25608 status_update_manager.cpp:203] Recovering status update manager
I0526 22:59:39.791836 25616 containerizer.cpp:582] Recovering containerizer
I0526 22:59:39.793305 25616 provisioner.cpp:416] Provisioner recovery complete
I0526 22:59:39.793653 25607 slave.cpp:6073] Finished recovery
I0526 22:59:39.794306 25607 slave.cpp:6255] Querying resource estimator for oversubscribable
resources
I0526 22:59:39.794759 25609 slave.cpp:6269] Received oversubscribable resources {} from the
resource estimator
I0526 22:59:39.797893 25602 process.cpp:3730] Handling HTTP event for process 'slave(754)'
with path: '/slave(754)/monitor/statistics'
I0526 22:59:39.801193 25602 http.cpp:1115] HTTP GET for /slave(754)/monitor/statistics from
172.17.0.2:41822
I0526 22:59:39.801594 25602 http.cpp:936] Authorizing principal 'test-principal' to GET the
'/monitor/statistics' endpoint
I0526 22:59:39.805758 25608 slave.cpp:801] Agent terminating
[       OK ] Endpoint/SlaveEndpointTest.NoAuthorizer/0 (34 ms)
[ RUN      ] Endpoint/SlaveEndpointTest.NoAuthorizer/1
I0526 22:59:39.815454  7901 containerizer.cpp:230] Using isolation: posix/cpu,posix/mem,filesystem/posix,network/cni,environment_secret
W0526 22:59:39.815908  7901 backend.cpp:76] Failed to create 'aufs' backend: AufsBackend requires
root privileges
W0526 22:59:39.816006  7901 backend.cpp:76] Failed to create 'bind' backend: BindBackend requires
root privileges
I0526 22:59:39.816046  7901 provisioner.cpp:255] Using default backend 'copy'
I0526 22:59:39.817720  7901 cluster.cpp:448] Creating default 'local' authorizer
I0526 22:59:39.819193 25603 slave.cpp:232] Mesos agent started on (755)@172.17.0.2:52405
I0526 22:59:39.819217 25603 slave.cpp:233] Flags at startup: --acls="" --appc_simple_discovery_uri_prefix="http://"
--appc_store_dir="/tmp/mesos/store/appc" --authenticate_http_executors="true" --authenticate_http_readonly="true"
--authenticate_http_readwrite="true" --authenticatee="crammd5" --authentication_backoff_factor="1secs"
--authorizer="local" --cgroups_cpu_enable_pids_and_tids_count="false" --cgroups_enable_cfs="false"
--cgroups_hierarchy="/sys/fs/cgroup" --cgroups_limit_swap="false" --cgroups_root="mesos" --container_disk_watch_interval="15secs"
--containerizers="mesos" --credential="/tmp/Endpoint_SlaveEndpointTest_NoAuthorizer_1_cR9Gxf/credential"
--default_role="*" --disk_watch_interval="1mins" --docker="docker" --docker_kill_orphans="true"
--docker_registry="https://registry-1.docker.io" --docker_remove_delay="6hrs" --docker_socket="/var/run/docker.sock"
--docker_stop_timeout="0ns" --docker_store_dir="/tmp/mesos/store/docker" --docker_volume_checkpoint_dir="/var/run/mesos/isolators/docker/volume"
--enforce_container_disk_quota="false" --executor_registration_timeout="1mins" --executor_reregistration_timeout="2secs"
--executor_secret_key="/tmp/Endpoint_SlaveEndpointTest_NoAuthorizer_1_cR9Gxf/executor_secret_key"
--executor_shutdown_grace_period="5secs" --fetcher_cache_dir="/tmp/Endpoint_SlaveEndpointTest_NoAuthorizer_1_cR9Gxf/fetch"
--fetcher_cache_size="2GB" --frameworks_home="" --gc_delay="1weeks" --gc_disk_headroom="0.1"
--hadoop_home="" --help="false" --hostname_lookup="true" --http_command_executor="false" --http_credentials="/tmp/Endpoint_SlaveEndpointTest_NoAuthorizer_1_cR9Gxf/http_credentials"
--http_heartbeat_interval="30secs" --initialize_driver_logging="true" --isolation="posix/cpu,posix/mem"
--launcher="posix" --launcher_dir="/mesos/mesos-1.4.0/_build/src" --logbufsecs="0" --logging_level="INFO"
--max_completed_executors_per_framework="150" --oversubscribed_resources_interval="15secs"
--perf_duration="10secs" --perf_interval="1mins" --port="5051" --qos_correction_interval_min="0ns"
--quiet="false" --recover="reconnect" --recovery_timeout="15mins" --registration_backoff_factor="10ms"
--resources="cpus:2;gpus:0;mem:1024;disk:1024;ports:[31000-32000]" --revocable_cpu_low_priority="true"
--runtime_dir="/tmp/Endpoint_SlaveEndpointTest_NoAuthorizer_1_cR9Gxf" --sandbox_directory="/mnt/mesos/sandbox"
--strict="true" --switch_user="true" --systemd_enable_support="true" --systemd_runtime_directory="/run/systemd/system"
--version="false" --work_dir="/tmp/Endpoint_SlaveEndpointTest_NoAuthorizer_1_X8fZfg"
I0526 22:59:39.819939 25603 credentials.hpp:86] Loading credential for authentication from
'/tmp/Endpoint_SlaveEndpointTest_NoAuthorizer_1_cR9Gxf/credential'
I0526 22:59:39.820143 25603 slave.cpp:265] Agent using credential for: test-principal
I0526 22:59:39.820170 25603 credentials.hpp:37] Loading credentials for authentication from
'/tmp/Endpoint_SlaveEndpointTest_NoAuthorizer_1_cR9Gxf/http_credentials'
I0526 22:59:39.820605 25603 http.cpp:975] Creating default 'basic' HTTP authenticator for
realm 'mesos-agent-executor'
I0526 22:59:39.820729 25603 http.cpp:996] Creating default 'jwt' HTTP authenticator for realm
'mesos-agent-executor'
I0526 22:59:39.820986 25603 http.cpp:975] Creating default 'basic' HTTP authenticator for
realm 'mesos-agent-readonly'
I0526 22:59:39.821084 25603 http.cpp:996] Creating default 'jwt' HTTP authenticator for realm
'mesos-agent-readonly'
I0526 22:59:39.821280 25603 http.cpp:975] Creating default 'basic' HTTP authenticator for
realm 'mesos-agent-readwrite'
I0526 22:59:39.821385 25603 http.cpp:996] Creating default 'jwt' HTTP authenticator for realm
'mesos-agent-readwrite'
I0526 22:59:39.822713 25603 slave.cpp:536] Agent resources: cpus(*):2; mem(*):1024; disk(*):1024;
ports(*):[31000-32000]
I0526 22:59:39.822783 25603 slave.cpp:544] Agent attributes: [  ]
I0526 22:59:39.822799 25603 slave.cpp:549] Agent hostname: ee75eac24e06
I0526 22:59:39.822969 25610 status_update_manager.cpp:177] Pausing sending status updates
I0526 22:59:39.824884 25609 state.cpp:62] Recovering state from '/tmp/Endpoint_SlaveEndpointTest_NoAuthorizer_1_X8fZfg/meta'
I0526 22:59:39.825356 25613 status_update_manager.cpp:203] Recovering status update manager
I0526 22:59:39.825526 25615 containerizer.cpp:582] Recovering containerizer
I0526 22:59:39.826984 25608 provisioner.cpp:416] Provisioner recovery complete
I0526 22:59:39.827419 25614 slave.cpp:6073] Finished recovery
I0526 22:59:39.828158 25614 slave.cpp:6255] Querying resource estimator for oversubscribable
resources
I0526 22:59:39.828649 25608 slave.cpp:6269] Received oversubscribable resources {} from the
resource estimator
I0526 22:59:39.831538 25609 process.cpp:3730] Handling HTTP event for process 'slave(755)'
with path: '/slave(755)/monitor/statistics.json'
I0526 22:59:39.833423 25607 http.cpp:1115] HTTP GET for /slave(755)/monitor/statistics.json
from 172.17.0.2:41824
I0526 22:59:39.833504 25607 http.cpp:936] Authorizing principal 'test-principal' to GET the
'/monitor/statistics.json' endpoint
I0526 22:59:39.836863  7901 slave.cpp:801] Agent terminating
[       OK ] Endpoint/SlaveEndpointTest.NoAuthorizer/1 (32 ms)
[ RUN      ] Endpoint/SlaveEndpointTest.NoAuthorizer/2
I0526 22:59:39.847497  7901 containerizer.cpp:230] Using isolation: posix/cpu,posix/mem,filesystem/posix,network/cni,environment_secret
W0526 22:59:39.847982  7901 backend.cpp:76] Failed to create 'aufs' backend: AufsBackend requires
root privileges
W0526 22:59:39.848080  7901 backend.cpp:76] Failed to create 'bind' backend: BindBackend requires
root privileges
I0526 22:59:39.848120  7901 provisioner.cpp:255] Using default backend 'copy'
I0526 22:59:39.849746  7901 cluster.cpp:448] Creating default 'local' authorizer
I0526 22:59:39.851235 25612 slave.cpp:232] Mesos agent started on (756)@172.17.0.2:52405
I0526 22:59:39.851263 25612 slave.cpp:233] Flags at startup: --acls="" --appc_simple_discovery_uri_prefix="http://"
--appc_store_dir="/tmp/mesos/store/appc" --authenticate_http_executors="true" --authenticate_http_readonly="true"
--authenticate_http_readwrite="true" --authenticatee="crammd5" --authentication_backoff_factor="1secs"
--authorizer="local" --cgroups_cpu_enable_pids_and_tids_count="false" --cgroups_enable_cfs="false"
--cgroups_hierarchy="/sys/fs/cgroup" --cgroups_limit_swap="false" --cgroups_root="mesos" --container_disk_watch_interval="15secs"
--containerizers="mesos" --credential="/tmp/Endpoint_SlaveEndpointTest_NoAuthorizer_2_Kbu8Xc/credential"
--default_role="*" --disk_watch_interval="1mins" --docker="docker" --docker_kill_orphans="true"
--docker_registry="https://registry-1.docker.io" --docker_remove_delay="6hrs" --docker_socket="/var/run/docker.sock"
--docker_stop_timeout="0ns" --docker_store_dir="/tmp/mesos/store/docker" --docker_volume_checkpoint_dir="/var/run/mesos/isolators/docker/volume"
--enforce_container_disk_quota="false" --executor_registration_timeout="1mins" --executor_reregistration_timeout="2secs"
--executor_secret_key="/tmp/Endpoint_SlaveEndpointTest_NoAuthorizer_2_Kbu8Xc/executor_secret_key"
--executor_shutdown_grace_period="5secs" --fetcher_cache_dir="/tmp/Endpoint_SlaveEndpointTest_NoAuthorizer_2_Kbu8Xc/fetch"
--fetcher_cache_size="2GB" --frameworks_home="" --gc_delay="1weeks" --gc_disk_headroom="0.1"
--hadoop_home="" --help="false" --hostname_lookup="true" --http_command_executor="false" --http_credentials="/tmp/Endpoint_SlaveEndpointTest_NoAuthorizer_2_Kbu8Xc/http_credentials"
--http_heartbeat_interval="30secs" --initialize_driver_logging="true" --isolation="posix/cpu,posix/mem"
--launcher="posix" --launcher_dir="/mesos/mesos-1.4.0/_build/src" --logbufsecs="0" --logging_level="INFO"
--max_completed_executors_per_framework="150" --oversubscribed_resources_interval="15secs"
--perf_duration="10secs" --perf_interval="1mins" --port="5051" --qos_correction_interval_min="0ns"
--quiet="false" --recover="reconnect" --recovery_timeout="15mins" --registration_backoff_factor="10ms"
--resources="cpus:2;gpus:0;mem:1024;disk:1024;ports:[31000-32000]" --revocable_cpu_low_priority="true"
--runtime_dir="/tmp/Endpoint_SlaveEndpointTest_NoAuthorizer_2_Kbu8Xc" --sandbox_directory="/mnt/mesos/sandbox"
--strict="true" --switch_user="true" --systemd_enable_support="true" --systemd_runtime_directory="/run/systemd/system"
--version="false" --work_dir="/tmp/Endpoint_SlaveEndpointTest_NoAuthorizer_2_WSjgBd"
I0526 22:59:39.851820 25612 credentials.hpp:86] Loading credential for authentication from
'/tmp/Endpoint_SlaveEndpointTest_NoAuthorizer_2_Kbu8Xc/credential'
I0526 22:59:39.852026 25612 slave.cpp:265] Agent using credential for: test-principal
I0526 22:59:39.852056 25612 credentials.hpp:37] Loading credentials for authentication from
'/tmp/Endpoint_SlaveEndpointTest_NoAuthorizer_2_Kbu8Xc/http_credentials'
I0526 22:59:39.852442 25612 http.cpp:975] Creating default 'basic' HTTP authenticator for
realm 'mesos-agent-executor'
I0526 22:59:39.852587 25612 http.cpp:996] Creating default 'jwt' HTTP authenticator for realm
'mesos-agent-executor'
I0526 22:59:39.852830 25612 http.cpp:975] Creating default 'basic' HTTP authenticator for
realm 'mesos-agent-readonly'
I0526 22:59:39.852944 25612 http.cpp:996] Creating default 'jwt' HTTP authenticator for realm
'mesos-agent-readonly'
I0526 22:59:39.853201 25612 http.cpp:975] Creating default 'basic' HTTP authenticator for
realm 'mesos-agent-readwrite'
I0526 22:59:39.853749 25612 http.cpp:996] Creating default 'jwt' HTTP authenticator for realm
'mesos-agent-readwrite'
I0526 22:59:39.856029 25612 slave.cpp:536] Agent resources: cpus(*):2; mem(*):1024; disk(*):1024;
ports(*):[31000-32000]
I0526 22:59:39.856508 25612 slave.cpp:544] Agent attributes: [  ]
I0526 22:59:39.856802 25612 slave.cpp:549] Agent hostname: ee75eac24e06
I0526 22:59:39.857205 25611 status_update_manager.cpp:177] Pausing sending status updates
I0526 22:59:39.860677 25615 state.cpp:62] Recovering state from '/tmp/Endpoint_SlaveEndpointTest_NoAuthorizer_2_WSjgBd/meta'
I0526 22:59:39.861150 25605 status_update_manager.cpp:203] Recovering status update manager
I0526 22:59:39.861424 25609 containerizer.cpp:582] Recovering containerizer
I0526 22:59:39.863926 25609 provisioner.cpp:416] Provisioner recovery complete
I0526 22:59:39.864408 25611 slave.cpp:6073] Finished recovery
I0526 22:59:39.865389 25611 slave.cpp:6255] Querying resource estimator for oversubscribable
resources
I0526 22:59:39.866361 25611 slave.cpp:6269] Received oversubscribable resources {} from the
resource estimator
I0526 22:59:39.869662 25601 process.cpp:3730] Handling HTTP event for process 'slave(756)'
with path: '/slave(756)/containers'
I0526 22:59:39.872282 25606 http.cpp:1115] HTTP GET for /slave(756)/containers from 172.17.0.2:41826
I0526 22:59:39.872392 25606 http.cpp:936] Authorizing principal 'test-principal' to GET the
'/containers' endpoint
I0526 22:59:39.881801 25605 slave.cpp:801] Agent terminating
[       OK ] Endpoint/SlaveEndpointTest.NoAuthorizer/2 (48 ms)
[----------] 9 tests from Endpoint/SlaveEndpointTest (347 ms total)

[----------] Global test environment tear-down
[==========] 1581 tests from 177 test cases ran. (481592 ms total)
[  PASSED  ] 1579 tests.
[  FAILED  ] 2 tests, listed below:
[  FAILED  ] CommandExecutorCheckTest.HTTPCheckDelivered
[  FAILED  ] ExamplesTest.PythonFramework

 2 FAILED TESTS
  YOU HAVE 22 DISABLED TESTS

E0526 22:59:39.957430 25617 process.cpp:950] Failed to accept socket: future discarded
make[4]: *** [check-local] Error 1
make[4]: Leaving directory `/mesos/mesos-1.4.0/_build/src'
make[3]: *** [check-am] Error 2
make[3]: Leaving directory `/mesos/mesos-1.4.0/_build/src'
make[2]: *** [check] Error 2
make[2]: Leaving directory `/mesos/mesos-1.4.0/_build/src'
make[1]: *** [check-recursive] Error 1
make[1]: Leaving directory `/mesos/mesos-1.4.0/_build'
make: *** [distcheck] Error 1
+ docker rmi mesos-1495836844-30319
Untagged: mesos-1495836844-30319:latest
Deleted: sha256:da9b0d01f25f9d8eb6664e8c7ee2493b21c285947bdc8b1ac50bff44d31cf41d
Deleted: sha256:344cf3dabf130decfc65344c3a363e1ce7fb08b5dacacedb701258eacb97a9ef
Deleted: sha256:dc5f77a9606260c49fbda76607f31d5856f8f214d9d839510be819165ae7f914
Deleted: sha256:681cb30cb22fe0aab7e74fe9af897a005729e502f783806838a6b51ad483389c
Deleted: sha256:efa8150a4953d9326f688cf2dafb9c725753a3c41bf83293c64ea01e5ba77a7f
Deleted: sha256:e52216593f4d438f4e6d080d58493c636f01f855b131c0879575e28c659d703f
Deleted: sha256:e88c6d6bb746664d3896c1fb5f90a1e9acea300618d4d40845c94adbb38fe236
Deleted: sha256:fda6bfb0458233c5969e5e12cbeac3432b9a081a94aa686edd0006a9d78ce23e
Deleted: sha256:f8dae20c634edfb11880e8def89a6eb99539c1b32b8db3824b0c3e888c3af622
Deleted: sha256:3d0a8fec4c334329aaff7c7dc07252cfa4cad37beef5b558c9fd7b5757768b2a
Deleted: sha256:15b4147582f3a1e88b3f4a5603e9c085a312f951d5554a48b0a377d7021ed68c
Deleted: sha256:e962410418c797cc2e50dacbbb4ef0a8f9abc021b071bbc1736c6e6997378b3b
Deleted: sha256:f671e26caec8942a42a9ab81ce705842e81d61ed4499b515c22f1b8f732e1d5f
Deleted: sha256:0a6213aa36027dba83c75e0127fa413516a85360b5ea2ec3f9c46ed71e76cb6a
Deleted: sha256:59e9b35b2c44c7795b06eda179f55e6b7f98a618dd17311d37ecaa1b2ec44ed5
Deleted: sha256:d5bacfab566f24bc9794fd196669f01513a52f5f602aef2c1e947ff03814bd3b
Deleted: sha256:3e676370f7f996b14921f4dad90d906c18def0dcffe94270fb0b966cfe388b6b
Deleted: sha256:5312b5d52b5d50f8e5d956bef18f641fc58f24b5b1e2f7e630ed42e5690816a6
Deleted: sha256:df60238ee8c1a9d3e87157b3d2539861eaa090aa33eff58ea8aae88fd68cda98
Deleted: sha256:010da1517514bd8f4c559152aacad5acda66cc730432d646b673f99081c5b1c9
Deleted: sha256:b55e0408ef500f961f1f9f478d63c292d5f27d3b31e1b4270089ca97c2a4ce19
Deleted: sha256:594d57c8da848f33271a42d30a07c61ec486156b97b132b5e3d099ab8273ad93
Deleted: sha256:23b5e55ed03cd458f241150e97961cf2cd3bdfab78c39cc6a9800a21cfbdafbb
Deleted: sha256:80626cc401a3a81c0c167c7c300dfbbb938ddac032cecf35e54a3e80da989b66
Deleted: sha256:24022f292c3c0e49817bfc10c72a9d319e8f24953ed871d989a963cacd655ec7
Build step 'Execute shell' marked build as failure
Not sending mail to unregistered user neil.conway@gmail.com

Mime
View raw message