mesos-builds mailing list archives

Site index · List index
Message view « Date » · « Thread »
Top « Date » · « Thread »
From Apache Jenkins Server <jenk...@builds.apache.org>
Subject Build failed in Jenkins: Mesos-Buildbot » cmake,clang,--verbose --enable-libevent --enable-ssl,GLOG_v=1 MESOS_VERBOSE=1,ubuntu:14.04,(docker||Hadoop)&&(!ubuntu-us1)&&(!ubuntu-eu2) #3674
Date Sat, 13 May 2017 00:31:01 GMT
See <https://builds.apache.org/job/Mesos-Buildbot/BUILDTOOL=cmake,COMPILER=clang,CONFIGURATION=--verbose%20--enable-libevent%20--enable-ssl,ENVIRONMENT=GLOG_v=1%20MESOS_VERBOSE=1,OS=ubuntu%3A14.04,label_exp=(docker%7C%7CHadoop)&&(!ubuntu-us1)&&(!ubuntu-eu2)/3674/display/redirect?page=changes>

Changes:

[xujyan] Clarified comments about resource operations through operator API.

------------------------------------------
[...truncated 26.83 MB...]
I0513 00:30:54.776216 31900 slave.cpp:6156] Querying resource estimator for oversubscribable
resources
I0513 00:30:54.776319 31901 slave.cpp:6170] Received oversubscribable resources {} from the
resource estimator
I0513 00:30:54.777117 31897 process.cpp:3730] Handling HTTP event for process 'slave(754)'
with path: '/slave(754)/containers'
I0513 00:30:54.777626 31901 http.cpp:1115] HTTP GET for /slave(754)/containers from 172.17.0.3:45084
I0513 00:30:54.777698 31901 http.cpp:936] Authorizing principal 'test-principal' to GET the
'/containers' endpoint
I0513 00:30:54.778856 31892 slave.cpp:794] Agent terminating
[       OK ] Endpoint/SlaveEndpointTest.AuthorizedRequest/2 (13 ms)
[ RUN      ] Endpoint/SlaveEndpointTest.UnauthorizedRequest/0
I0513 00:30:54.783972 26017 containerizer.cpp:221] Using isolation: posix/cpu,posix/mem,filesystem/posix,network/cni
W0513 00:30:54.784236 26017 backend.cpp:76] Failed to create 'aufs' backend: AufsBackend requires
root privileges
W0513 00:30:54.784274 26017 backend.cpp:76] Failed to create 'bind' backend: BindBackend requires
root privileges
I0513 00:30:54.784287 26017 provisioner.cpp:249] Using default backend 'copy'
I0513 00:30:54.785245 31904 slave.cpp:225] Mesos agent started on (755)@172.17.0.3:52454
I0513 00:30:54.785270 31904 slave.cpp:226] Flags at startup: --acls="" --appc_simple_discovery_uri_prefix="http://"
--appc_store_dir="/tmp/mesos/store/appc" --authenticate_http_executors="true" --authenticate_http_readonly="true"
--authenticate_http_readwrite="true" --authenticatee="crammd5" --authentication_backoff_factor="1secs"
--authorizer="local" --cgroups_cpu_enable_pids_and_tids_count="false" --cgroups_enable_cfs="false"
--cgroups_hierarchy="/sys/fs/cgroup" --cgroups_limit_swap="false" --cgroups_root="mesos" --container_disk_watch_interval="15secs"
--containerizers="mesos" --credential="/tmp/Endpoint_SlaveEndpointTest_UnauthorizedRequest_0_5YcyAe/credential"
--default_role="*" --disk_watch_interval="1mins" --docker="docker" --docker_kill_orphans="true"
--docker_registry="https://registry-1.docker.io" --docker_remove_delay="6hrs" --docker_socket="/var/run/docker.sock"
--docker_stop_timeout="0ns" --docker_store_dir="/tmp/mesos/store/docker" --docker_volume_checkpoint_dir="/var/run/mesos/isolators/docker/volume"
--enforce_container_disk_quota="false" --executor_registration_timeout="1mins" --executor_secret_key="/tmp/Endpoint_SlaveEndpointTest_UnauthorizedRequest_0_5YcyAe/executor_secret_key"
--executor_shutdown_grace_period="5secs" --fetcher_cache_dir="/tmp/Endpoint_SlaveEndpointTest_UnauthorizedRequest_0_5YcyAe/fetch"
--fetcher_cache_size="2GB" --frameworks_home="" --gc_delay="1weeks" --gc_disk_headroom="0.1"
--hadoop_home="" --help="false" --hostname_lookup="true" --http_command_executor="false" --http_credentials="/tmp/Endpoint_SlaveEndpointTest_UnauthorizedRequest_0_5YcyAe/http_credentials"
--http_heartbeat_interval="30secs" --initialize_driver_logging="true" --isolation="posix/cpu,posix/mem"
--launcher="posix" --launcher_dir="/mesos/build/src" --logbufsecs="0" --logging_level="INFO"
--max_completed_executors_per_framework="150" --oversubscribed_resources_interval="15secs"
--perf_duration="10secs" --perf_interval="1mins" --port="5051" --qos_correction_interval_min="0ns"
--quiet="false" --recover="reconnect" --recovery_timeout="15mins" --registration_backoff_factor="10ms"
--resources="cpus:2;gpus:0;mem:1024;disk:1024;ports:[31000-32000]" --revocable_cpu_low_priority="true"
--runtime_dir="/tmp/Endpoint_SlaveEndpointTest_UnauthorizedRequest_0_5YcyAe" --sandbox_directory="/mnt/mesos/sandbox"
--strict="true" --switch_user="true" --systemd_enable_support="true" --systemd_runtime_directory="/run/systemd/system"
--version="false" --work_dir="/tmp/Endpoint_SlaveEndpointTest_UnauthorizedRequest_0_rDcVSz"
I0513 00:30:54.785493 31904 credentials.hpp:86] Loading credential for authentication from
'/tmp/Endpoint_SlaveEndpointTest_UnauthorizedRequest_0_5YcyAe/credential'
I0513 00:30:54.785603 31904 slave.cpp:258] Agent using credential for: test-principal
I0513 00:30:54.785616 31904 credentials.hpp:37] Loading credentials for authentication from
'/tmp/Endpoint_SlaveEndpointTest_UnauthorizedRequest_0_5YcyAe/http_credentials'
I0513 00:30:54.785744 31904 http.cpp:975] Creating default 'basic' HTTP authenticator for
realm 'mesos-agent-executor'
I0513 00:30:54.785791 31904 http.cpp:996] Creating default 'jwt' HTTP authenticator for realm
'mesos-agent-executor'
I0513 00:30:54.785884 31904 http.cpp:975] Creating default 'basic' HTTP authenticator for
realm 'mesos-agent-readonly'
I0513 00:30:54.785924 31904 http.cpp:996] Creating default 'jwt' HTTP authenticator for realm
'mesos-agent-readonly'
I0513 00:30:54.785993 31904 http.cpp:975] Creating default 'basic' HTTP authenticator for
realm 'mesos-agent-readwrite'
I0513 00:30:54.786026 31904 http.cpp:996] Creating default 'jwt' HTTP authenticator for realm
'mesos-agent-readwrite'
I0513 00:30:54.786428 31904 slave.cpp:529] Agent resources: cpus(*):2; mem(*):1024; disk(*):1024;
ports(*):[31000-32000]
I0513 00:30:54.786458 31904 slave.cpp:537] Agent attributes: [  ]
I0513 00:30:54.786466 31904 slave.cpp:542] Agent hostname: 892c12bc5668
I0513 00:30:54.786520 31894 status_update_manager.cpp:177] Pausing sending status updates
I0513 00:30:54.786855 31899 state.cpp:62] Recovering state from '/tmp/Endpoint_SlaveEndpointTest_UnauthorizedRequest_0_rDcVSz/meta'
I0513 00:30:54.787029 31901 status_update_manager.cpp:203] Recovering status update manager
I0513 00:30:54.787189 31903 containerizer.cpp:608] Recovering containerizer
I0513 00:30:54.787694 31905 provisioner.cpp:410] Provisioner recovery complete
I0513 00:30:54.787863 31903 slave.cpp:5974] Finished recovery
I0513 00:30:54.788310 31903 slave.cpp:6156] Querying resource estimator for oversubscribable
resources
I0513 00:30:54.788431 31896 slave.cpp:6170] Received oversubscribable resources {} from the
resource estimator
I0513 00:30:54.789204 31900 process.cpp:3730] Handling HTTP event for process 'slave(755)'
with path: '/slave(755)/monitor/statistics'
I0513 00:30:54.789790 31893 http.cpp:1115] HTTP GET for /slave(755)/monitor/statistics from
172.17.0.3:45085
I0513 00:30:54.789827 31893 http.cpp:936] Authorizing principal 'test-principal' to GET the
'/monitor/statistics' endpoint
I0513 00:30:54.790760 31897 slave.cpp:794] Agent terminating
[       OK ] Endpoint/SlaveEndpointTest.UnauthorizedRequest/0 (11 ms)
[ RUN      ] Endpoint/SlaveEndpointTest.UnauthorizedRequest/1
I0513 00:30:54.795089 26017 containerizer.cpp:221] Using isolation: posix/cpu,posix/mem,filesystem/posix,network/cni
W0513 00:30:54.795344 26017 backend.cpp:76] Failed to create 'aufs' backend: AufsBackend requires
root privileges
W0513 00:30:54.795387 26017 backend.cpp:76] Failed to create 'bind' backend: BindBackend requires
root privileges
I0513 00:30:54.795408 26017 provisioner.cpp:249] Using default backend 'copy'
I0513 00:30:54.796464 31900 slave.cpp:225] Mesos agent started on (756)@172.17.0.3:52454
I0513 00:30:54.796489 31900 slave.cpp:226] Flags at startup: --acls="" --appc_simple_discovery_uri_prefix="http://"
--appc_store_dir="/tmp/mesos/store/appc" --authenticate_http_executors="true" --authenticate_http_readonly="true"
--authenticate_http_readwrite="true" --authenticatee="crammd5" --authentication_backoff_factor="1secs"
--authorizer="local" --cgroups_cpu_enable_pids_and_tids_count="false" --cgroups_enable_cfs="false"
--cgroups_hierarchy="/sys/fs/cgroup" --cgroups_limit_swap="false" --cgroups_root="mesos" --container_disk_watch_interval="15secs"
--containerizers="mesos" --credential="/tmp/Endpoint_SlaveEndpointTest_UnauthorizedRequest_1_EyOcvR/credential"
--default_role="*" --disk_watch_interval="1mins" --docker="docker" --docker_kill_orphans="true"
--docker_registry="https://registry-1.docker.io" --docker_remove_delay="6hrs" --docker_socket="/var/run/docker.sock"
--docker_stop_timeout="0ns" --docker_store_dir="/tmp/mesos/store/docker" --docker_volume_checkpoint_dir="/var/run/mesos/isolators/docker/volume"
--enforce_container_disk_quota="false" --executor_registration_timeout="1mins" --executor_secret_key="/tmp/Endpoint_SlaveEndpointTest_UnauthorizedRequest_1_EyOcvR/executor_secret_key"
--executor_shutdown_grace_period="5secs" --fetcher_cache_dir="/tmp/Endpoint_SlaveEndpointTest_UnauthorizedRequest_1_EyOcvR/fetch"
--fetcher_cache_size="2GB" --frameworks_home="" --gc_delay="1weeks" --gc_disk_headroom="0.1"
--hadoop_home="" --help="false" --hostname_lookup="true" --http_command_executor="false" --http_credentials="/tmp/Endpoint_SlaveEndpointTest_UnauthorizedRequest_1_EyOcvR/http_credentials"
--http_heartbeat_interval="30secs" --initialize_driver_logging="true" --isolation="posix/cpu,posix/mem"
--launcher="posix" --launcher_dir="/mesos/build/src" --logbufsecs="0" --logging_level="INFO"
--max_completed_executors_per_framework="150" --oversubscribed_resources_interval="15secs"
--perf_duration="10secs" --perf_interval="1mins" --port="5051" --qos_correction_interval_min="0ns"
--quiet="false" --recover="reconnect" --recovery_timeout="15mins" --registration_backoff_factor="10ms"
--resources="cpus:2;gpus:0;mem:1024;disk:1024;ports:[31000-32000]" --revocable_cpu_low_priority="true"
--runtime_dir="/tmp/Endpoint_SlaveEndpointTest_UnauthorizedRequest_1_EyOcvR" --sandbox_directory="/mnt/mesos/sandbox"
--strict="true" --switch_user="true" --systemd_enable_support="true" --systemd_runtime_directory="/run/systemd/system"
--version="false" --work_dir="/tmp/Endpoint_SlaveEndpointTest_UnauthorizedRequest_1_7dxLLc"
I0513 00:30:54.796754 31900 credentials.hpp:86] Loading credential for authentication from
'/tmp/Endpoint_SlaveEndpointTest_UnauthorizedRequest_1_EyOcvR/credential'
I0513 00:30:54.796860 31900 slave.cpp:258] Agent using credential for: test-principal
I0513 00:30:54.796876 31900 credentials.hpp:37] Loading credentials for authentication from
'/tmp/Endpoint_SlaveEndpointTest_UnauthorizedRequest_1_EyOcvR/http_credentials'
I0513 00:30:54.797019 31900 http.cpp:975] Creating default 'basic' HTTP authenticator for
realm 'mesos-agent-executor'
I0513 00:30:54.797062 31900 http.cpp:996] Creating default 'jwt' HTTP authenticator for realm
'mesos-agent-executor'
I0513 00:30:54.797174 31900 http.cpp:975] Creating default 'basic' HTTP authenticator for
realm 'mesos-agent-readonly'
I0513 00:30:54.797219 31900 http.cpp:996] Creating default 'jwt' HTTP authenticator for realm
'mesos-agent-readonly'
I0513 00:30:54.797358 31900 http.cpp:975] Creating default 'basic' HTTP authenticator for
realm 'mesos-agent-readwrite'
I0513 00:30:54.797420 31900 http.cpp:996] Creating default 'jwt' HTTP authenticator for realm
'mesos-agent-readwrite'
I0513 00:30:54.797816 31900 slave.cpp:529] Agent resources: cpus(*):2; mem(*):1024; disk(*):1024;
ports(*):[31000-32000]
I0513 00:30:54.797844 31900 slave.cpp:537] Agent attributes: [  ]
I0513 00:30:54.797849 31900 slave.cpp:542] Agent hostname: 892c12bc5668
I0513 00:30:54.797924 31895 status_update_manager.cpp:177] Pausing sending status updates
I0513 00:30:54.798210 31892 state.cpp:62] Recovering state from '/tmp/Endpoint_SlaveEndpointTest_UnauthorizedRequest_1_7dxLLc/meta'
I0513 00:30:54.798360 31892 status_update_manager.cpp:203] Recovering status update manager
I0513 00:30:54.798427 31892 containerizer.cpp:608] Recovering containerizer
I0513 00:30:54.799032 31902 provisioner.cpp:410] Provisioner recovery complete
I0513 00:30:54.799192 31903 slave.cpp:5974] Finished recovery
I0513 00:30:54.799686 31903 slave.cpp:6156] Querying resource estimator for oversubscribable
resources
I0513 00:30:54.799911 31897 slave.cpp:6170] Received oversubscribable resources {} from the
resource estimator
I0513 00:30:54.800617 31891 process.cpp:3730] Handling HTTP event for process 'slave(756)'
with path: '/slave(756)/monitor/statistics.json'
I0513 00:30:54.801225 31902 http.cpp:1115] HTTP GET for /slave(756)/monitor/statistics.json
from 172.17.0.3:45086
I0513 00:30:54.801264 31902 http.cpp:936] Authorizing principal 'test-principal' to GET the
'/monitor/statistics.json' endpoint
I0513 00:30:54.802141 31897 slave.cpp:794] Agent terminating
[       OK ] Endpoint/SlaveEndpointTest.UnauthorizedRequest/1 (12 ms)
[ RUN      ] Endpoint/SlaveEndpointTest.UnauthorizedRequest/2
I0513 00:30:54.807152 26017 containerizer.cpp:221] Using isolation: posix/cpu,posix/mem,filesystem/posix,network/cni
W0513 00:30:54.807426 26017 backend.cpp:76] Failed to create 'aufs' backend: AufsBackend requires
root privileges
W0513 00:30:54.807466 26017 backend.cpp:76] Failed to create 'bind' backend: BindBackend requires
root privileges
I0513 00:30:54.807483 26017 provisioner.cpp:249] Using default backend 'copy'
I0513 00:30:54.808508 31891 slave.cpp:225] Mesos agent started on (757)@172.17.0.3:52454
I0513 00:30:54.808534 31891 slave.cpp:226] Flags at startup: --acls="" --appc_simple_discovery_uri_prefix="http://"
--appc_store_dir="/tmp/mesos/store/appc" --authenticate_http_executors="true" --authenticate_http_readonly="true"
--authenticate_http_readwrite="true" --authenticatee="crammd5" --authentication_backoff_factor="1secs"
--authorizer="local" --cgroups_cpu_enable_pids_and_tids_count="false" --cgroups_enable_cfs="false"
--cgroups_hierarchy="/sys/fs/cgroup" --cgroups_limit_swap="false" --cgroups_root="mesos" --container_disk_watch_interval="15secs"
--containerizers="mesos" --credential="/tmp/Endpoint_SlaveEndpointTest_UnauthorizedRequest_2_v7cBxu/credential"
--default_role="*" --disk_watch_interval="1mins" --docker="docker" --docker_kill_orphans="true"
--docker_registry="https://registry-1.docker.io" --docker_remove_delay="6hrs" --docker_socket="/var/run/docker.sock"
--docker_stop_timeout="0ns" --docker_store_dir="/tmp/mesos/store/docker" --docker_volume_checkpoint_dir="/var/run/mesos/isolators/docker/volume"
--enforce_container_disk_quota="false" --executor_registration_timeout="1mins" --executor_secret_key="/tmp/Endpoint_SlaveEndpointTest_UnauthorizedRequest_2_v7cBxu/executor_secret_key"
--executor_shutdown_grace_period="5secs" --fetcher_cache_dir="/tmp/Endpoint_SlaveEndpointTest_UnauthorizedRequest_2_v7cBxu/fetch"
--fetcher_cache_size="2GB" --frameworks_home="" --gc_delay="1weeks" --gc_disk_headroom="0.1"
--hadoop_home="" --help="false" --hostname_lookup="true" --http_command_executor="false" --http_credentials="/tmp/Endpoint_SlaveEndpointTest_UnauthorizedRequest_2_v7cBxu/http_credentials"
--http_heartbeat_interval="30secs" --initialize_driver_logging="true" --isolation="posix/cpu,posix/mem"
--launcher="posix" --launcher_dir="/mesos/build/src" --logbufsecs="0" --logging_level="INFO"
--max_completed_executors_per_framework="150" --oversubscribed_resources_interval="15secs"
--perf_duration="10secs" --perf_interval="1mins" --port="5051" --qos_correction_interval_min="0ns"
--quiet="false" --recover="reconnect" --recovery_timeout="15mins" --registration_backoff_factor="10ms"
--resources="cpus:2;gpus:0;mem:1024;disk:1024;ports:[31000-32000]" --revocable_cpu_low_priority="true"
--runtime_dir="/tmp/Endpoint_SlaveEndpointTest_UnauthorizedRequest_2_v7cBxu" --sandbox_directory="/mnt/mesos/sandbox"
--strict="true" --switch_user="true" --systemd_enable_support="true" --systemd_runtime_directory="/run/systemd/system"
--version="false" --work_dir="/tmp/Endpoint_SlaveEndpointTest_UnauthorizedRequest_2_oJvcMP"
I0513 00:30:54.808815 31891 credentials.hpp:86] Loading credential for authentication from
'/tmp/Endpoint_SlaveEndpointTest_UnauthorizedRequest_2_v7cBxu/credential'
I0513 00:30:54.808912 31891 slave.cpp:258] Agent using credential for: test-principal
I0513 00:30:54.808926 31891 credentials.hpp:37] Loading credentials for authentication from
'/tmp/Endpoint_SlaveEndpointTest_UnauthorizedRequest_2_v7cBxu/http_credentials'
I0513 00:30:54.809103 31891 http.cpp:975] Creating default 'basic' HTTP authenticator for
realm 'mesos-agent-executor'
I0513 00:30:54.809142 31891 http.cpp:996] Creating default 'jwt' HTTP authenticator for realm
'mesos-agent-executor'
I0513 00:30:54.809192 31891 http.cpp:975] Creating default 'basic' HTTP authenticator for
realm 'mesos-agent-readonly'
I0513 00:30:54.809212 31891 http.cpp:996] Creating default 'jwt' HTTP authenticator for realm
'mesos-agent-readonly'
I0513 00:30:54.809274 31891 http.cpp:975] Creating default 'basic' HTTP authenticator for
realm 'mesos-agent-readwrite'
I0513 00:30:54.809303 31891 http.cpp:996] Creating default 'jwt' HTTP authenticator for realm
'mesos-agent-readwrite'
I0513 00:30:54.809671 31891 slave.cpp:529] Agent resources: cpus(*):2; mem(*):1024; disk(*):1024;
ports(*):[31000-32000]
I0513 00:30:54.809701 31891 slave.cpp:537] Agent attributes: [  ]
I0513 00:30:54.809706 31891 slave.cpp:542] Agent hostname: 892c12bc5668
I0513 00:30:54.809792 31892 status_update_manager.cpp:177] Pausing sending status updates
I0513 00:30:54.810072 31902 state.cpp:62] Recovering state from '/tmp/Endpoint_SlaveEndpointTest_UnauthorizedRequest_2_oJvcMP/meta'
I0513 00:30:54.810211 31891 status_update_manager.cpp:203] Recovering status update manager
I0513 00:30:54.810376 31900 containerizer.cpp:608] Recovering containerizer
I0513 00:30:54.810925 31892 provisioner.cpp:410] Provisioner recovery complete
I0513 00:30:54.811039 31902 slave.cpp:5974] Finished recovery
I0513 00:30:54.811403 31902 slave.cpp:6156] Querying resource estimator for oversubscribable
resources
I0513 00:30:54.811597 31896 slave.cpp:6170] Received oversubscribable resources {} from the
resource estimator
I0513 00:30:54.812350 31898 process.cpp:3730] Handling HTTP event for process 'slave(757)'
with path: '/slave(757)/containers'
I0513 00:30:54.812861 31905 http.cpp:1115] HTTP GET for /slave(757)/containers from 172.17.0.3:45087
I0513 00:30:54.812918 31905 http.cpp:936] Authorizing principal 'test-principal' to GET the
'/containers' endpoint
I0513 00:30:54.813768 26017 slave.cpp:794] Agent terminating
[       OK ] Endpoint/SlaveEndpointTest.UnauthorizedRequest/2 (14 ms)
[ RUN      ] Endpoint/SlaveEndpointTest.NoAuthorizer/0
I0513 00:30:54.822733 26017 containerizer.cpp:221] Using isolation: posix/cpu,posix/mem,filesystem/posix,network/cni
W0513 00:30:54.823092 26017 backend.cpp:76] Failed to create 'aufs' backend: AufsBackend requires
root privileges
W0513 00:30:54.823137 26017 backend.cpp:76] Failed to create 'bind' backend: BindBackend requires
root privileges
I0513 00:30:54.823155 26017 provisioner.cpp:249] Using default backend 'copy'
I0513 00:30:54.823758 26017 cluster.cpp:448] Creating default 'local' authorizer
I0513 00:30:54.824539 31897 slave.cpp:225] Mesos agent started on (758)@172.17.0.3:52454
I0513 00:30:54.824580 31897 slave.cpp:226] Flags at startup: --acls="" --appc_simple_discovery_uri_prefix="http://"
--appc_store_dir="/tmp/mesos/store/appc" --authenticate_http_executors="true" --authenticate_http_readonly="true"
--authenticate_http_readwrite="true" --authenticatee="crammd5" --authentication_backoff_factor="1secs"
--authorizer="local" --cgroups_cpu_enable_pids_and_tids_count="false" --cgroups_enable_cfs="false"
--cgroups_hierarchy="/sys/fs/cgroup" --cgroups_limit_swap="false" --cgroups_root="mesos" --container_disk_watch_interval="15secs"
--containerizers="mesos" --credential="/tmp/Endpoint_SlaveEndpointTest_NoAuthorizer_0_A63oJ7/credential"
--default_role="*" --disk_watch_interval="1mins" --docker="docker" --docker_kill_orphans="true"
--docker_registry="https://registry-1.docker.io" --docker_remove_delay="6hrs" --docker_socket="/var/run/docker.sock"
--docker_stop_timeout="0ns" --docker_store_dir="/tmp/mesos/store/docker" --docker_volume_checkpoint_dir="/var/run/mesos/isolators/docker/volume"
--enforce_container_disk_quota="false" --executor_registration_timeout="1mins" --executor_secret_key="/tmp/Endpoint_SlaveEndpointTest_NoAuthorizer_0_A63oJ7/executor_secret_key"
--executor_shutdown_grace_period="5secs" --fetcher_cache_dir="/tmp/Endpoint_SlaveEndpointTest_NoAuthorizer_0_A63oJ7/fetch"
--fetcher_cache_size="2GB" --frameworks_home="" --gc_delay="1weeks" --gc_disk_headroom="0.1"
--hadoop_home="" --help="false" --hostname_lookup="true" --http_command_executor="false" --http_credentials="/tmp/Endpoint_SlaveEndpointTest_NoAuthorizer_0_A63oJ7/http_credentials"
--http_heartbeat_interval="30secs" --initialize_driver_logging="true" --isolation="posix/cpu,posix/mem"
--launcher="posix" --launcher_dir="/mesos/build/src" --logbufsecs="0" --logging_level="INFO"
--max_completed_executors_per_framework="150" --oversubscribed_resources_interval="15secs"
--perf_duration="10secs" --perf_interval="1mins" --port="5051" --qos_correction_interval_min="0ns"
--quiet="false" --recover="reconnect" --recovery_timeout="15mins" --registration_backoff_factor="10ms"
--resources="cpus:2;gpus:0;mem:1024;disk:1024;ports:[31000-32000]" --revocable_cpu_low_priority="true"
--runtime_dir="/tmp/Endpoint_SlaveEndpointTest_NoAuthorizer_0_A63oJ7" --sandbox_directory="/mnt/mesos/sandbox"
--strict="true" --switch_user="true" --systemd_enable_support="true" --systemd_runtime_directory="/run/systemd/system"
--version="false" --work_dir="/tmp/Endpoint_SlaveEndpointTest_NoAuthorizer_0_5RCuVs"
I0513 00:30:54.824728 31897 credentials.hpp:86] Loading credential for authentication from
'/tmp/Endpoint_SlaveEndpointTest_NoAuthorizer_0_A63oJ7/credential'
I0513 00:30:54.824811 31897 slave.cpp:258] Agent using credential for: test-principal
I0513 00:30:54.824821 31897 credentials.hpp:37] Loading credentials for authentication from
'/tmp/Endpoint_SlaveEndpointTest_NoAuthorizer_0_A63oJ7/http_credentials'
I0513 00:30:54.824934 31897 http.cpp:975] Creating default 'basic' HTTP authenticator for
realm 'mesos-agent-executor'
I0513 00:30:54.824973 31897 http.cpp:996] Creating default 'jwt' HTTP authenticator for realm
'mesos-agent-executor'
I0513 00:30:54.825057 31897 http.cpp:975] Creating default 'basic' HTTP authenticator for
realm 'mesos-agent-readonly'
I0513 00:30:54.825098 31897 http.cpp:996] Creating default 'jwt' HTTP authenticator for realm
'mesos-agent-readonly'
I0513 00:30:54.825176 31897 http.cpp:975] Creating default 'basic' HTTP authenticator for
realm 'mesos-agent-readwrite'
I0513 00:30:54.825213 31897 http.cpp:996] Creating default 'jwt' HTTP authenticator for realm
'mesos-agent-readwrite'
I0513 00:30:54.825664 31897 slave.cpp:529] Agent resources: cpus(*):2; mem(*):1024; disk(*):1024;
ports(*):[31000-32000]
I0513 00:30:54.825691 31897 slave.cpp:537] Agent attributes: [  ]
I0513 00:30:54.825696 31897 slave.cpp:542] Agent hostname: 892c12bc5668
I0513 00:30:54.825778 31905 status_update_manager.cpp:177] Pausing sending status updates
I0513 00:30:54.826064 31906 state.cpp:62] Recovering state from '/tmp/Endpoint_SlaveEndpointTest_NoAuthorizer_0_5RCuVs/meta'
I0513 00:30:54.826182 31897 status_update_manager.cpp:203] Recovering status update manager
I0513 00:30:54.826288 31902 containerizer.cpp:608] Recovering containerizer
I0513 00:30:54.826689 31902 provisioner.cpp:410] Provisioner recovery complete
I0513 00:30:54.826794 31902 slave.cpp:5974] Finished recovery
I0513 00:30:54.827250 31902 slave.cpp:6156] Querying resource estimator for oversubscribable
resources
I0513 00:30:54.827404 31896 slave.cpp:6170] Received oversubscribable resources {} from the
resource estimator
I0513 00:30:54.828164 31906 process.cpp:3730] Handling HTTP event for process 'slave(758)'
with path: '/slave(758)/monitor/statistics'
I0513 00:30:54.828752 31892 http.cpp:1115] HTTP GET for /slave(758)/monitor/statistics from
172.17.0.3:45088
I0513 00:30:54.828795 31892 http.cpp:936] Authorizing principal 'test-principal' to GET the
'/monitor/statistics' endpoint
I0513 00:30:54.829877 31906 slave.cpp:794] Agent terminating
[       OK ] Endpoint/SlaveEndpointTest.NoAuthorizer/0 (12 ms)
[ RUN      ] Endpoint/SlaveEndpointTest.NoAuthorizer/1
I0513 00:30:54.835263 26017 containerizer.cpp:221] Using isolation: posix/cpu,posix/mem,filesystem/posix,network/cni
W0513 00:30:54.835621 26017 backend.cpp:76] Failed to create 'aufs' backend: AufsBackend requires
root privileges
W0513 00:30:54.835667 26017 backend.cpp:76] Failed to create 'bind' backend: BindBackend requires
root privileges
I0513 00:30:54.835685 26017 provisioner.cpp:249] Using default backend 'copy'
I0513 00:30:54.836360 26017 cluster.cpp:448] Creating default 'local' authorizer
I0513 00:30:54.836988 31895 slave.cpp:225] Mesos agent started on (759)@172.17.0.3:52454
I0513 00:30:54.837015 31895 slave.cpp:226] Flags at startup: --acls="" --appc_simple_discovery_uri_prefix="http://"
--appc_store_dir="/tmp/mesos/store/appc" --authenticate_http_executors="true" --authenticate_http_readonly="true"
--authenticate_http_readwrite="true" --authenticatee="crammd5" --authentication_backoff_factor="1secs"
--authorizer="local" --cgroups_cpu_enable_pids_and_tids_count="false" --cgroups_enable_cfs="false"
--cgroups_hierarchy="/sys/fs/cgroup" --cgroups_limit_swap="false" --cgroups_root="mesos" --container_disk_watch_interval="15secs"
--containerizers="mesos" --credential="/tmp/Endpoint_SlaveEndpointTest_NoAuthorizer_1_ZQIR3K/credential"
--default_role="*" --disk_watch_interval="1mins" --docker="docker" --docker_kill_orphans="true"
--docker_registry="https://registry-1.docker.io" --docker_remove_delay="6hrs" --docker_socket="/var/run/docker.sock"
--docker_stop_timeout="0ns" --docker_store_dir="/tmp/mesos/store/docker" --docker_volume_checkpoint_dir="/var/run/mesos/isolators/docker/volume"
--enforce_container_disk_quota="false" --executor_registration_timeout="1mins" --executor_secret_key="/tmp/Endpoint_SlaveEndpointTest_NoAuthorizer_1_ZQIR3K/executor_secret_key"
--executor_shutdown_grace_period="5secs" --fetcher_cache_dir="/tmp/Endpoint_SlaveEndpointTest_NoAuthorizer_1_ZQIR3K/fetch"
--fetcher_cache_size="2GB" --frameworks_home="" --gc_delay="1weeks" --gc_disk_headroom="0.1"
--hadoop_home="" --help="false" --hostname_lookup="true" --http_command_executor="false" --http_credentials="/tmp/Endpoint_SlaveEndpointTest_NoAuthorizer_1_ZQIR3K/http_credentials"
--http_heartbeat_interval="30secs" --initialize_driver_logging="true" --isolation="posix/cpu,posix/mem"
--launcher="posix" --launcher_dir="/mesos/build/src" --logbufsecs="0" --logging_level="INFO"
--max_completed_executors_per_framework="150" --oversubscribed_resources_interval="15secs"
--perf_duration="10secs" --perf_interval="1mins" --port="5051" --qos_correction_interval_min="0ns"
--quiet="false" --recover="reconnect" --recovery_timeout="15mins" --registration_backoff_factor="10ms"
--resources="cpus:2;gpus:0;mem:1024;disk:1024;ports:[31000-32000]" --revocable_cpu_low_priority="true"
--runtime_dir="/tmp/Endpoint_SlaveEndpointTest_NoAuthorizer_1_ZQIR3K" --sandbox_directory="/mnt/mesos/sandbox"
--strict="true" --switch_user="true" --systemd_enable_support="true" --systemd_runtime_directory="/run/systemd/system"
--version="false" --work_dir="/tmp/Endpoint_SlaveEndpointTest_NoAuthorizer_1_9wUVd6"
I0513 00:30:54.837260 31895 credentials.hpp:86] Loading credential for authentication from
'/tmp/Endpoint_SlaveEndpointTest_NoAuthorizer_1_ZQIR3K/credential'
I0513 00:30:54.837366 31895 slave.cpp:258] Agent using credential for: test-principal
I0513 00:30:54.837379 31895 credentials.hpp:37] Loading credentials for authentication from
'/tmp/Endpoint_SlaveEndpointTest_NoAuthorizer_1_ZQIR3K/http_credentials'
I0513 00:30:54.837576 31895 http.cpp:975] Creating default 'basic' HTTP authenticator for
realm 'mesos-agent-executor'
I0513 00:30:54.837642 31895 http.cpp:996] Creating default 'jwt' HTTP authenticator for realm
'mesos-agent-executor'
I0513 00:30:54.837743 31895 http.cpp:975] Creating default 'basic' HTTP authenticator for
realm 'mesos-agent-readonly'
I0513 00:30:54.837806 31895 http.cpp:996] Creating default 'jwt' HTTP authenticator for realm
'mesos-agent-readonly'
I0513 00:30:54.837889 31895 http.cpp:975] Creating default 'basic' HTTP authenticator for
realm 'mesos-agent-readwrite'
I0513 00:30:54.837952 31895 http.cpp:996] Creating default 'jwt' HTTP authenticator for realm
'mesos-agent-readwrite'
I0513 00:30:54.838395 31895 slave.cpp:529] Agent resources: cpus(*):2; mem(*):1024; disk(*):1024;
ports(*):[31000-32000]
I0513 00:30:54.838423 31895 slave.cpp:537] Agent attributes: [  ]
I0513 00:30:54.838430 31895 slave.cpp:542] Agent hostname: 892c12bc5668
I0513 00:30:54.838507 31892 status_update_manager.cpp:177] Pausing sending status updates
I0513 00:30:54.838842 31894 state.cpp:62] Recovering state from '/tmp/Endpoint_SlaveEndpointTest_NoAuthorizer_1_9wUVd6/meta'
I0513 00:30:54.839015 31895 status_update_manager.cpp:203] Recovering status update manager
I0513 00:30:54.839087 31895 containerizer.cpp:608] Recovering containerizer
I0513 00:30:54.839489 31895 provisioner.cpp:410] Provisioner recovery complete
I0513 00:30:54.839583 31895 slave.cpp:5974] Finished recovery
I0513 00:30:54.840095 31895 slave.cpp:6156] Querying resource estimator for oversubscribable
resources
I0513 00:30:54.840190 31895 slave.cpp:6170] Received oversubscribable resources {} from the
resource estimator
I0513 00:30:54.841109 31903 process.cpp:3730] Handling HTTP event for process 'slave(759)'
with path: '/slave(759)/monitor/statistics.json'
I0513 00:30:54.841792 31901 http.cpp:1115] HTTP GET for /slave(759)/monitor/statistics.json
from 172.17.0.3:45089
I0513 00:30:54.841828 31901 http.cpp:936] Authorizing principal 'test-principal' to GET the
'/monitor/statistics.json' endpoint
I0513 00:30:54.842973 26017 slave.cpp:794] Agent terminating
[       OK ] Endpoint/SlaveEndpointTest.NoAuthorizer/1 (13 ms)
[ RUN      ] Endpoint/SlaveEndpointTest.NoAuthorizer/2
I0513 00:30:54.848847 26017 containerizer.cpp:221] Using isolation: posix/cpu,posix/mem,filesystem/posix,network/cni
W0513 00:30:54.849208 26017 backend.cpp:76] Failed to create 'aufs' backend: AufsBackend requires
root privileges
W0513 00:30:54.849252 26017 backend.cpp:76] Failed to create 'bind' backend: BindBackend requires
root privileges
I0513 00:30:54.849270 26017 provisioner.cpp:249] Using default backend 'copy'
I0513 00:30:54.849956 26017 cluster.cpp:448] Creating default 'local' authorizer
I0513 00:30:54.850554 31903 slave.cpp:225] Mesos agent started on (760)@172.17.0.3:52454
I0513 00:30:54.850584 31903 slave.cpp:226] Flags at startup: --acls="" --appc_simple_discovery_uri_prefix="http://"
--appc_store_dir="/tmp/mesos/store/appc" --authenticate_http_executors="true" --authenticate_http_readonly="true"
--authenticate_http_readwrite="true" --authenticatee="crammd5" --authentication_backoff_factor="1secs"
--authorizer="local" --cgroups_cpu_enable_pids_and_tids_count="false" --cgroups_enable_cfs="false"
--cgroups_hierarchy="/sys/fs/cgroup" --cgroups_limit_swap="false" --cgroups_root="mesos" --container_disk_watch_interval="15secs"
--containerizers="mesos" --credential="/tmp/Endpoint_SlaveEndpointTest_NoAuthorizer_2_7jlWwo/credential"
--default_role="*" --disk_watch_interval="1mins" --docker="docker" --docker_kill_orphans="true"
--docker_registry="https://registry-1.docker.io" --docker_remove_delay="6hrs" --docker_socket="/var/run/docker.sock"
--docker_stop_timeout="0ns" --docker_store_dir="/tmp/mesos/store/docker" --docker_volume_checkpoint_dir="/var/run/mesos/isolators/docker/volume"
--enforce_container_disk_quota="false" --executor_registration_timeout="1mins" --executor_secret_key="/tmp/Endpoint_SlaveEndpointTest_NoAuthorizer_2_7jlWwo/executor_secret_key"
--executor_shutdown_grace_period="5secs" --fetcher_cache_dir="/tmp/Endpoint_SlaveEndpointTest_NoAuthorizer_2_7jlWwo/fetch"
--fetcher_cache_size="2GB" --frameworks_home="" --gc_delay="1weeks" --gc_disk_headroom="0.1"
--hadoop_home="" --help="false" --hostname_lookup="true" --http_command_executor="false" --http_credentials="/tmp/Endpoint_SlaveEndpointTest_NoAuthorizer_2_7jlWwo/http_credentials"
--http_heartbeat_interval="30secs" --initialize_driver_logging="true" --isolation="posix/cpu,posix/mem"
--launcher="posix" --launcher_dir="/mesos/build/src" --logbufsecs="0" --logging_level="INFO"
--max_completed_executors_per_framework="150" --oversubscribed_resources_interval="15secs"
--perf_duration="10secs" --perf_interval="1mins" --port="5051" --qos_correction_interval_min="0ns"
--quiet="false" --recover="reconnect" --recovery_timeout="15mins" --registration_backoff_factor="10ms"
--resources="cpus:2;gpus:0;mem:1024;disk:1024;ports:[31000-32000]" --revocable_cpu_low_priority="true"
--runtime_dir="/tmp/Endpoint_SlaveEndpointTest_NoAuthorizer_2_7jlWwo" --sandbox_directory="/mnt/mesos/sandbox"
--strict="true" --switch_user="true" --systemd_enable_support="true" --systemd_runtime_directory="/run/systemd/system"
--version="false" --work_dir="/tmp/Endpoint_SlaveEndpointTest_NoAuthorizer_2_2nfOEJ"
I0513 00:30:54.850929 31903 credentials.hpp:86] Loading credential for authentication from
'/tmp/Endpoint_SlaveEndpointTest_NoAuthorizer_2_7jlWwo/credential'
I0513 00:30:54.851074 31903 slave.cpp:258] Agent using credential for: test-principal
I0513 00:30:54.851086 31903 credentials.hpp:37] Loading credentials for authentication from
'/tmp/Endpoint_SlaveEndpointTest_NoAuthorizer_2_7jlWwo/http_credentials'
I0513 00:30:54.851279 31903 http.cpp:975] Creating default 'basic' HTTP authenticator for
realm 'mesos-agent-executor'
I0513 00:30:54.851325 31903 http.cpp:996] Creating default 'jwt' HTTP authenticator for realm
'mesos-agent-executor'
I0513 00:30:54.851477 31903 http.cpp:975] Creating default 'basic' HTTP authenticator for
realm 'mesos-agent-readonly'
I0513 00:30:54.851528 31903 http.cpp:996] Creating default 'jwt' HTTP authenticator for realm
'mesos-agent-readonly'
I0513 00:30:54.851603 31903 http.cpp:975] Creating default 'basic' HTTP authenticator for
realm 'mesos-agent-readwrite'
I0513 00:30:54.851642 31903 http.cpp:996] Creating default 'jwt' HTTP authenticator for realm
'mesos-agent-readwrite'
I0513 00:30:54.852185 31903 slave.cpp:529] Agent resources: cpus(*):2; mem(*):1024; disk(*):1024;
ports(*):[31000-32000]
I0513 00:30:54.852219 31903 slave.cpp:537] Agent attributes: [  ]
I0513 00:30:54.852223 31903 slave.cpp:542] Agent hostname: 892c12bc5668
I0513 00:30:54.852308 31895 status_update_manager.cpp:177] Pausing sending status updates
I0513 00:30:54.852712 31899 state.cpp:62] Recovering state from '/tmp/Endpoint_SlaveEndpointTest_NoAuthorizer_2_2nfOEJ/meta'
I0513 00:30:54.852839 31902 status_update_manager.cpp:203] Recovering status update manager
I0513 00:30:54.852936 31895 containerizer.cpp:608] Recovering containerizer
I0513 00:30:54.853538 31896 provisioner.cpp:410] Provisioner recovery complete
I0513 00:30:54.853689 31900 slave.cpp:5974] Finished recovery
I0513 00:30:54.854105 31900 slave.cpp:6156] Querying resource estimator for oversubscribable
resources
I0513 00:30:54.854239 31899 slave.cpp:6170] Received oversubscribable resources {} from the
resource estimator
I0513 00:30:54.854930 31899 process.cpp:3730] Handling HTTP event for process 'slave(760)'
with path: '/slave(760)/containers'
I0513 00:30:54.855475 31897 http.cpp:1115] HTTP GET for /slave(760)/containers from 172.17.0.3:45090
I0513 00:30:54.855512 31897 http.cpp:936] Authorizing principal 'test-principal' to GET the
'/containers' endpoint
I0513 00:30:54.856683 31899 slave.cpp:794] Agent terminating
[       OK ] Endpoint/SlaveEndpointTest.NoAuthorizer/2 (13 ms)
[----------] 9 tests from Endpoint/SlaveEndpointTest (122 ms total)

[----------] Global test environment tear-down
[==========] 1535 tests from 169 test cases ran. (227489 ms total)
[  PASSED  ] 1534 tests.
[  FAILED  ] 1 test, listed below:
[  FAILED  ] OversubscriptionTest.RescindRevocableOfferWithIncreasedRevocable

 1 FAILED TEST
  YOU HAVE 19 DISABLED TESTS

E0513 00:30:54.909181 31907 process.cpp:950] Failed to accept socket: future discarded
make[3]: *** [CMakeFiles/check] Error 1
make[3]: Leaving directory `/mesos/build'
make[2]: *** [CMakeFiles/check.dir/all] Error 2
make[2]: Leaving directory `/mesos/build'
make[1]: *** [CMakeFiles/check.dir/rule] Error 2
make[1]: Leaving directory `/mesos/build'
make: *** [check] Error 2
+ docker rmi mesos-1494632987-30159
Untagged: mesos-1494632987-30159:latest
Deleted: sha256:62481323431220dc3ce89efd91abf20ed39f636684eccc7f7397c861061f148d
Deleted: sha256:f08803cca4acaa72c6235b39780b2aef0052224753d731dad4b59550caaf86c2
Deleted: sha256:7fe9631692042adf5fcc13eedccd8cadc8010a8f960cc9134abc83f26d8d4f46
Deleted: sha256:f738c6a7acabc6d159b5a20c79ddb3a08b5d7d914150ebf287f440a930405a25
Deleted: sha256:bf6ad9026a77c59b7eed6ec19ee9005f3ee74d100b668dcf749b9fd7610b2231
Deleted: sha256:cf6688d04ac94bd67c67a5f46d6343806d1f46b9462107a7ffdb2cdd72ef3b92
Deleted: sha256:213faec4f6222b8093b695efd1bf0e80749c657dae9160b5783a6a6f2af7103f
Deleted: sha256:941973c24ed49371683572e4aee07a635b29b669fe9924d22bb3a9477a756ac3
Deleted: sha256:bd72d6cb5f3e70662261aab26a94e8b2bfc8eccfe70cb582adc88756ea115f5a
Deleted: sha256:ce3ce8bc0ea574bd5a5d93a1a80f1f518abde9ed1b9ea39c47cf9cdf8ad9be08
Deleted: sha256:0a7173aa9fcb65a263780f0bbdca8fcfc8615304dbeaeb8bc2e1c8bd2870e8d3
Deleted: sha256:f3d07a4ee327ea7f6af881ee86a660dc25593a21a1fc36234f4f576d39cf5829
Deleted: sha256:bdb6bfcdf47115c57b97e4e7377f65b4125a4c7b6bdf3fd4a91eeeedf7aa757f
Deleted: sha256:b42f55027024842d705fc5fe25389a59a02cf0dfb2d6a301baaae59ff1d45e7e
Deleted: sha256:7cc282ef09d895fc5c6b76e145dd9a863e09e56a78690ca7a8483b5811db55c9
Deleted: sha256:02b7b0c2fb4086f6c20161563f67a6ea1382525de08266453fcb5c86279bf02a
Deleted: sha256:82ddbff35619845d483693a132aea0fbb07126a884676f6c4787ce9624bb5355
Deleted: sha256:5bc74be011c1122c5a39931048835d948b1e85cd91d6723e5080e246c46bb534
Deleted: sha256:724d358c67d1d942cb9c81894a180c0e63c7083f3f8be297fb8cd81769e650d3
Deleted: sha256:a95b4215efe2b2a96a52028ea0f90328b91c3ad056505ac6cedb6c6d60ab211c
Deleted: sha256:9df85bf1963b9a878bfb9cdca3bd7a92755ab98f7556214b4cfc3cc31d4550bb
Deleted: sha256:e086e14bcd738fc3c2dba98c440cb2f5f325cf8767850a5f57ec5b93ed81ca6e
Deleted: sha256:b9987110834288ca02dd4c830730bfd1eeb078e4f00ecd8efb186ad62c7ec216
Deleted: sha256:60577b6eb225934919faf052aa3a39d8d998f27eec1588a3bb7ce46c90434a13
Build step 'Execute shell' marked build as failure
Not sending mail to unregistered user xujyan@apple.com

Mime
View raw message