mesos-builds mailing list archives

Site index · List index
Message view « Date » · « Thread »
Top « Date » · « Thread »
From Apache Jenkins Server <jenk...@builds.apache.org>
Subject Build failed in Jenkins: Mesos-Buildbot » autotools,gcc,--verbose,GLOG_v=1 MESOS_VERBOSE=1,ubuntu:14.04,(docker||Hadoop)&&(!ubuntu-us1)&&(!ubuntu-eu2) #3734
Date Sat, 27 May 2017 03:16:44 GMT
See <https://builds.apache.org/job/Mesos-Buildbot/BUILDTOOL=autotools,COMPILER=gcc,CONFIGURATION=--verbose,ENVIRONMENT=GLOG_v=1%20MESOS_VERBOSE=1,OS=ubuntu%3A14.04,label_exp=(docker%7C%7CHadoop)&&(!ubuntu-us1)&&(!ubuntu-eu2)/3734/display/redirect?page=changes>

Changes:

[bmahler] Added a test for the optional executor reconnect retry in the agent.

[bmahler] Added a test for shutting down executors that re-register.

[bmahler] Added a test for ignoring executor re-registrations.

------------------------------------------
[...truncated 27.51 MB...]
[ RUN      ] Endpoint/SlaveEndpointTest.AuthorizedRequest/2
I0527 03:16:28.971745  4670 containerizer.cpp:230] Using isolation: posix/cpu,posix/mem,filesystem/posix,network/cni,environment_secret
W0527 03:16:28.972306  4670 backend.cpp:76] Failed to create 'aufs' backend: AufsBackend requires
root privileges
W0527 03:16:28.972405  4670 backend.cpp:76] Failed to create 'bind' backend: BindBackend requires
root privileges
I0527 03:16:28.972437  4670 provisioner.cpp:255] Using default backend 'copy'
I0527 03:16:28.976214  4700 slave.cpp:232] Mesos agent started on (751)@172.17.0.2:47759
I0527 03:16:28.976253  4700 slave.cpp:233] Flags at startup: --acls="" --appc_simple_discovery_uri_prefix="http://"
--appc_store_dir="/tmp/mesos/store/appc" --authenticate_http_readonly="true" --authenticate_http_readwrite="true"
--authenticatee="crammd5" --authentication_backoff_factor="1secs" --authorizer="local" --cgroups_cpu_enable_pids_and_tids_count="false"
--cgroups_enable_cfs="false" --cgroups_hierarchy="/sys/fs/cgroup" --cgroups_limit_swap="false"
--cgroups_root="mesos" --container_disk_watch_interval="15secs" --containerizers="mesos" --credential="/tmp/Endpoint_SlaveEndpointTest_AuthorizedRequest_2_9huL7i/credential"
--default_role="*" --disk_watch_interval="1mins" --docker="docker" --docker_kill_orphans="true"
--docker_registry="https://registry-1.docker.io" --docker_remove_delay="6hrs" --docker_socket="/var/run/docker.sock"
--docker_stop_timeout="0ns" --docker_store_dir="/tmp/mesos/store/docker" --docker_volume_checkpoint_dir="/var/run/mesos/isolators/docker/volume"
--enforce_container_disk_quota="false" --executor_registration_timeout="1mins" --executor_reregistration_timeout="2secs"
--executor_shutdown_grace_period="5secs" --fetcher_cache_dir="/tmp/Endpoint_SlaveEndpointTest_AuthorizedRequest_2_9huL7i/fetch"
--fetcher_cache_size="2GB" --frameworks_home="" --gc_delay="1weeks" --gc_disk_headroom="0.1"
--hadoop_home="" --help="false" --hostname_lookup="true" --http_command_executor="false" --http_credentials="/tmp/Endpoint_SlaveEndpointTest_AuthorizedRequest_2_9huL7i/http_credentials"
--http_heartbeat_interval="30secs" --initialize_driver_logging="true" --isolation="posix/cpu,posix/mem"
--launcher="posix" --launcher_dir="/mesos/mesos-1.4.0/_build/src" --logbufsecs="0" --logging_level="INFO"
--max_completed_executors_per_framework="150" --oversubscribed_resources_interval="15secs"
--perf_duration="10secs" --perf_interval="1mins" --port="5051" --qos_correction_interval_min="0ns"
--quiet="false" --recover="reconnect" --recovery_timeout="15mins" --registration_backoff_factor="10ms"
--resources="cpus:2;gpus:0;mem:1024;disk:1024;ports:[31000-32000]" --revocable_cpu_low_priority="true"
--runtime_dir="/tmp/Endpoint_SlaveEndpointTest_AuthorizedRequest_2_9huL7i" --sandbox_directory="/mnt/mesos/sandbox"
--strict="true" --switch_user="true" --systemd_enable_support="true" --systemd_runtime_directory="/run/systemd/system"
--version="false" --work_dir="/tmp/Endpoint_SlaveEndpointTest_AuthorizedRequest_2_VSbhmr"
I0527 03:16:28.976707  4700 credentials.hpp:86] Loading credential for authentication from
'/tmp/Endpoint_SlaveEndpointTest_AuthorizedRequest_2_9huL7i/credential'
I0527 03:16:28.976932  4700 slave.cpp:265] Agent using credential for: test-principal
I0527 03:16:28.976953  4700 credentials.hpp:37] Loading credentials for authentication from
'/tmp/Endpoint_SlaveEndpointTest_AuthorizedRequest_2_9huL7i/http_credentials'
I0527 03:16:28.977219  4700 http.cpp:975] Creating default 'basic' HTTP authenticator for
realm 'mesos-agent-readonly'
I0527 03:16:28.977474  4700 http.cpp:975] Creating default 'basic' HTTP authenticator for
realm 'mesos-agent-readwrite'
I0527 03:16:28.979188  4700 slave.cpp:536] Agent resources: cpus(*):2; mem(*):1024; disk(*):1024;
ports(*):[31000-32000]
I0527 03:16:28.979260  4700 slave.cpp:544] Agent attributes: [  ]
I0527 03:16:28.979274  4700 slave.cpp:549] Agent hostname: 25b1c1662401
I0527 03:16:28.979426  4692 status_update_manager.cpp:177] Pausing sending status updates
I0527 03:16:28.980773  4694 state.cpp:62] Recovering state from '/tmp/Endpoint_SlaveEndpointTest_AuthorizedRequest_2_VSbhmr/meta'
I0527 03:16:28.981127  4702 status_update_manager.cpp:203] Recovering status update manager
I0527 03:16:28.981351  4699 containerizer.cpp:582] Recovering containerizer
I0527 03:16:28.983536  4693 provisioner.cpp:416] Provisioner recovery complete
I0527 03:16:28.983978  4694 slave.cpp:6083] Finished recovery
I0527 03:16:28.984525  4694 slave.cpp:6265] Querying resource estimator for oversubscribable
resources
I0527 03:16:28.984797  4692 slave.cpp:6279] Received oversubscribable resources {} from the
resource estimator
I0527 03:16:28.988348  4693 process.cpp:3730] Handling HTTP event for process 'slave(751)'
with path: '/slave(751)/containers'
I0527 03:16:28.989905  4703 http.cpp:1115] HTTP GET for /slave(751)/containers from 172.17.0.2:45278
I0527 03:16:28.989984  4703 http.cpp:936] Authorizing principal 'test-principal' to GET the
'/containers' endpoint
I0527 03:16:28.993700  4696 slave.cpp:801] Agent terminating
[       OK ] Endpoint/SlaveEndpointTest.AuthorizedRequest/2 (53 ms)
[ RUN      ] Endpoint/SlaveEndpointTest.UnauthorizedRequest/0
I0527 03:16:29.023564  4670 containerizer.cpp:230] Using isolation: posix/cpu,posix/mem,filesystem/posix,network/cni,environment_secret
W0527 03:16:29.024067  4670 backend.cpp:76] Failed to create 'aufs' backend: AufsBackend requires
root privileges
W0527 03:16:29.024235  4670 backend.cpp:76] Failed to create 'bind' backend: BindBackend requires
root privileges
I0527 03:16:29.024276  4670 provisioner.cpp:255] Using default backend 'copy'
I0527 03:16:29.029417  4698 slave.cpp:232] Mesos agent started on (752)@172.17.0.2:47759
I0527 03:16:29.029445  4698 slave.cpp:233] Flags at startup: --acls="" --appc_simple_discovery_uri_prefix="http://"
--appc_store_dir="/tmp/mesos/store/appc" --authenticate_http_readonly="true" --authenticate_http_readwrite="true"
--authenticatee="crammd5" --authentication_backoff_factor="1secs" --authorizer="local" --cgroups_cpu_enable_pids_and_tids_count="false"
--cgroups_enable_cfs="false" --cgroups_hierarchy="/sys/fs/cgroup" --cgroups_limit_swap="false"
--cgroups_root="mesos" --container_disk_watch_interval="15secs" --containerizers="mesos" --credential="/tmp/Endpoint_SlaveEndpointTest_UnauthorizedRequest_0_JBUFDM/credential"
--default_role="*" --disk_watch_interval="1mins" --docker="docker" --docker_kill_orphans="true"
--docker_registry="https://registry-1.docker.io" --docker_remove_delay="6hrs" --docker_socket="/var/run/docker.sock"
--docker_stop_timeout="0ns" --docker_store_dir="/tmp/mesos/store/docker" --docker_volume_checkpoint_dir="/var/run/mesos/isolators/docker/volume"
--enforce_container_disk_quota="false" --executor_registration_timeout="1mins" --executor_reregistration_timeout="2secs"
--executor_shutdown_grace_period="5secs" --fetcher_cache_dir="/tmp/Endpoint_SlaveEndpointTest_UnauthorizedRequest_0_JBUFDM/fetch"
--fetcher_cache_size="2GB" --frameworks_home="" --gc_delay="1weeks" --gc_disk_headroom="0.1"
--hadoop_home="" --help="false" --hostname_lookup="true" --http_command_executor="false" --http_credentials="/tmp/Endpoint_SlaveEndpointTest_UnauthorizedRequest_0_JBUFDM/http_credentials"
--http_heartbeat_interval="30secs" --initialize_driver_logging="true" --isolation="posix/cpu,posix/mem"
--launcher="posix" --launcher_dir="/mesos/mesos-1.4.0/_build/src" --logbufsecs="0" --logging_level="INFO"
--max_completed_executors_per_framework="150" --oversubscribed_resources_interval="15secs"
--perf_duration="10secs" --perf_interval="1mins" --port="5051" --qos_correction_interval_min="0ns"
--quiet="false" --recover="reconnect" --recovery_timeout="15mins" --registration_backoff_factor="10ms"
--resources="cpus:2;gpus:0;mem:1024;disk:1024;ports:[31000-32000]" --revocable_cpu_low_priority="true"
--runtime_dir="/tmp/Endpoint_SlaveEndpointTest_UnauthorizedRequest_0_JBUFDM" --sandbox_directory="/mnt/mesos/sandbox"
--strict="true" --switch_user="true" --systemd_enable_support="true" --systemd_runtime_directory="/run/systemd/system"
--version="false" --work_dir="/tmp/Endpoint_SlaveEndpointTest_UnauthorizedRequest_0_hc1BJU"
I0527 03:16:29.029981  4698 credentials.hpp:86] Loading credential for authentication from
'/tmp/Endpoint_SlaveEndpointTest_UnauthorizedRequest_0_JBUFDM/credential'
I0527 03:16:29.030197  4698 slave.cpp:265] Agent using credential for: test-principal
I0527 03:16:29.030223  4698 credentials.hpp:37] Loading credentials for authentication from
'/tmp/Endpoint_SlaveEndpointTest_UnauthorizedRequest_0_JBUFDM/http_credentials'
I0527 03:16:29.030560  4698 http.cpp:975] Creating default 'basic' HTTP authenticator for
realm 'mesos-agent-readonly'
I0527 03:16:29.030772  4698 http.cpp:975] Creating default 'basic' HTTP authenticator for
realm 'mesos-agent-readwrite'
I0527 03:16:29.032503  4698 slave.cpp:536] Agent resources: cpus(*):2; mem(*):1024; disk(*):1024;
ports(*):[31000-32000]
I0527 03:16:29.032668  4698 slave.cpp:544] Agent attributes: [  ]
I0527 03:16:29.032694  4698 slave.cpp:549] Agent hostname: 25b1c1662401
I0527 03:16:29.032886  4701 status_update_manager.cpp:177] Pausing sending status updates
I0527 03:16:29.034504  4703 state.cpp:62] Recovering state from '/tmp/Endpoint_SlaveEndpointTest_UnauthorizedRequest_0_hc1BJU/meta'
I0527 03:16:29.034907  4689 status_update_manager.cpp:203] Recovering status update manager
I0527 03:16:29.035167  4692 containerizer.cpp:582] Recovering containerizer
I0527 03:16:29.037159  4702 provisioner.cpp:416] Provisioner recovery complete
I0527 03:16:29.037786  4703 slave.cpp:6083] Finished recovery
I0527 03:16:29.038440  4703 slave.cpp:6265] Querying resource estimator for oversubscribable
resources
I0527 03:16:29.038811  4704 slave.cpp:6279] Received oversubscribable resources {} from the
resource estimator
I0527 03:16:29.042052  4701 process.cpp:3730] Handling HTTP event for process 'slave(752)'
with path: '/slave(752)/monitor/statistics'
I0527 03:16:29.043951  4698 http.cpp:1115] HTTP GET for /slave(752)/monitor/statistics from
172.17.0.2:45289
I0527 03:16:29.044067  4698 http.cpp:936] Authorizing principal 'test-principal' to GET the
'/monitor/statistics' endpoint
I0527 03:16:29.047276  4694 slave.cpp:801] Agent terminating
[       OK ] Endpoint/SlaveEndpointTest.UnauthorizedRequest/0 (87 ms)
[ RUN      ] Endpoint/SlaveEndpointTest.UnauthorizedRequest/1
I0527 03:16:29.111421  4670 containerizer.cpp:230] Using isolation: posix/cpu,posix/mem,filesystem/posix,network/cni,environment_secret
W0527 03:16:29.111959  4670 backend.cpp:76] Failed to create 'aufs' backend: AufsBackend requires
root privileges
W0527 03:16:29.112063  4670 backend.cpp:76] Failed to create 'bind' backend: BindBackend requires
root privileges
I0527 03:16:29.112100  4670 provisioner.cpp:255] Using default backend 'copy'
I0527 03:16:29.115429  4696 slave.cpp:232] Mesos agent started on (753)@172.17.0.2:47759
I0527 03:16:29.115455  4696 slave.cpp:233] Flags at startup: --acls="" --appc_simple_discovery_uri_prefix="http://"
--appc_store_dir="/tmp/mesos/store/appc" --authenticate_http_readonly="true" --authenticate_http_readwrite="true"
--authenticatee="crammd5" --authentication_backoff_factor="1secs" --authorizer="local" --cgroups_cpu_enable_pids_and_tids_count="false"
--cgroups_enable_cfs="false" --cgroups_hierarchy="/sys/fs/cgroup" --cgroups_limit_swap="false"
--cgroups_root="mesos" --container_disk_watch_interval="15secs" --containerizers="mesos" --credential="/tmp/Endpoint_SlaveEndpointTest_UnauthorizedRequest_1_cNw1Yg/credential"
--default_role="*" --disk_watch_interval="1mins" --docker="docker" --docker_kill_orphans="true"
--docker_registry="https://registry-1.docker.io" --docker_remove_delay="6hrs" --docker_socket="/var/run/docker.sock"
--docker_stop_timeout="0ns" --docker_store_dir="/tmp/mesos/store/docker" --docker_volume_checkpoint_dir="/var/run/mesos/isolators/docker/volume"
--enforce_container_disk_quota="false" --executor_registration_timeout="1mins" --executor_reregistration_timeout="2secs"
--executor_shutdown_grace_period="5secs" --fetcher_cache_dir="/tmp/Endpoint_SlaveEndpointTest_UnauthorizedRequest_1_cNw1Yg/fetch"
--fetcher_cache_size="2GB" --frameworks_home="" --gc_delay="1weeks" --gc_disk_headroom="0.1"
--hadoop_home="" --help="false" --hostname_lookup="true" --http_command_executor="false" --http_credentials="/tmp/Endpoint_SlaveEndpointTest_UnauthorizedRequest_1_cNw1Yg/http_credentials"
--http_heartbeat_interval="30secs" --initialize_driver_logging="true" --isolation="posix/cpu,posix/mem"
--launcher="posix" --launcher_dir="/mesos/mesos-1.4.0/_build/src" --logbufsecs="0" --logging_level="INFO"
--max_completed_executors_per_framework="150" --oversubscribed_resources_interval="15secs"
--perf_duration="10secs" --perf_interval="1mins" --port="5051" --qos_correction_interval_min="0ns"
--quiet="false" --recover="reconnect" --recovery_timeout="15mins" --registration_backoff_factor="10ms"
--resources="cpus:2;gpus:0;mem:1024;disk:1024;ports:[31000-32000]" --revocable_cpu_low_priority="true"
--runtime_dir="/tmp/Endpoint_SlaveEndpointTest_UnauthorizedRequest_1_cNw1Yg" --sandbox_directory="/mnt/mesos/sandbox"
--strict="true" --switch_user="true" --systemd_enable_support="true" --systemd_runtime_directory="/run/systemd/system"
--version="false" --work_dir="/tmp/Endpoint_SlaveEndpointTest_UnauthorizedRequest_1_WLCIQo"
I0527 03:16:29.115877  4696 credentials.hpp:86] Loading credential for authentication from
'/tmp/Endpoint_SlaveEndpointTest_UnauthorizedRequest_1_cNw1Yg/credential'
I0527 03:16:29.116037  4696 slave.cpp:265] Agent using credential for: test-principal
I0527 03:16:29.116055  4696 credentials.hpp:37] Loading credentials for authentication from
'/tmp/Endpoint_SlaveEndpointTest_UnauthorizedRequest_1_cNw1Yg/http_credentials'
I0527 03:16:29.116281  4696 http.cpp:975] Creating default 'basic' HTTP authenticator for
realm 'mesos-agent-readonly'
I0527 03:16:29.116430  4696 http.cpp:975] Creating default 'basic' HTTP authenticator for
realm 'mesos-agent-readwrite'
I0527 03:16:29.117662  4696 slave.cpp:536] Agent resources: cpus(*):2; mem(*):1024; disk(*):1024;
ports(*):[31000-32000]
I0527 03:16:29.117735  4696 slave.cpp:544] Agent attributes: [  ]
I0527 03:16:29.117754  4696 slave.cpp:549] Agent hostname: 25b1c1662401
I0527 03:16:29.117898  4704 status_update_manager.cpp:177] Pausing sending status updates
I0527 03:16:29.119472  4691 state.cpp:62] Recovering state from '/tmp/Endpoint_SlaveEndpointTest_UnauthorizedRequest_1_WLCIQo/meta'
I0527 03:16:29.119843  4698 status_update_manager.cpp:203] Recovering status update manager
I0527 03:16:29.120046  4693 containerizer.cpp:582] Recovering containerizer
I0527 03:16:29.121681  4691 provisioner.cpp:416] Provisioner recovery complete
I0527 03:16:29.122088  4700 slave.cpp:6083] Finished recovery
I0527 03:16:29.131625  4700 slave.cpp:6265] Querying resource estimator for oversubscribable
resources
I0527 03:16:29.132097  4701 slave.cpp:6279] Received oversubscribable resources {} from the
resource estimator
I0527 03:16:29.135574  4702 process.cpp:3730] Handling HTTP event for process 'slave(753)'
with path: '/slave(753)/monitor/statistics.json'
I0527 03:16:29.137080  4700 http.cpp:1115] HTTP GET for /slave(753)/monitor/statistics.json
from 172.17.0.2:45302
I0527 03:16:29.137182  4700 http.cpp:936] Authorizing principal 'test-principal' to GET the
'/monitor/statistics.json' endpoint
I0527 03:16:29.139724  4693 slave.cpp:801] Agent terminating
[       OK ] Endpoint/SlaveEndpointTest.UnauthorizedRequest/1 (40 ms)
[ RUN      ] Endpoint/SlaveEndpointTest.UnauthorizedRequest/2
I0527 03:16:29.153190  4670 containerizer.cpp:230] Using isolation: posix/cpu,posix/mem,filesystem/posix,network/cni,environment_secret
W0527 03:16:29.153842  4670 backend.cpp:76] Failed to create 'aufs' backend: AufsBackend requires
root privileges
W0527 03:16:29.153966  4670 backend.cpp:76] Failed to create 'bind' backend: BindBackend requires
root privileges
I0527 03:16:29.154007  4670 provisioner.cpp:255] Using default backend 'copy'
I0527 03:16:29.158365  4701 slave.cpp:232] Mesos agent started on (754)@172.17.0.2:47759
I0527 03:16:29.158390  4701 slave.cpp:233] Flags at startup: --acls="" --appc_simple_discovery_uri_prefix="http://"
--appc_store_dir="/tmp/mesos/store/appc" --authenticate_http_readonly="true" --authenticate_http_readwrite="true"
--authenticatee="crammd5" --authentication_backoff_factor="1secs" --authorizer="local" --cgroups_cpu_enable_pids_and_tids_count="false"
--cgroups_enable_cfs="false" --cgroups_hierarchy="/sys/fs/cgroup" --cgroups_limit_swap="false"
--cgroups_root="mesos" --container_disk_watch_interval="15secs" --containerizers="mesos" --credential="/tmp/Endpoint_SlaveEndpointTest_UnauthorizedRequest_2_IEntTL/credential"
--default_role="*" --disk_watch_interval="1mins" --docker="docker" --docker_kill_orphans="true"
--docker_registry="https://registry-1.docker.io" --docker_remove_delay="6hrs" --docker_socket="/var/run/docker.sock"
--docker_stop_timeout="0ns" --docker_store_dir="/tmp/mesos/store/docker" --docker_volume_checkpoint_dir="/var/run/mesos/isolators/docker/volume"
--enforce_container_disk_quota="false" --executor_registration_timeout="1mins" --executor_reregistration_timeout="2secs"
--executor_shutdown_grace_period="5secs" --fetcher_cache_dir="/tmp/Endpoint_SlaveEndpointTest_UnauthorizedRequest_2_IEntTL/fetch"
--fetcher_cache_size="2GB" --frameworks_home="" --gc_delay="1weeks" --gc_disk_headroom="0.1"
--hadoop_home="" --help="false" --hostname_lookup="true" --http_command_executor="false" --http_credentials="/tmp/Endpoint_SlaveEndpointTest_UnauthorizedRequest_2_IEntTL/http_credentials"
--http_heartbeat_interval="30secs" --initialize_driver_logging="true" --isolation="posix/cpu,posix/mem"
--launcher="posix" --launcher_dir="/mesos/mesos-1.4.0/_build/src" --logbufsecs="0" --logging_level="INFO"
--max_completed_executors_per_framework="150" --oversubscribed_resources_interval="15secs"
--perf_duration="10secs" --perf_interval="1mins" --port="5051" --qos_correction_interval_min="0ns"
--quiet="false" --recover="reconnect" --recovery_timeout="15mins" --registration_backoff_factor="10ms"
--resources="cpus:2;gpus:0;mem:1024;disk:1024;ports:[31000-32000]" --revocable_cpu_low_priority="true"
--runtime_dir="/tmp/Endpoint_SlaveEndpointTest_UnauthorizedRequest_2_IEntTL" --sandbox_directory="/mnt/mesos/sandbox"
--strict="true" --switch_user="true" --systemd_enable_support="true" --systemd_runtime_directory="/run/systemd/system"
--version="false" --work_dir="/tmp/Endpoint_SlaveEndpointTest_UnauthorizedRequest_2_SSFuET"
I0527 03:16:29.159035  4701 credentials.hpp:86] Loading credential for authentication from
'/tmp/Endpoint_SlaveEndpointTest_UnauthorizedRequest_2_IEntTL/credential'
I0527 03:16:29.159278  4701 slave.cpp:265] Agent using credential for: test-principal
I0527 03:16:29.159303  4701 credentials.hpp:37] Loading credentials for authentication from
'/tmp/Endpoint_SlaveEndpointTest_UnauthorizedRequest_2_IEntTL/http_credentials'
I0527 03:16:29.159605  4701 http.cpp:975] Creating default 'basic' HTTP authenticator for
realm 'mesos-agent-readonly'
I0527 03:16:29.159771  4701 http.cpp:975] Creating default 'basic' HTTP authenticator for
realm 'mesos-agent-readwrite'
I0527 03:16:29.161437  4701 slave.cpp:536] Agent resources: cpus(*):2; mem(*):1024; disk(*):1024;
ports(*):[31000-32000]
I0527 03:16:29.161526  4701 slave.cpp:544] Agent attributes: [  ]
I0527 03:16:29.161542  4701 slave.cpp:549] Agent hostname: 25b1c1662401
I0527 03:16:29.161780  4695 status_update_manager.cpp:177] Pausing sending status updates
I0527 03:16:29.163177  4694 state.cpp:62] Recovering state from '/tmp/Endpoint_SlaveEndpointTest_UnauthorizedRequest_2_SSFuET/meta'
I0527 03:16:29.163650  4693 status_update_manager.cpp:203] Recovering status update manager
I0527 03:16:29.163907  4698 containerizer.cpp:582] Recovering containerizer
I0527 03:16:29.165956  4692 provisioner.cpp:416] Provisioner recovery complete
I0527 03:16:29.166580  4696 slave.cpp:6083] Finished recovery
I0527 03:16:29.173774  4696 slave.cpp:6265] Querying resource estimator for oversubscribable
resources
I0527 03:16:29.174113  4702 slave.cpp:6279] Received oversubscribable resources {} from the
resource estimator
I0527 03:16:29.177119  4697 process.cpp:3730] Handling HTTP event for process 'slave(754)'
with path: '/slave(754)/containers'
I0527 03:16:29.178570  4697 http.cpp:1115] HTTP GET for /slave(754)/containers from 172.17.0.2:45306
I0527 03:16:29.178663  4697 http.cpp:936] Authorizing principal 'test-principal' to GET the
'/containers' endpoint
I0527 03:16:29.181097  4696 slave.cpp:801] Agent terminating
[       OK ] Endpoint/SlaveEndpointTest.UnauthorizedRequest/2 (39 ms)
[ RUN      ] Endpoint/SlaveEndpointTest.NoAuthorizer/0
I0527 03:16:29.191687  4670 containerizer.cpp:230] Using isolation: posix/cpu,posix/mem,filesystem/posix,network/cni,environment_secret
W0527 03:16:29.192214  4670 backend.cpp:76] Failed to create 'aufs' backend: AufsBackend requires
root privileges
W0527 03:16:29.192332  4670 backend.cpp:76] Failed to create 'bind' backend: BindBackend requires
root privileges
I0527 03:16:29.192395  4670 provisioner.cpp:255] Using default backend 'copy'
I0527 03:16:29.194872  4670 cluster.cpp:448] Creating default 'local' authorizer
I0527 03:16:29.196882  4691 slave.cpp:232] Mesos agent started on (755)@172.17.0.2:47759
I0527 03:16:29.196916  4691 slave.cpp:233] Flags at startup: --acls="" --appc_simple_discovery_uri_prefix="http://"
--appc_store_dir="/tmp/mesos/store/appc" --authenticate_http_readonly="true" --authenticate_http_readwrite="true"
--authenticatee="crammd5" --authentication_backoff_factor="1secs" --authorizer="local" --cgroups_cpu_enable_pids_and_tids_count="false"
--cgroups_enable_cfs="false" --cgroups_hierarchy="/sys/fs/cgroup" --cgroups_limit_swap="false"
--cgroups_root="mesos" --container_disk_watch_interval="15secs" --containerizers="mesos" --credential="/tmp/Endpoint_SlaveEndpointTest_NoAuthorizer_0_uiT2dh/credential"
--default_role="*" --disk_watch_interval="1mins" --docker="docker" --docker_kill_orphans="true"
--docker_registry="https://registry-1.docker.io" --docker_remove_delay="6hrs" --docker_socket="/var/run/docker.sock"
--docker_stop_timeout="0ns" --docker_store_dir="/tmp/mesos/store/docker" --docker_volume_checkpoint_dir="/var/run/mesos/isolators/docker/volume"
--enforce_container_disk_quota="false" --executor_registration_timeout="1mins" --executor_reregistration_timeout="2secs"
--executor_shutdown_grace_period="5secs" --fetcher_cache_dir="/tmp/Endpoint_SlaveEndpointTest_NoAuthorizer_0_uiT2dh/fetch"
--fetcher_cache_size="2GB" --frameworks_home="" --gc_delay="1weeks" --gc_disk_headroom="0.1"
--hadoop_home="" --help="false" --hostname_lookup="true" --http_command_executor="false" --http_credentials="/tmp/Endpoint_SlaveEndpointTest_NoAuthorizer_0_uiT2dh/http_credentials"
--http_heartbeat_interval="30secs" --initialize_driver_logging="true" --isolation="posix/cpu,posix/mem"
--launcher="posix" --launcher_dir="/mesos/mesos-1.4.0/_build/src" --logbufsecs="0" --logging_level="INFO"
--max_completed_executors_per_framework="150" --oversubscribed_resources_interval="15secs"
--perf_duration="10secs" --perf_interval="1mins" --port="5051" --qos_correction_interval_min="0ns"
--quiet="false" --recover="reconnect" --recovery_timeout="15mins" --registration_backoff_factor="10ms"
--resources="cpus:2;gpus:0;mem:1024;disk:1024;ports:[31000-32000]" --revocable_cpu_low_priority="true"
--runtime_dir="/tmp/Endpoint_SlaveEndpointTest_NoAuthorizer_0_uiT2dh" --sandbox_directory="/mnt/mesos/sandbox"
--strict="true" --switch_user="true" --systemd_enable_support="true" --systemd_runtime_directory="/run/systemd/system"
--version="false" --work_dir="/tmp/Endpoint_SlaveEndpointTest_NoAuthorizer_0_02CGSo"
I0527 03:16:29.197481  4691 credentials.hpp:86] Loading credential for authentication from
'/tmp/Endpoint_SlaveEndpointTest_NoAuthorizer_0_uiT2dh/credential'
I0527 03:16:29.231503  4691 slave.cpp:265] Agent using credential for: test-principal
I0527 03:16:29.231549  4691 credentials.hpp:37] Loading credentials for authentication from
'/tmp/Endpoint_SlaveEndpointTest_NoAuthorizer_0_uiT2dh/http_credentials'
I0527 03:16:29.231889  4691 http.cpp:975] Creating default 'basic' HTTP authenticator for
realm 'mesos-agent-readonly'
I0527 03:16:29.232141  4691 http.cpp:975] Creating default 'basic' HTTP authenticator for
realm 'mesos-agent-readwrite'
I0527 03:16:29.233422  4691 slave.cpp:536] Agent resources: cpus(*):2; mem(*):1024; disk(*):1024;
ports(*):[31000-32000]
I0527 03:16:29.233499  4691 slave.cpp:544] Agent attributes: [  ]
I0527 03:16:29.233510  4691 slave.cpp:549] Agent hostname: 25b1c1662401
I0527 03:16:29.233666  4700 status_update_manager.cpp:177] Pausing sending status updates
I0527 03:16:29.235332  4703 state.cpp:62] Recovering state from '/tmp/Endpoint_SlaveEndpointTest_NoAuthorizer_0_02CGSo/meta'
I0527 03:16:29.235772  4694 status_update_manager.cpp:203] Recovering status update manager
I0527 03:16:29.235993  4689 containerizer.cpp:582] Recovering containerizer
I0527 03:16:29.237431  4704 provisioner.cpp:416] Provisioner recovery complete
I0527 03:16:29.237792  4693 slave.cpp:6083] Finished recovery
I0527 03:16:29.238306  4693 slave.cpp:6265] Querying resource estimator for oversubscribable
resources
I0527 03:16:29.238658  4697 slave.cpp:6279] Received oversubscribable resources {} from the
resource estimator
I0527 03:16:29.242202  4692 process.cpp:3730] Handling HTTP event for process 'slave(755)'
with path: '/slave(755)/monitor/statistics'
I0527 03:16:29.243692  4689 http.cpp:1115] HTTP GET for /slave(755)/monitor/statistics from
172.17.0.2:45320
I0527 03:16:29.243772  4689 http.cpp:936] Authorizing principal 'test-principal' to GET the
'/monitor/statistics' endpoint
I0527 03:16:29.247316  4701 slave.cpp:801] Agent terminating
[       OK ] Endpoint/SlaveEndpointTest.NoAuthorizer/0 (66 ms)
[ RUN      ] Endpoint/SlaveEndpointTest.NoAuthorizer/1
I0527 03:16:29.258905  4670 containerizer.cpp:230] Using isolation: posix/cpu,posix/mem,filesystem/posix,network/cni,environment_secret
W0527 03:16:29.259402  4670 backend.cpp:76] Failed to create 'aufs' backend: AufsBackend requires
root privileges
W0527 03:16:29.259503  4670 backend.cpp:76] Failed to create 'bind' backend: BindBackend requires
root privileges
I0527 03:16:29.259538  4670 provisioner.cpp:255] Using default backend 'copy'
I0527 03:16:29.261273  4670 cluster.cpp:448] Creating default 'local' authorizer
I0527 03:16:29.262881  4693 slave.cpp:232] Mesos agent started on (756)@172.17.0.2:47759
I0527 03:16:29.262909  4693 slave.cpp:233] Flags at startup: --acls="" --appc_simple_discovery_uri_prefix="http://"
--appc_store_dir="/tmp/mesos/store/appc" --authenticate_http_readonly="true" --authenticate_http_readwrite="true"
--authenticatee="crammd5" --authentication_backoff_factor="1secs" --authorizer="local" --cgroups_cpu_enable_pids_and_tids_count="false"
--cgroups_enable_cfs="false" --cgroups_hierarchy="/sys/fs/cgroup" --cgroups_limit_swap="false"
--cgroups_root="mesos" --container_disk_watch_interval="15secs" --containerizers="mesos" --credential="/tmp/Endpoint_SlaveEndpointTest_NoAuthorizer_1_ychKfN/credential"
--default_role="*" --disk_watch_interval="1mins" --docker="docker" --docker_kill_orphans="true"
--docker_registry="https://registry-1.docker.io" --docker_remove_delay="6hrs" --docker_socket="/var/run/docker.sock"
--docker_stop_timeout="0ns" --docker_store_dir="/tmp/mesos/store/docker" --docker_volume_checkpoint_dir="/var/run/mesos/isolators/docker/volume"
--enforce_container_disk_quota="false" --executor_registration_timeout="1mins" --executor_reregistration_timeout="2secs"
--executor_shutdown_grace_period="5secs" --fetcher_cache_dir="/tmp/Endpoint_SlaveEndpointTest_NoAuthorizer_1_ychKfN/fetch"
--fetcher_cache_size="2GB" --frameworks_home="" --gc_delay="1weeks" --gc_disk_headroom="0.1"
--hadoop_home="" --help="false" --hostname_lookup="true" --http_command_executor="false" --http_credentials="/tmp/Endpoint_SlaveEndpointTest_NoAuthorizer_1_ychKfN/http_credentials"
--http_heartbeat_interval="30secs" --initialize_driver_logging="true" --isolation="posix/cpu,posix/mem"
--launcher="posix" --launcher_dir="/mesos/mesos-1.4.0/_build/src" --logbufsecs="0" --logging_level="INFO"
--max_completed_executors_per_framework="150" --oversubscribed_resources_interval="15secs"
--perf_duration="10secs" --perf_interval="1mins" --port="5051" --qos_correction_interval_min="0ns"
--quiet="false" --recover="reconnect" --recovery_timeout="15mins" --registration_backoff_factor="10ms"
--resources="cpus:2;gpus:0;mem:1024;disk:1024;ports:[31000-32000]" --revocable_cpu_low_priority="true"
--runtime_dir="/tmp/Endpoint_SlaveEndpointTest_NoAuthorizer_1_ychKfN" --sandbox_directory="/mnt/mesos/sandbox"
--strict="true" --switch_user="true" --systemd_enable_support="true" --systemd_runtime_directory="/run/systemd/system"
--version="false" --work_dir="/tmp/Endpoint_SlaveEndpointTest_NoAuthorizer_1_6s6tJU"
I0527 03:16:29.263460  4693 credentials.hpp:86] Loading credential for authentication from
'/tmp/Endpoint_SlaveEndpointTest_NoAuthorizer_1_ychKfN/credential'
I0527 03:16:29.263664  4693 slave.cpp:265] Agent using credential for: test-principal
I0527 03:16:29.263689  4693 credentials.hpp:37] Loading credentials for authentication from
'/tmp/Endpoint_SlaveEndpointTest_NoAuthorizer_1_ychKfN/http_credentials'
I0527 03:16:29.263967  4693 http.cpp:975] Creating default 'basic' HTTP authenticator for
realm 'mesos-agent-readonly'
I0527 03:16:29.264145  4693 http.cpp:975] Creating default 'basic' HTTP authenticator for
realm 'mesos-agent-readwrite'
I0527 03:16:29.265646  4693 slave.cpp:536] Agent resources: cpus(*):2; mem(*):1024; disk(*):1024;
ports(*):[31000-32000]
I0527 03:16:29.265733  4693 slave.cpp:544] Agent attributes: [  ]
I0527 03:16:29.265748  4693 slave.cpp:549] Agent hostname: 25b1c1662401
I0527 03:16:29.265904  4702 status_update_manager.cpp:177] Pausing sending status updates
I0527 03:16:29.267457  4692 state.cpp:62] Recovering state from '/tmp/Endpoint_SlaveEndpointTest_NoAuthorizer_1_6s6tJU/meta'
I0527 03:16:29.267822  4694 status_update_manager.cpp:203] Recovering status update manager
I0527 03:16:29.268041  4702 containerizer.cpp:582] Recovering containerizer
I0527 03:16:29.269928  4700 provisioner.cpp:416] Provisioner recovery complete
I0527 03:16:29.270406  4701 slave.cpp:6083] Finished recovery
I0527 03:16:29.270920  4701 slave.cpp:6265] Querying resource estimator for oversubscribable
resources
I0527 03:16:29.271299  4694 slave.cpp:6279] Received oversubscribable resources {} from the
resource estimator
I0527 03:16:29.274353  4700 process.cpp:3730] Handling HTTP event for process 'slave(756)'
with path: '/slave(756)/monitor/statistics.json'
I0527 03:16:29.275825  4689 http.cpp:1115] HTTP GET for /slave(756)/monitor/statistics.json
from 172.17.0.2:45325
I0527 03:16:29.275903  4689 http.cpp:936] Authorizing principal 'test-principal' to GET the
'/monitor/statistics.json' endpoint
I0527 03:16:29.279180  4697 slave.cpp:801] Agent terminating
[       OK ] Endpoint/SlaveEndpointTest.NoAuthorizer/1 (59 ms)
[ RUN      ] Endpoint/SlaveEndpointTest.NoAuthorizer/2
I0527 03:16:29.320464  4670 containerizer.cpp:230] Using isolation: posix/cpu,posix/mem,filesystem/posix,network/cni,environment_secret
W0527 03:16:29.321116  4670 backend.cpp:76] Failed to create 'aufs' backend: AufsBackend requires
root privileges
W0527 03:16:29.321247  4670 backend.cpp:76] Failed to create 'bind' backend: BindBackend requires
root privileges
I0527 03:16:29.321296  4670 provisioner.cpp:255] Using default backend 'copy'
I0527 03:16:29.323559  4670 cluster.cpp:448] Creating default 'local' authorizer
I0527 03:16:29.325588  4699 slave.cpp:232] Mesos agent started on (757)@172.17.0.2:47759
I0527 03:16:29.325616  4699 slave.cpp:233] Flags at startup: --acls="" --appc_simple_discovery_uri_prefix="http://"
--appc_store_dir="/tmp/mesos/store/appc" --authenticate_http_readonly="true" --authenticate_http_readwrite="true"
--authenticatee="crammd5" --authentication_backoff_factor="1secs" --authorizer="local" --cgroups_cpu_enable_pids_and_tids_count="false"
--cgroups_enable_cfs="false" --cgroups_hierarchy="/sys/fs/cgroup" --cgroups_limit_swap="false"
--cgroups_root="mesos" --container_disk_watch_interval="15secs" --containerizers="mesos" --credential="/tmp/Endpoint_SlaveEndpointTest_NoAuthorizer_2_yxyQPj/credential"
--default_role="*" --disk_watch_interval="1mins" --docker="docker" --docker_kill_orphans="true"
--docker_registry="https://registry-1.docker.io" --docker_remove_delay="6hrs" --docker_socket="/var/run/docker.sock"
--docker_stop_timeout="0ns" --docker_store_dir="/tmp/mesos/store/docker" --docker_volume_checkpoint_dir="/var/run/mesos/isolators/docker/volume"
--enforce_container_disk_quota="false" --executor_registration_timeout="1mins" --executor_reregistration_timeout="2secs"
--executor_shutdown_grace_period="5secs" --fetcher_cache_dir="/tmp/Endpoint_SlaveEndpointTest_NoAuthorizer_2_yxyQPj/fetch"
--fetcher_cache_size="2GB" --frameworks_home="" --gc_delay="1weeks" --gc_disk_headroom="0.1"
--hadoop_home="" --help="false" --hostname_lookup="true" --http_command_executor="false" --http_credentials="/tmp/Endpoint_SlaveEndpointTest_NoAuthorizer_2_yxyQPj/http_credentials"
--http_heartbeat_interval="30secs" --initialize_driver_logging="true" --isolation="posix/cpu,posix/mem"
--launcher="posix" --launcher_dir="/mesos/mesos-1.4.0/_build/src" --logbufsecs="0" --logging_level="INFO"
--max_completed_executors_per_framework="150" --oversubscribed_resources_interval="15secs"
--perf_duration="10secs" --perf_interval="1mins" --port="5051" --qos_correction_interval_min="0ns"
--quiet="false" --recover="reconnect" --recovery_timeout="15mins" --registration_backoff_factor="10ms"
--resources="cpus:2;gpus:0;mem:1024;disk:1024;ports:[31000-32000]" --revocable_cpu_low_priority="true"
--runtime_dir="/tmp/Endpoint_SlaveEndpointTest_NoAuthorizer_2_yxyQPj" --sandbox_directory="/mnt/mesos/sandbox"
--strict="true" --switch_user="true" --systemd_enable_support="true" --systemd_runtime_directory="/run/systemd/system"
--version="false" --work_dir="/tmp/Endpoint_SlaveEndpointTest_NoAuthorizer_2_y7EQ9q"
I0527 03:16:29.326190  4699 credentials.hpp:86] Loading credential for authentication from
'/tmp/Endpoint_SlaveEndpointTest_NoAuthorizer_2_yxyQPj/credential'
I0527 03:16:29.326474  4699 slave.cpp:265] Agent using credential for: test-principal
I0527 03:16:29.326503  4699 credentials.hpp:37] Loading credentials for authentication from
'/tmp/Endpoint_SlaveEndpointTest_NoAuthorizer_2_yxyQPj/http_credentials'
I0527 03:16:29.326802  4699 http.cpp:975] Creating default 'basic' HTTP authenticator for
realm 'mesos-agent-readonly'
I0527 03:16:29.326975  4699 http.cpp:975] Creating default 'basic' HTTP authenticator for
realm 'mesos-agent-readwrite'
I0527 03:16:29.328260  4699 slave.cpp:536] Agent resources: cpus(*):2; mem(*):1024; disk(*):1024;
ports(*):[31000-32000]
I0527 03:16:29.328359  4699 slave.cpp:544] Agent attributes: [  ]
I0527 03:16:29.328374  4699 slave.cpp:549] Agent hostname: 25b1c1662401
I0527 03:16:29.328523  4700 status_update_manager.cpp:177] Pausing sending status updates
I0527 03:16:29.330003  4697 state.cpp:62] Recovering state from '/tmp/Endpoint_SlaveEndpointTest_NoAuthorizer_2_y7EQ9q/meta'
I0527 03:16:29.330423  4694 status_update_manager.cpp:203] Recovering status update manager
I0527 03:16:29.330658  4697 containerizer.cpp:582] Recovering containerizer
I0527 03:16:29.332350  4691 provisioner.cpp:416] Provisioner recovery complete
I0527 03:16:29.332815  4696 slave.cpp:6083] Finished recovery
I0527 03:16:29.333417  4696 slave.cpp:6265] Querying resource estimator for oversubscribable
resources
I0527 03:16:29.333756  4692 slave.cpp:6279] Received oversubscribable resources {} from the
resource estimator
I0527 03:16:29.336933  4704 process.cpp:3730] Handling HTTP event for process 'slave(757)'
with path: '/slave(757)/containers'
I0527 03:16:29.339159  4704 http.cpp:1115] HTTP GET for /slave(757)/containers from 172.17.0.2:45338
I0527 03:16:29.339262  4704 http.cpp:936] Authorizing principal 'test-principal' to GET the
'/containers' endpoint
I0527 03:16:29.344691  4670 slave.cpp:801] Agent terminating
[       OK ] Endpoint/SlaveEndpointTest.NoAuthorizer/2 (66 ms)
[----------] 9 tests from Endpoint/SlaveEndpointTest (501 ms total)

[----------] Global test environment tear-down
[==========] 1583 tests from 176 test cases ran. (713429 ms total)
[  PASSED  ] 1581 tests.
[  FAILED  ] 2 tests, listed below:
[  FAILED  ] ExamplesTest.PythonFramework
[  FAILED  ] IOSwitchboardTest.ContainerAttach

 2 FAILED TESTS
  YOU HAVE 22 DISABLED TESTS

E0527 03:16:29.469610  4705 process.cpp:950] Failed to accept socket: future discarded
make[4]: *** [check-local] Error 1
make[4]: Leaving directory `/mesos/mesos-1.4.0/_build/src'
make[3]: *** [check-am] Error 2
make[3]: Leaving directory `/mesos/mesos-1.4.0/_build/src'
make[2]: *** [check] Error 2
make[2]: Leaving directory `/mesos/mesos-1.4.0/_build/src'
make[1]: *** [check-recursive] Error 1
make[1]: Leaving directory `/mesos/mesos-1.4.0/_build'
make: *** [distcheck] Error 1
+ docker rmi mesos-1495850562-20834
Untagged: mesos-1495850562-20834:latest
Deleted: sha256:c8e34fe6c601c3dc6dbfbc36e9b12206cd0e62c375d32779e8482453666c9d58
Deleted: sha256:ab574f0e431fa407d330e46e4976f1d3529b8f1bf922da73f98db135c3c35fde
Deleted: sha256:1ab3c83f8768ffae6bef8de9400019e58cb7be7d1c4d597ade36a4544f85f9f5
Deleted: sha256:03619a9b06654acf38d316aeaf2fca99b2b1e4009a9bff3c8dd30872f32aa84a
Deleted: sha256:2838425ce8e5df0e0258c523ff492b15aa636da98f21c639f914eb06824ca9db
Deleted: sha256:ade43ab9f8597dfb579550abe58893ee8072a9eff6a630ffe01e737ccd182bb2
Deleted: sha256:5c62343fee93cb0490610e9687ee1629182065ab92cbc32fa112d56359bff688
Deleted: sha256:fbd905f4f1358b3600b088d7d356fb240099b86845308ce0d1257a36be0d5e80
Deleted: sha256:e0945772fed9533398f202a9b3ecdc231d4127eff3651f9b1092c3407f87047b
Deleted: sha256:61a7e55d5a2de7c9aaf5d4472bb3a65c46b087521ccaa2c5bda1fbf7cef4ca60
Deleted: sha256:879b2bd7c64c75ffa029387e2018469d1cfb7073cb3347e6a12e424323337ee0
Deleted: sha256:81c01a9fdcb03ad59e4a002e71c6def7f0ae82760f82c302267e90b8dbe43b7c
Deleted: sha256:c90294da88ec5029ecd4eb67a525e3e278b68a93f5b95d408e5fc7f1c1319ef5
Deleted: sha256:821f766cb4ff539a38b9b2dc74a8f8a9b91b1e4a2dd823d2b70015d83f613ba9
Deleted: sha256:97c5d1de7147ee9f2efe22a8e3440d77b5dbd13acfe95ce4aa76166d0776e611
Deleted: sha256:c37c89c7490f0d5c1a2bdfc28d68ad537bff7e95b7b36192539c7b2787d134c3
Deleted: sha256:4f8e9e05e520a61b821e10beddd9a314ba8fe47fb6c82c628bdef3ccc143b7dd
Deleted: sha256:d42f040f8aeea8ed025e10a6889bcad92a38223300b94777c315b6e4824e0670
Deleted: sha256:71ae0de12324dd0cb2ad9dd4942b71923c3e224b25bf9055698fc4141ae8d824
Deleted: sha256:95b51524d8ab66dbb41926f44cea0c182439a8f6312d5017b9a2dd765d1ff5cb
Deleted: sha256:a38edcccb2c17ae9b91430d47d76147ba8c48422913cdba7faa25fb9c2ccacf6
Deleted: sha256:76020f76f610dc970efdf2343c2bb4db68febb4fc5b019f23eab8c529298a9d0
Deleted: sha256:4e4adce67c763d6bd4f49944f0964468ba34f614144e4390f7fa8476952db136
Deleted: sha256:5d2a54a585ee40d30ceb75851c6ebb8df14a11217dcbf3c1d13be0b10baecdeb
Build step 'Execute shell' marked build as failure
Not sending mail to unregistered user neil.conway@gmail.com

Mime
View raw message