mesos-builds mailing list archives

Site index · List index
Message view « Date » · « Thread »
Top « Date » · « Thread »
From Apache Jenkins Server <jenk...@builds.apache.org>
Subject Build failed in Jenkins: Mesos-Buildbot » autotools,gcc,--verbose --enable-libevent --enable-ssl,GLOG_v=1 MESOS_VERBOSE=1,ubuntu:14.04,(docker||Hadoop)&&(!ubuntu-us1)&&(!ubuntu-eu2) #3730
Date Fri, 26 May 2017 18:47:38 GMT
See <https://builds.apache.org/job/Mesos-Buildbot/BUILDTOOL=autotools,COMPILER=gcc,CONFIGURATION=--verbose%20--enable-libevent%20--enable-ssl,ENVIRONMENT=GLOG_v=1%20MESOS_VERBOSE=1,OS=ubuntu%3A14.04,label_exp=(docker%7C%7CHadoop)&&(!ubuntu-us1)&&(!ubuntu-eu2)/3730/display/redirect?page=changes>

Changes:

[vinodkone] Made the executor driver drop some messages when not connected.

------------------------------------------
[...truncated 28.73 MB...]
I0526 18:47:18.845351 18996 slave.cpp:6269] Received oversubscribable resources {} from the
resource estimator
I0526 18:47:18.847177 18995 process.cpp:3730] Handling HTTP event for process 'slave(753)'
with path: '/slave(753)/containers'
I0526 18:47:18.848834 18989 http.cpp:1115] HTTP GET for /slave(753)/containers from 172.17.0.2:57001
I0526 18:47:18.848934 18989 http.cpp:936] Authorizing principal 'test-principal' to GET the
'/containers' endpoint
I0526 18:47:18.852428 18997 slave.cpp:801] Agent terminating
[       OK ] Endpoint/SlaveEndpointTest.AuthorizedRequest/2 (27 ms)
[ RUN      ] Endpoint/SlaveEndpointTest.UnauthorizedRequest/0
I0526 18:47:18.862426   749 containerizer.cpp:230] Using isolation: posix/cpu,posix/mem,filesystem/posix,network/cni,environment_secret
W0526 18:47:18.862890   749 backend.cpp:76] Failed to create 'aufs' backend: AufsBackend requires
root privileges
W0526 18:47:18.862993   749 backend.cpp:76] Failed to create 'bind' backend: BindBackend requires
root privileges
I0526 18:47:18.863032   749 provisioner.cpp:255] Using default backend 'copy'
I0526 18:47:18.865954 18998 slave.cpp:232] Mesos agent started on (754)@172.17.0.2:55980
I0526 18:47:18.865980 18998 slave.cpp:233] Flags at startup: --acls="" --appc_simple_discovery_uri_prefix="http://"
--appc_store_dir="/tmp/mesos/store/appc" --authenticate_http_executors="true" --authenticate_http_readonly="true"
--authenticate_http_readwrite="true" --authenticatee="crammd5" --authentication_backoff_factor="1secs"
--authorizer="local" --cgroups_cpu_enable_pids_and_tids_count="false" --cgroups_enable_cfs="false"
--cgroups_hierarchy="/sys/fs/cgroup" --cgroups_limit_swap="false" --cgroups_root="mesos" --container_disk_watch_interval="15secs"
--containerizers="mesos" --credential="/tmp/Endpoint_SlaveEndpointTest_UnauthorizedRequest_0_dtg3P0/credential"
--default_role="*" --disk_watch_interval="1mins" --docker="docker" --docker_kill_orphans="true"
--docker_registry="https://registry-1.docker.io" --docker_remove_delay="6hrs" --docker_socket="/var/run/docker.sock"
--docker_stop_timeout="0ns" --docker_store_dir="/tmp/mesos/store/docker" --docker_volume_checkpoint_dir="/var/run/mesos/isolators/docker/volume"
--enforce_container_disk_quota="false" --executor_registration_timeout="1mins" --executor_reregistration_timeout="2secs"
--executor_secret_key="/tmp/Endpoint_SlaveEndpointTest_UnauthorizedRequest_0_dtg3P0/executor_secret_key"
--executor_shutdown_grace_period="5secs" --fetcher_cache_dir="/tmp/Endpoint_SlaveEndpointTest_UnauthorizedRequest_0_dtg3P0/fetch"
--fetcher_cache_size="2GB" --frameworks_home="" --gc_delay="1weeks" --gc_disk_headroom="0.1"
--hadoop_home="" --help="false" --hostname_lookup="true" --http_command_executor="false" --http_credentials="/tmp/Endpoint_SlaveEndpointTest_UnauthorizedRequest_0_dtg3P0/http_credentials"
--http_heartbeat_interval="30secs" --initialize_driver_logging="true" --isolation="posix/cpu,posix/mem"
--launcher="posix" --launcher_dir="/mesos/mesos-1.4.0/_build/src" --logbufsecs="0" --logging_level="INFO"
--max_completed_executors_per_framework="150" --oversubscribed_resources_interval="15secs"
--perf_duration="10secs" --perf_interval="1mins" --port="5051" --qos_correction_interval_min="0ns"
--quiet="false" --recover="reconnect" --recovery_timeout="15mins" --registration_backoff_factor="10ms"
--resources="cpus:2;gpus:0;mem:1024;disk:1024;ports:[31000-32000]" --revocable_cpu_low_priority="true"
--runtime_dir="/tmp/Endpoint_SlaveEndpointTest_UnauthorizedRequest_0_dtg3P0" --sandbox_directory="/mnt/mesos/sandbox"
--strict="true" --switch_user="true" --systemd_enable_support="true" --systemd_runtime_directory="/run/systemd/system"
--version="false" --work_dir="/tmp/Endpoint_SlaveEndpointTest_UnauthorizedRequest_0_WuQLlT"
I0526 18:47:18.866403 18998 credentials.hpp:86] Loading credential for authentication from
'/tmp/Endpoint_SlaveEndpointTest_UnauthorizedRequest_0_dtg3P0/credential'
I0526 18:47:18.866542 18998 slave.cpp:265] Agent using credential for: test-principal
I0526 18:47:18.866564 18998 credentials.hpp:37] Loading credentials for authentication from
'/tmp/Endpoint_SlaveEndpointTest_UnauthorizedRequest_0_dtg3P0/http_credentials'
I0526 18:47:18.866794 18998 http.cpp:975] Creating default 'basic' HTTP authenticator for
realm 'mesos-agent-executor'
I0526 18:47:18.866884 18998 http.cpp:996] Creating default 'jwt' HTTP authenticator for realm
'mesos-agent-executor'
I0526 18:47:18.867136 18998 http.cpp:975] Creating default 'basic' HTTP authenticator for
realm 'mesos-agent-readonly'
I0526 18:47:18.867234 18998 http.cpp:996] Creating default 'jwt' HTTP authenticator for realm
'mesos-agent-readonly'
I0526 18:47:18.867470 18998 http.cpp:975] Creating default 'basic' HTTP authenticator for
realm 'mesos-agent-readwrite'
I0526 18:47:18.867563 18998 http.cpp:996] Creating default 'jwt' HTTP authenticator for realm
'mesos-agent-readwrite'
I0526 18:47:18.868739 18998 slave.cpp:536] Agent resources: cpus(*):2; mem(*):1024; disk(*):1024;
ports(*):[31000-32000]
I0526 18:47:18.868808 18998 slave.cpp:544] Agent attributes: [  ]
I0526 18:47:18.868825 18998 slave.cpp:549] Agent hostname: f07777a7f72e
I0526 18:47:18.868952 18994 status_update_manager.cpp:177] Pausing sending status updates
I0526 18:47:18.870090 19000 state.cpp:62] Recovering state from '/tmp/Endpoint_SlaveEndpointTest_UnauthorizedRequest_0_WuQLlT/meta'
I0526 18:47:18.870376 18989 status_update_manager.cpp:203] Recovering status update manager
I0526 18:47:18.870566 18992 containerizer.cpp:582] Recovering containerizer
I0526 18:47:18.871820 18991 provisioner.cpp:416] Provisioner recovery complete
I0526 18:47:18.872185 19001 slave.cpp:6073] Finished recovery
I0526 18:47:18.872647 19001 slave.cpp:6255] Querying resource estimator for oversubscribable
resources
I0526 18:47:18.872911 18998 slave.cpp:6269] Received oversubscribable resources {} from the
resource estimator
I0526 18:47:18.874646 18988 process.cpp:3730] Handling HTTP event for process 'slave(754)'
with path: '/slave(754)/monitor/statistics'
I0526 18:47:18.876288 18987 http.cpp:1115] HTTP GET for /slave(754)/monitor/statistics from
172.17.0.2:57002
I0526 18:47:18.876358 18987 http.cpp:936] Authorizing principal 'test-principal' to GET the
'/monitor/statistics' endpoint
I0526 18:47:18.878654 18987 slave.cpp:801] Agent terminating
[       OK ] Endpoint/SlaveEndpointTest.UnauthorizedRequest/0 (25 ms)
[ RUN      ] Endpoint/SlaveEndpointTest.UnauthorizedRequest/1
I0526 18:47:18.888752   749 containerizer.cpp:230] Using isolation: posix/cpu,posix/mem,filesystem/posix,network/cni,environment_secret
W0526 18:47:18.889230   749 backend.cpp:76] Failed to create 'aufs' backend: AufsBackend requires
root privileges
W0526 18:47:18.889327   749 backend.cpp:76] Failed to create 'bind' backend: BindBackend requires
root privileges
I0526 18:47:18.889391   749 provisioner.cpp:255] Using default backend 'copy'
I0526 18:47:18.892303 19002 slave.cpp:232] Mesos agent started on (755)@172.17.0.2:55980
I0526 18:47:18.892326 19002 slave.cpp:233] Flags at startup: --acls="" --appc_simple_discovery_uri_prefix="http://"
--appc_store_dir="/tmp/mesos/store/appc" --authenticate_http_executors="true" --authenticate_http_readonly="true"
--authenticate_http_readwrite="true" --authenticatee="crammd5" --authentication_backoff_factor="1secs"
--authorizer="local" --cgroups_cpu_enable_pids_and_tids_count="false" --cgroups_enable_cfs="false"
--cgroups_hierarchy="/sys/fs/cgroup" --cgroups_limit_swap="false" --cgroups_root="mesos" --container_disk_watch_interval="15secs"
--containerizers="mesos" --credential="/tmp/Endpoint_SlaveEndpointTest_UnauthorizedRequest_1_D6YF1u/credential"
--default_role="*" --disk_watch_interval="1mins" --docker="docker" --docker_kill_orphans="true"
--docker_registry="https://registry-1.docker.io" --docker_remove_delay="6hrs" --docker_socket="/var/run/docker.sock"
--docker_stop_timeout="0ns" --docker_store_dir="/tmp/mesos/store/docker" --docker_volume_checkpoint_dir="/var/run/mesos/isolators/docker/volume"
--enforce_container_disk_quota="false" --executor_registration_timeout="1mins" --executor_reregistration_timeout="2secs"
--executor_secret_key="/tmp/Endpoint_SlaveEndpointTest_UnauthorizedRequest_1_D6YF1u/executor_secret_key"
--executor_shutdown_grace_period="5secs" --fetcher_cache_dir="/tmp/Endpoint_SlaveEndpointTest_UnauthorizedRequest_1_D6YF1u/fetch"
--fetcher_cache_size="2GB" --frameworks_home="" --gc_delay="1weeks" --gc_disk_headroom="0.1"
--hadoop_home="" --help="false" --hostname_lookup="true" --http_command_executor="false" --http_credentials="/tmp/Endpoint_SlaveEndpointTest_UnauthorizedRequest_1_D6YF1u/http_credentials"
--http_heartbeat_interval="30secs" --initialize_driver_logging="true" --isolation="posix/cpu,posix/mem"
--launcher="posix" --launcher_dir="/mesos/mesos-1.4.0/_build/src" --logbufsecs="0" --logging_level="INFO"
--max_completed_executors_per_framework="150" --oversubscribed_resources_interval="15secs"
--perf_duration="10secs" --perf_interval="1mins" --port="5051" --qos_correction_interval_min="0ns"
--quiet="false" --recover="reconnect" --recovery_timeout="15mins" --registration_backoff_factor="10ms"
--resources="cpus:2;gpus:0;mem:1024;disk:1024;ports:[31000-32000]" --revocable_cpu_low_priority="true"
--runtime_dir="/tmp/Endpoint_SlaveEndpointTest_UnauthorizedRequest_1_D6YF1u" --sandbox_directory="/mnt/mesos/sandbox"
--strict="true" --switch_user="true" --systemd_enable_support="true" --systemd_runtime_directory="/run/systemd/system"
--version="false" --work_dir="/tmp/Endpoint_SlaveEndpointTest_UnauthorizedRequest_1_wfL7sn"
I0526 18:47:18.892710 19002 credentials.hpp:86] Loading credential for authentication from
'/tmp/Endpoint_SlaveEndpointTest_UnauthorizedRequest_1_D6YF1u/credential'
I0526 18:47:18.892845 19002 slave.cpp:265] Agent using credential for: test-principal
I0526 18:47:18.892865 19002 credentials.hpp:37] Loading credentials for authentication from
'/tmp/Endpoint_SlaveEndpointTest_UnauthorizedRequest_1_D6YF1u/http_credentials'
I0526 18:47:18.893100 19002 http.cpp:975] Creating default 'basic' HTTP authenticator for
realm 'mesos-agent-executor'
I0526 18:47:18.893193 19002 http.cpp:996] Creating default 'jwt' HTTP authenticator for realm
'mesos-agent-executor'
I0526 18:47:18.893450 19002 http.cpp:975] Creating default 'basic' HTTP authenticator for
realm 'mesos-agent-readonly'
I0526 18:47:18.893540 19002 http.cpp:996] Creating default 'jwt' HTTP authenticator for realm
'mesos-agent-readonly'
I0526 18:47:18.893760 19002 http.cpp:975] Creating default 'basic' HTTP authenticator for
realm 'mesos-agent-readwrite'
I0526 18:47:18.893887 19002 http.cpp:996] Creating default 'jwt' HTTP authenticator for realm
'mesos-agent-readwrite'
I0526 18:47:18.895129 19002 slave.cpp:536] Agent resources: cpus(*):2; mem(*):1024; disk(*):1024;
ports(*):[31000-32000]
I0526 18:47:18.895195 19002 slave.cpp:544] Agent attributes: [  ]
I0526 18:47:18.895208 19002 slave.cpp:549] Agent hostname: f07777a7f72e
I0526 18:47:18.895339 18992 status_update_manager.cpp:177] Pausing sending status updates
I0526 18:47:18.896316 18994 state.cpp:62] Recovering state from '/tmp/Endpoint_SlaveEndpointTest_UnauthorizedRequest_1_wfL7sn/meta'
I0526 18:47:18.896622 18992 status_update_manager.cpp:203] Recovering status update manager
I0526 18:47:18.896955 18994 containerizer.cpp:582] Recovering containerizer
I0526 18:47:18.898355 18997 provisioner.cpp:416] Provisioner recovery complete
I0526 18:47:18.898805 18995 slave.cpp:6073] Finished recovery
I0526 18:47:18.899240 18995 slave.cpp:6255] Querying resource estimator for oversubscribable
resources
I0526 18:47:18.899482 18988 slave.cpp:6269] Received oversubscribable resources {} from the
resource estimator
I0526 18:47:18.901294 18991 process.cpp:3730] Handling HTTP event for process 'slave(755)'
with path: '/slave(755)/monitor/statistics.json'
I0526 18:47:18.903035 18994 http.cpp:1115] HTTP GET for /slave(755)/monitor/statistics.json
from 172.17.0.2:57003
I0526 18:47:18.903101 18994 http.cpp:936] Authorizing principal 'test-principal' to GET the
'/monitor/statistics.json' endpoint
I0526 18:47:18.905282 18992 slave.cpp:801] Agent terminating
[       OK ] Endpoint/SlaveEndpointTest.UnauthorizedRequest/1 (26 ms)
[ RUN      ] Endpoint/SlaveEndpointTest.UnauthorizedRequest/2
I0526 18:47:18.915261   749 containerizer.cpp:230] Using isolation: posix/cpu,posix/mem,filesystem/posix,network/cni,environment_secret
W0526 18:47:18.915758   749 backend.cpp:76] Failed to create 'aufs' backend: AufsBackend requires
root privileges
W0526 18:47:18.915873   749 backend.cpp:76] Failed to create 'bind' backend: BindBackend requires
root privileges
I0526 18:47:18.915912   749 provisioner.cpp:255] Using default backend 'copy'
I0526 18:47:18.918782 18997 slave.cpp:232] Mesos agent started on (756)@172.17.0.2:55980
I0526 18:47:18.918808 18997 slave.cpp:233] Flags at startup: --acls="" --appc_simple_discovery_uri_prefix="http://"
--appc_store_dir="/tmp/mesos/store/appc" --authenticate_http_executors="true" --authenticate_http_readonly="true"
--authenticate_http_readwrite="true" --authenticatee="crammd5" --authentication_backoff_factor="1secs"
--authorizer="local" --cgroups_cpu_enable_pids_and_tids_count="false" --cgroups_enable_cfs="false"
--cgroups_hierarchy="/sys/fs/cgroup" --cgroups_limit_swap="false" --cgroups_root="mesos" --container_disk_watch_interval="15secs"
--containerizers="mesos" --credential="/tmp/Endpoint_SlaveEndpointTest_UnauthorizedRequest_2_zfqwuZ/credential"
--default_role="*" --disk_watch_interval="1mins" --docker="docker" --docker_kill_orphans="true"
--docker_registry="https://registry-1.docker.io" --docker_remove_delay="6hrs" --docker_socket="/var/run/docker.sock"
--docker_stop_timeout="0ns" --docker_store_dir="/tmp/mesos/store/docker" --docker_volume_checkpoint_dir="/var/run/mesos/isolators/docker/volume"
--enforce_container_disk_quota="false" --executor_registration_timeout="1mins" --executor_reregistration_timeout="2secs"
--executor_secret_key="/tmp/Endpoint_SlaveEndpointTest_UnauthorizedRequest_2_zfqwuZ/executor_secret_key"
--executor_shutdown_grace_period="5secs" --fetcher_cache_dir="/tmp/Endpoint_SlaveEndpointTest_UnauthorizedRequest_2_zfqwuZ/fetch"
--fetcher_cache_size="2GB" --frameworks_home="" --gc_delay="1weeks" --gc_disk_headroom="0.1"
--hadoop_home="" --help="false" --hostname_lookup="true" --http_command_executor="false" --http_credentials="/tmp/Endpoint_SlaveEndpointTest_UnauthorizedRequest_2_zfqwuZ/http_credentials"
--http_heartbeat_interval="30secs" --initialize_driver_logging="true" --isolation="posix/cpu,posix/mem"
--launcher="posix" --launcher_dir="/mesos/mesos-1.4.0/_build/src" --logbufsecs="0" --logging_level="INFO"
--max_completed_executors_per_framework="150" --oversubscribed_resources_interval="15secs"
--perf_duration="10secs" --perf_interval="1mins" --port="5051" --qos_correction_interval_min="0ns"
--quiet="false" --recover="reconnect" --recovery_timeout="15mins" --registration_backoff_factor="10ms"
--resources="cpus:2;gpus:0;mem:1024;disk:1024;ports:[31000-32000]" --revocable_cpu_low_priority="true"
--runtime_dir="/tmp/Endpoint_SlaveEndpointTest_UnauthorizedRequest_2_zfqwuZ" --sandbox_directory="/mnt/mesos/sandbox"
--strict="true" --switch_user="true" --systemd_enable_support="true" --systemd_runtime_directory="/run/systemd/system"
--version="false" --work_dir="/tmp/Endpoint_SlaveEndpointTest_UnauthorizedRequest_2_eACFRR"
I0526 18:47:18.919210 18997 credentials.hpp:86] Loading credential for authentication from
'/tmp/Endpoint_SlaveEndpointTest_UnauthorizedRequest_2_zfqwuZ/credential'
I0526 18:47:18.919353 18997 slave.cpp:265] Agent using credential for: test-principal
I0526 18:47:18.919373 18997 credentials.hpp:37] Loading credentials for authentication from
'/tmp/Endpoint_SlaveEndpointTest_UnauthorizedRequest_2_zfqwuZ/http_credentials'
I0526 18:47:18.919603 18997 http.cpp:975] Creating default 'basic' HTTP authenticator for
realm 'mesos-agent-executor'
I0526 18:47:18.919699 18997 http.cpp:996] Creating default 'jwt' HTTP authenticator for realm
'mesos-agent-executor'
I0526 18:47:18.919958 18997 http.cpp:975] Creating default 'basic' HTTP authenticator for
realm 'mesos-agent-readonly'
I0526 18:47:18.920115 18997 http.cpp:996] Creating default 'jwt' HTTP authenticator for realm
'mesos-agent-readonly'
I0526 18:47:18.920336 18997 http.cpp:975] Creating default 'basic' HTTP authenticator for
realm 'mesos-agent-readwrite'
I0526 18:47:18.920436 18997 http.cpp:996] Creating default 'jwt' HTTP authenticator for realm
'mesos-agent-readwrite'
I0526 18:47:18.921633 18997 slave.cpp:536] Agent resources: cpus(*):2; mem(*):1024; disk(*):1024;
ports(*):[31000-32000]
I0526 18:47:18.921700 18997 slave.cpp:544] Agent attributes: [  ]
I0526 18:47:18.921711 18997 slave.cpp:549] Agent hostname: f07777a7f72e
I0526 18:47:18.921818 19001 status_update_manager.cpp:177] Pausing sending status updates
I0526 18:47:18.922976 18993 state.cpp:62] Recovering state from '/tmp/Endpoint_SlaveEndpointTest_UnauthorizedRequest_2_eACFRR/meta'
I0526 18:47:18.923435 18995 status_update_manager.cpp:203] Recovering status update manager
I0526 18:47:18.923660 18993 containerizer.cpp:582] Recovering containerizer
I0526 18:47:18.925212 18997 provisioner.cpp:416] Provisioner recovery complete
I0526 18:47:18.925611 18991 slave.cpp:6073] Finished recovery
I0526 18:47:18.926051 18991 slave.cpp:6255] Querying resource estimator for oversubscribable
resources
I0526 18:47:18.926275 18987 slave.cpp:6269] Received oversubscribable resources {} from the
resource estimator
I0526 18:47:18.928220 18995 process.cpp:3730] Handling HTTP event for process 'slave(756)'
with path: '/slave(756)/containers'
I0526 18:47:18.930048 18998 http.cpp:1115] HTTP GET for /slave(756)/containers from 172.17.0.2:57004
I0526 18:47:18.930117 18998 http.cpp:936] Authorizing principal 'test-principal' to GET the
'/containers' endpoint
I0526 18:47:18.932219 18997 slave.cpp:801] Agent terminating
[       OK ] Endpoint/SlaveEndpointTest.UnauthorizedRequest/2 (27 ms)
[ RUN      ] Endpoint/SlaveEndpointTest.NoAuthorizer/0
I0526 18:47:18.942595   749 containerizer.cpp:230] Using isolation: posix/cpu,posix/mem,filesystem/posix,network/cni,environment_secret
W0526 18:47:18.943091   749 backend.cpp:76] Failed to create 'aufs' backend: AufsBackend requires
root privileges
W0526 18:47:18.943195   749 backend.cpp:76] Failed to create 'bind' backend: BindBackend requires
root privileges
I0526 18:47:18.943236   749 provisioner.cpp:255] Using default backend 'copy'
I0526 18:47:18.945060   749 cluster.cpp:448] Creating default 'local' authorizer
I0526 18:47:18.946550 18992 slave.cpp:232] Mesos agent started on (757)@172.17.0.2:55980
I0526 18:47:18.946574 18992 slave.cpp:233] Flags at startup: --acls="" --appc_simple_discovery_uri_prefix="http://"
--appc_store_dir="/tmp/mesos/store/appc" --authenticate_http_executors="true" --authenticate_http_readonly="true"
--authenticate_http_readwrite="true" --authenticatee="crammd5" --authentication_backoff_factor="1secs"
--authorizer="local" --cgroups_cpu_enable_pids_and_tids_count="false" --cgroups_enable_cfs="false"
--cgroups_hierarchy="/sys/fs/cgroup" --cgroups_limit_swap="false" --cgroups_root="mesos" --container_disk_watch_interval="15secs"
--containerizers="mesos" --credential="/tmp/Endpoint_SlaveEndpointTest_NoAuthorizer_0_wnmTeu/credential"
--default_role="*" --disk_watch_interval="1mins" --docker="docker" --docker_kill_orphans="true"
--docker_registry="https://registry-1.docker.io" --docker_remove_delay="6hrs" --docker_socket="/var/run/docker.sock"
--docker_stop_timeout="0ns" --docker_store_dir="/tmp/mesos/store/docker" --docker_volume_checkpoint_dir="/var/run/mesos/isolators/docker/volume"
--enforce_container_disk_quota="false" --executor_registration_timeout="1mins" --executor_reregistration_timeout="2secs"
--executor_secret_key="/tmp/Endpoint_SlaveEndpointTest_NoAuthorizer_0_wnmTeu/executor_secret_key"
--executor_shutdown_grace_period="5secs" --fetcher_cache_dir="/tmp/Endpoint_SlaveEndpointTest_NoAuthorizer_0_wnmTeu/fetch"
--fetcher_cache_size="2GB" --frameworks_home="" --gc_delay="1weeks" --gc_disk_headroom="0.1"
--hadoop_home="" --help="false" --hostname_lookup="true" --http_command_executor="false" --http_credentials="/tmp/Endpoint_SlaveEndpointTest_NoAuthorizer_0_wnmTeu/http_credentials"
--http_heartbeat_interval="30secs" --initialize_driver_logging="true" --isolation="posix/cpu,posix/mem"
--launcher="posix" --launcher_dir="/mesos/mesos-1.4.0/_build/src" --logbufsecs="0" --logging_level="INFO"
--max_completed_executors_per_framework="150" --oversubscribed_resources_interval="15secs"
--perf_duration="10secs" --perf_interval="1mins" --port="5051" --qos_correction_interval_min="0ns"
--quiet="false" --recover="reconnect" --recovery_timeout="15mins" --registration_backoff_factor="10ms"
--resources="cpus:2;gpus:0;mem:1024;disk:1024;ports:[31000-32000]" --revocable_cpu_low_priority="true"
--runtime_dir="/tmp/Endpoint_SlaveEndpointTest_NoAuthorizer_0_wnmTeu" --sandbox_directory="/mnt/mesos/sandbox"
--strict="true" --switch_user="true" --systemd_enable_support="true" --systemd_runtime_directory="/run/systemd/system"
--version="false" --work_dir="/tmp/Endpoint_SlaveEndpointTest_NoAuthorizer_0_vSeExm"
I0526 18:47:18.946962 18992 credentials.hpp:86] Loading credential for authentication from
'/tmp/Endpoint_SlaveEndpointTest_NoAuthorizer_0_wnmTeu/credential'
I0526 18:47:18.947170 18992 slave.cpp:265] Agent using credential for: test-principal
I0526 18:47:18.947196 18992 credentials.hpp:37] Loading credentials for authentication from
'/tmp/Endpoint_SlaveEndpointTest_NoAuthorizer_0_wnmTeu/http_credentials'
I0526 18:47:18.947481 18992 http.cpp:975] Creating default 'basic' HTTP authenticator for
realm 'mesos-agent-executor'
I0526 18:47:18.947579 18992 http.cpp:996] Creating default 'jwt' HTTP authenticator for realm
'mesos-agent-executor'
I0526 18:47:18.947788 18992 http.cpp:975] Creating default 'basic' HTTP authenticator for
realm 'mesos-agent-readonly'
I0526 18:47:18.947890 18992 http.cpp:996] Creating default 'jwt' HTTP authenticator for realm
'mesos-agent-readonly'
I0526 18:47:18.948056 18992 http.cpp:975] Creating default 'basic' HTTP authenticator for
realm 'mesos-agent-readwrite'
I0526 18:47:18.948159 18992 http.cpp:996] Creating default 'jwt' HTTP authenticator for realm
'mesos-agent-readwrite'
I0526 18:47:18.949362 18992 slave.cpp:536] Agent resources: cpus(*):2; mem(*):1024; disk(*):1024;
ports(*):[31000-32000]
I0526 18:47:18.949430 18992 slave.cpp:544] Agent attributes: [  ]
I0526 18:47:18.949448 18992 slave.cpp:549] Agent hostname: f07777a7f72e
I0526 18:47:18.949607 18999 status_update_manager.cpp:177] Pausing sending status updates
I0526 18:47:18.950779 19002 state.cpp:62] Recovering state from '/tmp/Endpoint_SlaveEndpointTest_NoAuthorizer_0_vSeExm/meta'
I0526 18:47:18.951122 18990 status_update_manager.cpp:203] Recovering status update manager
I0526 18:47:18.951301 18990 containerizer.cpp:582] Recovering containerizer
I0526 18:47:18.952680 18991 provisioner.cpp:416] Provisioner recovery complete
I0526 18:47:18.953065 18992 slave.cpp:6073] Finished recovery
I0526 18:47:18.953634 18992 slave.cpp:6255] Querying resource estimator for oversubscribable
resources
I0526 18:47:18.953939 19000 slave.cpp:6269] Received oversubscribable resources {} from the
resource estimator
I0526 18:47:18.955613 19002 process.cpp:3730] Handling HTTP event for process 'slave(757)'
with path: '/slave(757)/monitor/statistics'
I0526 18:47:18.957479 18996 http.cpp:1115] HTTP GET for /slave(757)/monitor/statistics from
172.17.0.2:57005
I0526 18:47:18.957623 18996 http.cpp:936] Authorizing principal 'test-principal' to GET the
'/monitor/statistics' endpoint
I0526 18:47:18.960369 18987 slave.cpp:801] Agent terminating
[       OK ] Endpoint/SlaveEndpointTest.NoAuthorizer/0 (28 ms)
[ RUN      ] Endpoint/SlaveEndpointTest.NoAuthorizer/1
I0526 18:47:18.970211   749 containerizer.cpp:230] Using isolation: posix/cpu,posix/mem,filesystem/posix,network/cni,environment_secret
W0526 18:47:18.970692   749 backend.cpp:76] Failed to create 'aufs' backend: AufsBackend requires
root privileges
W0526 18:47:18.970785   749 backend.cpp:76] Failed to create 'bind' backend: BindBackend requires
root privileges
I0526 18:47:18.970816   749 provisioner.cpp:255] Using default backend 'copy'
I0526 18:47:18.972620   749 cluster.cpp:448] Creating default 'local' authorizer
I0526 18:47:18.974201 18999 slave.cpp:232] Mesos agent started on (758)@172.17.0.2:55980
I0526 18:47:18.974226 18999 slave.cpp:233] Flags at startup: --acls="" --appc_simple_discovery_uri_prefix="http://"
--appc_store_dir="/tmp/mesos/store/appc" --authenticate_http_executors="true" --authenticate_http_readonly="true"
--authenticate_http_readwrite="true" --authenticatee="crammd5" --authentication_backoff_factor="1secs"
--authorizer="local" --cgroups_cpu_enable_pids_and_tids_count="false" --cgroups_enable_cfs="false"
--cgroups_hierarchy="/sys/fs/cgroup" --cgroups_limit_swap="false" --cgroups_root="mesos" --container_disk_watch_interval="15secs"
--containerizers="mesos" --credential="/tmp/Endpoint_SlaveEndpointTest_NoAuthorizer_1_071jhZ/credential"
--default_role="*" --disk_watch_interval="1mins" --docker="docker" --docker_kill_orphans="true"
--docker_registry="https://registry-1.docker.io" --docker_remove_delay="6hrs" --docker_socket="/var/run/docker.sock"
--docker_stop_timeout="0ns" --docker_store_dir="/tmp/mesos/store/docker" --docker_volume_checkpoint_dir="/var/run/mesos/isolators/docker/volume"
--enforce_container_disk_quota="false" --executor_registration_timeout="1mins" --executor_reregistration_timeout="2secs"
--executor_secret_key="/tmp/Endpoint_SlaveEndpointTest_NoAuthorizer_1_071jhZ/executor_secret_key"
--executor_shutdown_grace_period="5secs" --fetcher_cache_dir="/tmp/Endpoint_SlaveEndpointTest_NoAuthorizer_1_071jhZ/fetch"
--fetcher_cache_size="2GB" --frameworks_home="" --gc_delay="1weeks" --gc_disk_headroom="0.1"
--hadoop_home="" --help="false" --hostname_lookup="true" --http_command_executor="false" --http_credentials="/tmp/Endpoint_SlaveEndpointTest_NoAuthorizer_1_071jhZ/http_credentials"
--http_heartbeat_interval="30secs" --initialize_driver_logging="true" --isolation="posix/cpu,posix/mem"
--launcher="posix" --launcher_dir="/mesos/mesos-1.4.0/_build/src" --logbufsecs="0" --logging_level="INFO"
--max_completed_executors_per_framework="150" --oversubscribed_resources_interval="15secs"
--perf_duration="10secs" --perf_interval="1mins" --port="5051" --qos_correction_interval_min="0ns"
--quiet="false" --recover="reconnect" --recovery_timeout="15mins" --registration_backoff_factor="10ms"
--resources="cpus:2;gpus:0;mem:1024;disk:1024;ports:[31000-32000]" --revocable_cpu_low_priority="true"
--runtime_dir="/tmp/Endpoint_SlaveEndpointTest_NoAuthorizer_1_071jhZ" --sandbox_directory="/mnt/mesos/sandbox"
--strict="true" --switch_user="true" --systemd_enable_support="true" --systemd_runtime_directory="/run/systemd/system"
--version="false" --work_dir="/tmp/Endpoint_SlaveEndpointTest_NoAuthorizer_1_2OCyvR"
I0526 18:47:18.974714 18999 credentials.hpp:86] Loading credential for authentication from
'/tmp/Endpoint_SlaveEndpointTest_NoAuthorizer_1_071jhZ/credential'
I0526 18:47:18.974957 18999 slave.cpp:265] Agent using credential for: test-principal
I0526 18:47:18.974985 18999 credentials.hpp:37] Loading credentials for authentication from
'/tmp/Endpoint_SlaveEndpointTest_NoAuthorizer_1_071jhZ/http_credentials'
I0526 18:47:18.975281 18999 http.cpp:975] Creating default 'basic' HTTP authenticator for
realm 'mesos-agent-executor'
I0526 18:47:18.975404 18999 http.cpp:996] Creating default 'jwt' HTTP authenticator for realm
'mesos-agent-executor'
I0526 18:47:18.975620 18999 http.cpp:975] Creating default 'basic' HTTP authenticator for
realm 'mesos-agent-readonly'
I0526 18:47:18.975724 18999 http.cpp:996] Creating default 'jwt' HTTP authenticator for realm
'mesos-agent-readonly'
I0526 18:47:18.976008 18999 http.cpp:975] Creating default 'basic' HTTP authenticator for
realm 'mesos-agent-readwrite'
I0526 18:47:18.976142 18999 http.cpp:996] Creating default 'jwt' HTTP authenticator for realm
'mesos-agent-readwrite'
I0526 18:47:18.977413 18999 slave.cpp:536] Agent resources: cpus(*):2; mem(*):1024; disk(*):1024;
ports(*):[31000-32000]
I0526 18:47:18.977486 18999 slave.cpp:544] Agent attributes: [  ]
I0526 18:47:18.977507 18999 slave.cpp:549] Agent hostname: f07777a7f72e
I0526 18:47:18.977643 19001 status_update_manager.cpp:177] Pausing sending status updates
I0526 18:47:18.978909 18991 state.cpp:62] Recovering state from '/tmp/Endpoint_SlaveEndpointTest_NoAuthorizer_1_2OCyvR/meta'
I0526 18:47:18.979239 18987 status_update_manager.cpp:203] Recovering status update manager
I0526 18:47:18.979508 18999 containerizer.cpp:582] Recovering containerizer
I0526 18:47:18.980906 18999 provisioner.cpp:416] Provisioner recovery complete
I0526 18:47:18.981324 18997 slave.cpp:6073] Finished recovery
I0526 18:47:18.981900 18997 slave.cpp:6255] Querying resource estimator for oversubscribable
resources
I0526 18:47:18.982189 18988 slave.cpp:6269] Received oversubscribable resources {} from the
resource estimator
I0526 18:47:18.984091 18989 process.cpp:3730] Handling HTTP event for process 'slave(758)'
with path: '/slave(758)/monitor/statistics.json'
I0526 18:47:18.985704 18989 http.cpp:1115] HTTP GET for /slave(758)/monitor/statistics.json
from 172.17.0.2:57006
I0526 18:47:18.985767 18989 http.cpp:936] Authorizing principal 'test-principal' to GET the
'/monitor/statistics.json' endpoint
I0526 18:47:18.988608 18998 slave.cpp:801] Agent terminating
[       OK ] Endpoint/SlaveEndpointTest.NoAuthorizer/1 (28 ms)
[ RUN      ] Endpoint/SlaveEndpointTest.NoAuthorizer/2
I0526 18:47:18.998613   749 containerizer.cpp:230] Using isolation: posix/cpu,posix/mem,filesystem/posix,network/cni,environment_secret
W0526 18:47:18.999085   749 backend.cpp:76] Failed to create 'aufs' backend: AufsBackend requires
root privileges
W0526 18:47:18.999177   749 backend.cpp:76] Failed to create 'bind' backend: BindBackend requires
root privileges
I0526 18:47:18.999210   749 provisioner.cpp:255] Using default backend 'copy'
I0526 18:47:19.000780   749 cluster.cpp:448] Creating default 'local' authorizer
I0526 18:47:19.002209 18993 slave.cpp:232] Mesos agent started on (759)@172.17.0.2:55980
I0526 18:47:19.002228 18993 slave.cpp:233] Flags at startup: --acls="" --appc_simple_discovery_uri_prefix="http://"
--appc_store_dir="/tmp/mesos/store/appc" --authenticate_http_executors="true" --authenticate_http_readonly="true"
--authenticate_http_readwrite="true" --authenticatee="crammd5" --authentication_backoff_factor="1secs"
--authorizer="local" --cgroups_cpu_enable_pids_and_tids_count="false" --cgroups_enable_cfs="false"
--cgroups_hierarchy="/sys/fs/cgroup" --cgroups_limit_swap="false" --cgroups_root="mesos" --container_disk_watch_interval="15secs"
--containerizers="mesos" --credential="/tmp/Endpoint_SlaveEndpointTest_NoAuthorizer_2_uId5Bu/credential"
--default_role="*" --disk_watch_interval="1mins" --docker="docker" --docker_kill_orphans="true"
--docker_registry="https://registry-1.docker.io" --docker_remove_delay="6hrs" --docker_socket="/var/run/docker.sock"
--docker_stop_timeout="0ns" --docker_store_dir="/tmp/mesos/store/docker" --docker_volume_checkpoint_dir="/var/run/mesos/isolators/docker/volume"
--enforce_container_disk_quota="false" --executor_registration_timeout="1mins" --executor_reregistration_timeout="2secs"
--executor_secret_key="/tmp/Endpoint_SlaveEndpointTest_NoAuthorizer_2_uId5Bu/executor_secret_key"
--executor_shutdown_grace_period="5secs" --fetcher_cache_dir="/tmp/Endpoint_SlaveEndpointTest_NoAuthorizer_2_uId5Bu/fetch"
--fetcher_cache_size="2GB" --frameworks_home="" --gc_delay="1weeks" --gc_disk_headroom="0.1"
--hadoop_home="" --help="false" --hostname_lookup="true" --http_command_executor="false" --http_credentials="/tmp/Endpoint_SlaveEndpointTest_NoAuthorizer_2_uId5Bu/http_credentials"
--http_heartbeat_interval="30secs" --initialize_driver_logging="true" --isolation="posix/cpu,posix/mem"
--launcher="posix" --launcher_dir="/mesos/mesos-1.4.0/_build/src" --logbufsecs="0" --logging_level="INFO"
--max_completed_executors_per_framework="150" --oversubscribed_resources_interval="15secs"
--perf_duration="10secs" --perf_interval="1mins" --port="5051" --qos_correction_interval_min="0ns"
--quiet="false" --recover="reconnect" --recovery_timeout="15mins" --registration_backoff_factor="10ms"
--resources="cpus:2;gpus:0;mem:1024;disk:1024;ports:[31000-32000]" --revocable_cpu_low_priority="true"
--runtime_dir="/tmp/Endpoint_SlaveEndpointTest_NoAuthorizer_2_uId5Bu" --sandbox_directory="/mnt/mesos/sandbox"
--strict="true" --switch_user="true" --systemd_enable_support="true" --systemd_runtime_directory="/run/systemd/system"
--version="false" --work_dir="/tmp/Endpoint_SlaveEndpointTest_NoAuthorizer_2_NQxJLm"
I0526 18:47:19.002594 18993 credentials.hpp:86] Loading credential for authentication from
'/tmp/Endpoint_SlaveEndpointTest_NoAuthorizer_2_uId5Bu/credential'
I0526 18:47:19.002763 18993 slave.cpp:265] Agent using credential for: test-principal
I0526 18:47:19.002786 18993 credentials.hpp:37] Loading credentials for authentication from
'/tmp/Endpoint_SlaveEndpointTest_NoAuthorizer_2_uId5Bu/http_credentials'
I0526 18:47:19.003089 18993 http.cpp:975] Creating default 'basic' HTTP authenticator for
realm 'mesos-agent-executor'
I0526 18:47:19.003211 18993 http.cpp:996] Creating default 'jwt' HTTP authenticator for realm
'mesos-agent-executor'
I0526 18:47:19.003453 18993 http.cpp:975] Creating default 'basic' HTTP authenticator for
realm 'mesos-agent-readonly'
I0526 18:47:19.003561 18993 http.cpp:996] Creating default 'jwt' HTTP authenticator for realm
'mesos-agent-readonly'
I0526 18:47:19.003762 18993 http.cpp:975] Creating default 'basic' HTTP authenticator for
realm 'mesos-agent-readwrite'
I0526 18:47:19.003842 18993 http.cpp:996] Creating default 'jwt' HTTP authenticator for realm
'mesos-agent-readwrite'
I0526 18:47:19.005137 18993 slave.cpp:536] Agent resources: cpus(*):2; mem(*):1024; disk(*):1024;
ports(*):[31000-32000]
I0526 18:47:19.005209 18993 slave.cpp:544] Agent attributes: [  ]
I0526 18:47:19.005223 18993 slave.cpp:549] Agent hostname: f07777a7f72e
I0526 18:47:19.005362 18996 status_update_manager.cpp:177] Pausing sending status updates
I0526 18:47:19.006676 18989 state.cpp:62] Recovering state from '/tmp/Endpoint_SlaveEndpointTest_NoAuthorizer_2_NQxJLm/meta'
I0526 18:47:19.006996 18995 status_update_manager.cpp:203] Recovering status update manager
I0526 18:47:19.007242 18998 containerizer.cpp:582] Recovering containerizer
I0526 18:47:19.008579 18990 provisioner.cpp:416] Provisioner recovery complete
I0526 18:47:19.008961 18999 slave.cpp:6073] Finished recovery
I0526 18:47:19.009562 18999 slave.cpp:6255] Querying resource estimator for oversubscribable
resources
I0526 18:47:19.009893 18997 slave.cpp:6269] Received oversubscribable resources {} from the
resource estimator
I0526 18:47:19.011826 18992 process.cpp:3730] Handling HTTP event for process 'slave(759)'
with path: '/slave(759)/containers'
I0526 18:47:19.013295 19000 http.cpp:1115] HTTP GET for /slave(759)/containers from 172.17.0.2:57007
I0526 18:47:19.013361 19000 http.cpp:936] Authorizing principal 'test-principal' to GET the
'/containers' endpoint
I0526 18:47:19.016006 18991 slave.cpp:801] Agent terminating
[       OK ] Endpoint/SlaveEndpointTest.NoAuthorizer/2 (27 ms)
[----------] 9 tests from Endpoint/SlaveEndpointTest (252 ms total)

[----------] Global test environment tear-down
[==========] 1587 tests from 178 test cases ran. (493673 ms total)
[  PASSED  ] 1586 tests.
[  FAILED  ] 1 test, listed below:
[  FAILED  ] MasterTest.IgnoreOldAgentReregistration

 1 FAILED TEST
  YOU HAVE 22 DISABLED TESTS

E0526 18:47:19.079643 19003 process.cpp:950] Failed to accept socket: future discarded
make[4]: *** [check-local] Error 1
make[4]: Leaving directory `/mesos/mesos-1.4.0/_build/src'
make[3]: *** [check-am] Error 2
make[3]: Leaving directory `/mesos/mesos-1.4.0/_build/src'
make[2]: *** [check] Error 2
make[2]: Leaving directory `/mesos/mesos-1.4.0/_build/src'
make[1]: *** [check-recursive] Error 1
make[1]: Leaving directory `/mesos/mesos-1.4.0/_build'
make: *** [distcheck] Error 1
+ docker rmi mesos-1495821540-17976
Untagged: mesos-1495821540-17976:latest
Deleted: sha256:3475e63291f28b60850d9382d4de7f0a9de43174f4b2fcfeff928366682b5232
Deleted: sha256:9982318b47491f296febcfb0f06ddd122dd08a171bf87f846c53ca73da6a8077
Deleted: sha256:e41707fe504cd7c193b851d2b9111fa6ce9df0526a4dad4d02e56c6c72c8e701
Deleted: sha256:9085eb8bfdc2f03053f1e6ffac2acb25036197d04e12f22a6249eaba98a39e9f
Deleted: sha256:1274f6285955fa1488b6c79da334fdb8565d148ee7e55705488c96615595b15c
Deleted: sha256:b0d0b4f00e29038bbce1f4cd8de4e86c03fb1a5e27bd7ac74fcc748c8422ad5b
Deleted: sha256:5ae6013135d5b68e6a01ace657447a12d9679f0aee3828fc85d2957064ea41b6
Deleted: sha256:ab76ff9fa37ea9a481e523016e5e1942376ec07b2286a61ee4849d1ebb6c1b72
Deleted: sha256:0a1de9716bc060c6f4ecd88846e167439cfc68fb06dc9699dea965be6e1d9eb2
Deleted: sha256:02fa7324edf51bf212720d9b4b2e6f41fee593fb64feddb4e9f87fa1db7054c4
Deleted: sha256:c77c0876f6cab1be7257af56940f909527b763c1f2be98badd180fd382b7eba1
Deleted: sha256:2b2619d10d18bee8a51418be704657895394cc66c1263725f9057623ab3b7294
Deleted: sha256:cca9a01e91411073e13b5fec08a0be67ed67bbd52958f1c3687fcdee13d478f2
Deleted: sha256:67d6ffaed1c89c51816cc1a438a0539351425f3ddeaa954292331270bb60ed1c
Deleted: sha256:ec697c647a6b4a0c9408c4647245b513a9660800efe7a881bb8a7e074c1c17ea
Deleted: sha256:6ab1ce63a4622cd9bf5f348cf8dc4282de48d3b7a3586e4d3386ad550cd69b8f
Deleted: sha256:380582977b8132148c4f445fcd3da9f97b1da19e8d25f25f41d90b1d99cf626c
Deleted: sha256:95e51c28f29ccd32a2314e604fde0906f9c880c6b685573adf138ea059a6486d
Deleted: sha256:f033f157a6239b6e32e18e55378d51968239ed4ba07564b4c6adfe6ffd036fac
Deleted: sha256:871b0d4421db1de4c4198d60d656acee3dc84f9e0950d97ab473e6057e33aff3
Deleted: sha256:ca4126ed86d5dfed758a705b40e5ff02a65f45c04727a2839e47da81cf3f5abb
Deleted: sha256:04330353b4be52983d40ba251981de8c642e97373feb2b06b629e8746cf1dfae
Deleted: sha256:da770513c3a89287d64f6e0e4fa5ed8b0f45e64488478ea6c7c5daf631af3df8
Deleted: sha256:dc58200eef0bd6e39cc5a2cc5c050a591c1cec86737bcafc451e5e6fbd85618c
Build step 'Execute shell' marked build as failure

Mime
View raw message