mesos-builds mailing list archives

Site index · List index
Message view « Date » · « Thread »
Top « Date » · « Thread »
From Yan Xu <...@jxu.me>
Subject Re: Build failed in Jenkins: Mesos-Buildbot » autotools,clang,--verbose,GLOG_v=1 MESOS_VERBOSE=1,ubuntu:14.04,(docker||Hadoop)&&(!ubuntu-us1)&&(!ubuntu-eu2) #3583
Date Sun, 30 Apr 2017 20:52:38 GMT
Filed https://issues.apache.org/jira/browse/MESOS-7441

James could you take a look?

---
Jiang Yan Xu <yan@jxu.me> | @xujyan <https://twitter.com/xujyan>

On Sat, Apr 29, 2017 at 12:04 PM, Apache Jenkins Server <
jenkins@builds.apache.org> wrote:

> See <https://builds.apache.org/job/Mesos-Buildbot/BUILDTOOL=
> autotools,COMPILER=clang,CONFIGURATION=--verbose,
> ENVIRONMENT=GLOG_v=1%20MESOS_VERBOSE=1,OS=ubuntu%3A14.04,
> label_exp=(docker%7C%7CHadoop)&&(!ubuntu-us1)&&(!ubuntu-eu2)
> /3583/display/redirect>
>
> ------------------------------------------
> [...truncated 26.93 MB...]
> I0429 19:03:58.227666 29142 slave.cpp:790] Agent terminating
> [       OK ] Endpoint/SlaveEndpointTest.AuthorizedRequest/1 (28 ms)
> [ RUN      ] Endpoint/SlaveEndpointTest.AuthorizedRequest/2
> I0429 19:03:58.241773 29109 containerizer.cpp:221] Using isolation:
> posix/cpu,posix/mem,filesystem/posix,network/cni
> W0429 19:03:58.242213 29109 backend.cpp:76] Failed to create 'aufs'
> backend: AufsBackend requires root privileges
> W0429 19:03:58.242311 29109 backend.cpp:76] Failed to create 'bind'
> backend: BindBackend requires root privileges
> I0429 19:03:58.242357 29109 provisioner.cpp:249] Using default backend
> 'copy'
> I0429 19:03:58.246700 29133 slave.cpp:225] Mesos agent started on (743)@
> 172.17.0.3:42932
> I0429 19:03:58.246747 29133 slave.cpp:226] Flags at startup: --acls=""
> --appc_simple_discovery_uri_prefix="http://" --appc_store_dir="/tmp/mesos/store/appc"
> --authenticate_http_readonly="true" --authenticate_http_readwrite="true"
> --authenticatee="crammd5" --authentication_backoff_factor="1secs"
> --authorizer="local" --cgroups_cpu_enable_pids_and_tids_count="false"
> --cgroups_enable_cfs="false" --cgroups_hierarchy="/sys/fs/cgroup"
> --cgroups_limit_swap="false" --cgroups_root="mesos" --container_disk_watch_interval="15secs"
> --containerizers="mesos" --credential="/tmp/Endpoint_SlaveEndpointTest_
> AuthorizedRequest_2_myTlAZ/credential" --default_role="*"
> --disk_watch_interval="1mins" --docker="docker"
> --docker_kill_orphans="true" --docker_registry="https://
> registry-1.docker.io" --docker_remove_delay="6hrs"
> --docker_socket="/var/run/docker.sock" --docker_stop_timeout="0ns"
> --docker_store_dir="/tmp/mesos/store/docker" --docker_volume_checkpoint_
> dir="/var/run/mesos/isolators/docker/volume" --enforce_container_disk_quota="false"
> --executor_registration_timeout="1mins" --executor_shutdown_grace_period="5secs"
> --fetcher_cache_dir="/tmp/Endpoint_SlaveEndpointTest_
> AuthorizedRequest_2_myTlAZ/fetch" --fetcher_cache_size="2GB"
> --frameworks_home="" --gc_delay="1weeks" --gc_disk_headroom="0.1"
> --hadoop_home="" --help="false" --hostname_lookup="true"
> --http_command_executor="false" --http_credentials="/tmp/
> Endpoint_SlaveEndpointTest_AuthorizedRequest_2_myTlAZ/http_credentials"
> --http_heartbeat_interval="30secs" --initialize_driver_logging="true"
> --isolation="posix/cpu,posix/mem" --launcher="posix"
> --launcher_dir="/mesos/mesos-1.3.0/_build/src" --logbufsecs="0"
> --logging_level="INFO" --max_completed_executors_per_framework="150"
> --oversubscribed_resources_interval="15secs" --perf_duration="10secs"
> --perf_interval="1mins" --port="5051" --qos_correction_interval_min="0ns"
> --quiet="false" --recover="reconnect" --recovery_timeout="15mins"
> --registration_backoff_factor="10ms" --resources="cpus:2;gpus:0;
> mem:1024;disk:1024;ports:[31000-32000]" --revocable_cpu_low_priority="true"
> --runtime_dir="/tmp/Endpoint_SlaveEndpointTest_AuthorizedRequest_2_myTlAZ"
> --sandbox_directory="/mnt/mesos/sandbox" --strict="true"
> --switch_user="true" --systemd_enable_support="true"
> --systemd_runtime_directory="/run/systemd/system" --version="false"
> --work_dir="/tmp/Endpoint_SlaveEndpointTest_AuthorizedRequest_2_bzYbU1"
> I0429 19:03:58.247407 29133 credentials.hpp:86] Loading credential for
> authentication from '/tmp/Endpoint_SlaveEndpointTest_
> AuthorizedRequest_2_myTlAZ/credential'
> I0429 19:03:58.247630 29133 slave.cpp:258] Agent using credential for:
> test-principal
> I0429 19:03:58.247663 29133 credentials.hpp:37] Loading credentials for
> authentication from '/tmp/Endpoint_SlaveEndpointTest_
> AuthorizedRequest_2_myTlAZ/http_credentials'
> I0429 19:03:58.248044 29133 http.cpp:975] Creating default 'basic' HTTP
> authenticator for realm 'mesos-agent-readonly'
> I0429 19:03:58.248255 29133 http.cpp:975] Creating default 'basic' HTTP
> authenticator for realm 'mesos-agent-readwrite'
> I0429 19:03:58.249967 29133 slave.cpp:525] Agent resources: cpus(*):2;
> mem(*):1024; disk(*):1024; ports(*):[31000-32000]
> I0429 19:03:58.250071 29133 slave.cpp:533] Agent attributes: [  ]
> I0429 19:03:58.250084 29133 slave.cpp:538] Agent hostname: 53b2d40935db
> I0429 19:03:58.250252 29129 status_update_manager.cpp:177] Pausing sending
> status updates
> I0429 19:03:58.251636 29142 state.cpp:62] Recovering state from
> '/tmp/Endpoint_SlaveEndpointTest_AuthorizedRequest_2_bzYbU1/meta'
> I0429 19:03:58.251899 29131 status_update_manager.cpp:203] Recovering
> status update manager
> I0429 19:03:58.252077 29137 containerizer.cpp:608] Recovering containerizer
> I0429 19:03:58.253283 29128 provisioner.cpp:410] Provisioner recovery
> complete
> I0429 19:03:58.253593 29131 slave.cpp:5963] Finished recovery
> I0429 19:03:58.254017 29131 slave.cpp:6145] Querying resource estimator
> for oversubscribable resources
> I0429 19:03:58.254328 29135 slave.cpp:6159] Received oversubscribable
> resources {} from the resource estimator
> I0429 19:03:58.256559 29139 process.cpp:3731] Handling HTTP event for
> process 'slave(743)' with path: '/slave(743)/containers'
> I0429 19:03:58.257761 29137 http.cpp:1115] HTTP GET for
> /slave(743)/containers from 172.17.0.3:52445
> I0429 19:03:58.257833 29137 http.cpp:936] Authorizing principal
> 'test-principal' to GET the '/containers' endpoint
> I0429 19:03:58.261073 29133 slave.cpp:790] Agent terminating
> [       OK ] Endpoint/SlaveEndpointTest.AuthorizedRequest/2 (30 ms)
> [ RUN      ] Endpoint/SlaveEndpointTest.UnauthorizedRequest/0
> I0429 19:03:58.277621 29109 containerizer.cpp:221] Using isolation:
> posix/cpu,posix/mem,filesystem/posix,network/cni
> W0429 19:03:58.278041 29109 backend.cpp:76] Failed to create 'aufs'
> backend: AufsBackend requires root privileges
> W0429 19:03:58.278133 29109 backend.cpp:76] Failed to create 'bind'
> backend: BindBackend requires root privileges
> I0429 19:03:58.278172 29109 provisioner.cpp:249] Using default backend
> 'copy'
> I0429 19:03:58.281497 29142 slave.cpp:225] Mesos agent started on (744)@
> 172.17.0.3:42932
> I0429 19:03:58.281532 29142 slave.cpp:226] Flags at startup: --acls=""
> --appc_simple_discovery_uri_prefix="http://" --appc_store_dir="/tmp/mesos/store/appc"
> --authenticate_http_readonly="true" --authenticate_http_readwrite="true"
> --authenticatee="crammd5" --authentication_backoff_factor="1secs"
> --authorizer="local" --cgroups_cpu_enable_pids_and_tids_count="false"
> --cgroups_enable_cfs="false" --cgroups_hierarchy="/sys/fs/cgroup"
> --cgroups_limit_swap="false" --cgroups_root="mesos" --container_disk_watch_interval="15secs"
> --containerizers="mesos" --credential="/tmp/Endpoint_SlaveEndpointTest_
> UnauthorizedRequest_0_MawZCQ/credential" --default_role="*"
> --disk_watch_interval="1mins" --docker="docker"
> --docker_kill_orphans="true" --docker_registry="https://
> registry-1.docker.io" --docker_remove_delay="6hrs"
> --docker_socket="/var/run/docker.sock" --docker_stop_timeout="0ns"
> --docker_store_dir="/tmp/mesos/store/docker" --docker_volume_checkpoint_
> dir="/var/run/mesos/isolators/docker/volume" --enforce_container_disk_quota="false"
> --executor_registration_timeout="1mins" --executor_shutdown_grace_period="5secs"
> --fetcher_cache_dir="/tmp/Endpoint_SlaveEndpointTest_
> UnauthorizedRequest_0_MawZCQ/fetch" --fetcher_cache_size="2GB"
> --frameworks_home="" --gc_delay="1weeks" --gc_disk_headroom="0.1"
> --hadoop_home="" --help="false" --hostname_lookup="true"
> --http_command_executor="false" --http_credentials="/tmp/
> Endpoint_SlaveEndpointTest_UnauthorizedRequest_0_MawZCQ/http_credentials"
> --http_heartbeat_interval="30secs" --initialize_driver_logging="true"
> --isolation="posix/cpu,posix/mem" --launcher="posix"
> --launcher_dir="/mesos/mesos-1.3.0/_build/src" --logbufsecs="0"
> --logging_level="INFO" --max_completed_executors_per_framework="150"
> --oversubscribed_resources_interval="15secs" --perf_duration="10secs"
> --perf_interval="1mins" --port="5051" --qos_correction_interval_min="0ns"
> --quiet="false" --recover="reconnect" --recovery_timeout="15mins"
> --registration_backoff_factor="10ms" --resources="cpus:2;gpus:0;
> mem:1024;disk:1024;ports:[31000-32000]" --revocable_cpu_low_priority="true"
> --runtime_dir="/tmp/Endpoint_SlaveEndpointTest_UnauthorizedRequest_0_MawZCQ"
> --sandbox_directory="/mnt/mesos/sandbox" --strict="true"
> --switch_user="true" --systemd_enable_support="true"
> --systemd_runtime_directory="/run/systemd/system" --version="false"
> --work_dir="/tmp/Endpoint_SlaveEndpointTest_UnauthorizedRequest_0_xZ7RQS"
> I0429 19:03:58.281901 29142 credentials.hpp:86] Loading credential for
> authentication from '/tmp/Endpoint_SlaveEndpointTest_
> UnauthorizedRequest_0_MawZCQ/credential'
> I0429 19:03:58.282127 29142 slave.cpp:258] Agent using credential for:
> test-principal
> I0429 19:03:58.282171 29142 credentials.hpp:37] Loading credentials for
> authentication from '/tmp/Endpoint_SlaveEndpointTest_
> UnauthorizedRequest_0_MawZCQ/http_credentials'
> I0429 19:03:58.282507 29142 http.cpp:975] Creating default 'basic' HTTP
> authenticator for realm 'mesos-agent-readonly'
> I0429 19:03:58.282696 29142 http.cpp:975] Creating default 'basic' HTTP
> authenticator for realm 'mesos-agent-readwrite'
> I0429 19:03:58.284569 29142 slave.cpp:525] Agent resources: cpus(*):2;
> mem(*):1024; disk(*):1024; ports(*):[31000-32000]
> I0429 19:03:58.284643 29142 slave.cpp:533] Agent attributes: [  ]
> I0429 19:03:58.284654 29142 slave.cpp:538] Agent hostname: 53b2d40935db
> I0429 19:03:58.284819 29141 status_update_manager.cpp:177] Pausing sending
> status updates
> I0429 19:03:58.286016 29136 state.cpp:62] Recovering state from
> '/tmp/Endpoint_SlaveEndpointTest_UnauthorizedRequest_0_xZ7RQS/meta'
> I0429 19:03:58.286465 29127 status_update_manager.cpp:203] Recovering
> status update manager
> I0429 19:03:58.286689 29135 containerizer.cpp:608] Recovering containerizer
> I0429 19:03:58.288401 29136 provisioner.cpp:410] Provisioner recovery
> complete
> I0429 19:03:58.288933 29131 slave.cpp:5963] Finished recovery
> I0429 19:03:58.289497 29131 slave.cpp:6145] Querying resource estimator
> for oversubscribable resources
> I0429 19:03:58.289743 29129 slave.cpp:6159] Received oversubscribable
> resources {} from the resource estimator
> I0429 19:03:58.292048 29138 process.cpp:3731] Handling HTTP event for
> process 'slave(744)' with path: '/slave(744)/monitor/statistics'
> I0429 19:03:58.293339 29134 http.cpp:1115] HTTP GET for
> /slave(744)/monitor/statistics from 172.17.0.3:52446
> I0429 19:03:58.293413 29134 http.cpp:936] Authorizing principal
> 'test-principal' to GET the '/monitor/statistics' endpoint
> I0429 19:03:58.296222 29135 slave.cpp:790] Agent terminating
> [       OK ] Endpoint/SlaveEndpointTest.UnauthorizedRequest/0 (29 ms)
> [ RUN      ] Endpoint/SlaveEndpointTest.UnauthorizedRequest/1
> I0429 19:03:58.312897 29109 containerizer.cpp:221] Using isolation:
> posix/cpu,posix/mem,filesystem/posix,network/cni
> W0429 19:03:58.313470 29109 backend.cpp:76] Failed to create 'aufs'
> backend: AufsBackend requires root privileges
> W0429 19:03:58.313585 29109 backend.cpp:76] Failed to create 'bind'
> backend: BindBackend requires root privileges
> I0429 19:03:58.313626 29109 provisioner.cpp:249] Using default backend
> 'copy'
> I0429 19:03:58.317093 29135 slave.cpp:225] Mesos agent started on (745)@
> 172.17.0.3:42932
> I0429 19:03:58.317129 29135 slave.cpp:226] Flags at startup: --acls=""
> --appc_simple_discovery_uri_prefix="http://" --appc_store_dir="/tmp/mesos/store/appc"
> --authenticate_http_readonly="true" --authenticate_http_readwrite="true"
> --authenticatee="crammd5" --authentication_backoff_factor="1secs"
> --authorizer="local" --cgroups_cpu_enable_pids_and_tids_count="false"
> --cgroups_enable_cfs="false" --cgroups_hierarchy="/sys/fs/cgroup"
> --cgroups_limit_swap="false" --cgroups_root="mesos" --container_disk_watch_interval="15secs"
> --containerizers="mesos" --credential="/tmp/Endpoint_SlaveEndpointTest_
> UnauthorizedRequest_1_MjX11H/credential" --default_role="*"
> --disk_watch_interval="1mins" --docker="docker"
> --docker_kill_orphans="true" --docker_registry="https://
> registry-1.docker.io" --docker_remove_delay="6hrs"
> --docker_socket="/var/run/docker.sock" --docker_stop_timeout="0ns"
> --docker_store_dir="/tmp/mesos/store/docker" --docker_volume_checkpoint_
> dir="/var/run/mesos/isolators/docker/volume" --enforce_container_disk_quota="false"
> --executor_registration_timeout="1mins" --executor_shutdown_grace_period="5secs"
> --fetcher_cache_dir="/tmp/Endpoint_SlaveEndpointTest_
> UnauthorizedRequest_1_MjX11H/fetch" --fetcher_cache_size="2GB"
> --frameworks_home="" --gc_delay="1weeks" --gc_disk_headroom="0.1"
> --hadoop_home="" --help="false" --hostname_lookup="true"
> --http_command_executor="false" --http_credentials="/tmp/
> Endpoint_SlaveEndpointTest_UnauthorizedRequest_1_MjX11H/http_credentials"
> --http_heartbeat_interval="30secs" --initialize_driver_logging="true"
> --isolation="posix/cpu,posix/mem" --launcher="posix"
> --launcher_dir="/mesos/mesos-1.3.0/_build/src" --logbufsecs="0"
> --logging_level="INFO" --max_completed_executors_per_framework="150"
> --oversubscribed_resources_interval="15secs" --perf_duration="10secs"
> --perf_interval="1mins" --port="5051" --qos_correction_interval_min="0ns"
> --quiet="false" --recover="reconnect" --recovery_timeout="15mins"
> --registration_backoff_factor="10ms" --resources="cpus:2;gpus:0;
> mem:1024;disk:1024;ports:[31000-32000]" --revocable_cpu_low_priority="true"
> --runtime_dir="/tmp/Endpoint_SlaveEndpointTest_UnauthorizedRequest_1_MjX11H"
> --sandbox_directory="/mnt/mesos/sandbox" --strict="true"
> --switch_user="true" --systemd_enable_support="true"
> --systemd_runtime_directory="/run/systemd/system" --version="false"
> --work_dir="/tmp/Endpoint_SlaveEndpointTest_UnauthorizedRequest_1_1OKkaK"
> I0429 19:03:58.317585 29135 credentials.hpp:86] Loading credential for
> authentication from '/tmp/Endpoint_SlaveEndpointTest_
> UnauthorizedRequest_1_MjX11H/credential'
> I0429 19:03:58.317735 29135 slave.cpp:258] Agent using credential for:
> test-principal
> I0429 19:03:58.317754 29135 credentials.hpp:37] Loading credentials for
> authentication from '/tmp/Endpoint_SlaveEndpointTest_
> UnauthorizedRequest_1_MjX11H/http_credentials'
> I0429 19:03:58.317937 29135 http.cpp:975] Creating default 'basic' HTTP
> authenticator for realm 'mesos-agent-readonly'
> I0429 19:03:58.318045 29135 http.cpp:975] Creating default 'basic' HTTP
> authenticator for realm 'mesos-agent-readwrite'
> I0429 19:03:58.319435 29135 slave.cpp:525] Agent resources: cpus(*):2;
> mem(*):1024; disk(*):1024; ports(*):[31000-32000]
> I0429 19:03:58.319509 29135 slave.cpp:533] Agent attributes: [  ]
> I0429 19:03:58.319520 29135 slave.cpp:538] Agent hostname: 53b2d40935db
> I0429 19:03:58.319654 29132 status_update_manager.cpp:177] Pausing sending
> status updates
> I0429 19:03:58.321002 29139 state.cpp:62] Recovering state from
> '/tmp/Endpoint_SlaveEndpointTest_UnauthorizedRequest_1_1OKkaK/meta'
> I0429 19:03:58.321331 29135 status_update_manager.cpp:203] Recovering
> status update manager
> I0429 19:03:58.321630 29139 containerizer.cpp:608] Recovering containerizer
> I0429 19:03:58.322999 29135 provisioner.cpp:410] Provisioner recovery
> complete
> I0429 19:03:58.323487 29141 slave.cpp:5963] Finished recovery
> I0429 19:03:58.323915 29141 slave.cpp:6145] Querying resource estimator
> for oversubscribable resources
> I0429 19:03:58.324232 29134 slave.cpp:6159] Received oversubscribable
> resources {} from the resource estimator
> I0429 19:03:58.326617 29132 process.cpp:3731] Handling HTTP event for
> process 'slave(745)' with path: '/slave(745)/monitor/statistics.json'
> I0429 19:03:58.327939 29133 http.cpp:1115] HTTP GET for
> /slave(745)/monitor/statistics.json from 172.17.0.3:52447
> I0429 19:03:58.328003 29133 http.cpp:936] Authorizing principal
> 'test-principal' to GET the '/monitor/statistics.json' endpoint
> I0429 19:03:58.331091 29135 slave.cpp:790] Agent terminating
> [       OK ] Endpoint/SlaveEndpointTest.UnauthorizedRequest/1 (28 ms)
> [ RUN      ] Endpoint/SlaveEndpointTest.UnauthorizedRequest/2
> I0429 19:03:58.345543 29109 containerizer.cpp:221] Using isolation:
> posix/cpu,posix/mem,filesystem/posix,network/cni
> W0429 19:03:58.345963 29109 backend.cpp:76] Failed to create 'aufs'
> backend: AufsBackend requires root privileges
> W0429 19:03:58.346065 29109 backend.cpp:76] Failed to create 'bind'
> backend: BindBackend requires root privileges
> I0429 19:03:58.346143 29109 provisioner.cpp:249] Using default backend
> 'copy'
> I0429 19:03:58.349212 29140 slave.cpp:225] Mesos agent started on (746)@
> 172.17.0.3:42932
> I0429 19:03:58.349259 29140 slave.cpp:226] Flags at startup: --acls=""
> --appc_simple_discovery_uri_prefix="http://" --appc_store_dir="/tmp/mesos/store/appc"
> --authenticate_http_readonly="true" --authenticate_http_readwrite="true"
> --authenticatee="crammd5" --authentication_backoff_factor="1secs"
> --authorizer="local" --cgroups_cpu_enable_pids_and_tids_count="false"
> --cgroups_enable_cfs="false" --cgroups_hierarchy="/sys/fs/cgroup"
> --cgroups_limit_swap="false" --cgroups_root="mesos" --container_disk_watch_interval="15secs"
> --containerizers="mesos" --credential="/tmp/Endpoint_SlaveEndpointTest_
> UnauthorizedRequest_2_CY82Mz/credential" --default_role="*"
> --disk_watch_interval="1mins" --docker="docker"
> --docker_kill_orphans="true" --docker_registry="https://
> registry-1.docker.io" --docker_remove_delay="6hrs"
> --docker_socket="/var/run/docker.sock" --docker_stop_timeout="0ns"
> --docker_store_dir="/tmp/mesos/store/docker" --docker_volume_checkpoint_
> dir="/var/run/mesos/isolators/docker/volume" --enforce_container_disk_quota="false"
> --executor_registration_timeout="1mins" --executor_shutdown_grace_period="5secs"
> --fetcher_cache_dir="/tmp/Endpoint_SlaveEndpointTest_
> UnauthorizedRequest_2_CY82Mz/fetch" --fetcher_cache_size="2GB"
> --frameworks_home="" --gc_delay="1weeks" --gc_disk_headroom="0.1"
> --hadoop_home="" --help="false" --hostname_lookup="true"
> --http_command_executor="false" --http_credentials="/tmp/
> Endpoint_SlaveEndpointTest_UnauthorizedRequest_2_CY82Mz/http_credentials"
> --http_heartbeat_interval="30secs" --initialize_driver_logging="true"
> --isolation="posix/cpu,posix/mem" --launcher="posix"
> --launcher_dir="/mesos/mesos-1.3.0/_build/src" --logbufsecs="0"
> --logging_level="INFO" --max_completed_executors_per_framework="150"
> --oversubscribed_resources_interval="15secs" --perf_duration="10secs"
> --perf_interval="1mins" --port="5051" --qos_correction_interval_min="0ns"
> --quiet="false" --recover="reconnect" --recovery_timeout="15mins"
> --registration_backoff_factor="10ms" --resources="cpus:2;gpus:0;
> mem:1024;disk:1024;ports:[31000-32000]" --revocable_cpu_low_priority="true"
> --runtime_dir="/tmp/Endpoint_SlaveEndpointTest_UnauthorizedRequest_2_CY82Mz"
> --sandbox_directory="/mnt/mesos/sandbox" --strict="true"
> --switch_user="true" --systemd_enable_support="true"
> --systemd_runtime_directory="/run/systemd/system" --version="false"
> --work_dir="/tmp/Endpoint_SlaveEndpointTest_UnauthorizedRequest_2_fvLUPB"
> I0429 19:03:58.349710 29140 credentials.hpp:86] Loading credential for
> authentication from '/tmp/Endpoint_SlaveEndpointTest_
> UnauthorizedRequest_2_CY82Mz/credential'
> I0429 19:03:58.349869 29140 slave.cpp:258] Agent using credential for:
> test-principal
> I0429 19:03:58.349895 29140 credentials.hpp:37] Loading credentials for
> authentication from '/tmp/Endpoint_SlaveEndpointTest_
> UnauthorizedRequest_2_CY82Mz/http_credentials'
> I0429 19:03:58.350152 29140 http.cpp:975] Creating default 'basic' HTTP
> authenticator for realm 'mesos-agent-readonly'
> I0429 19:03:58.350332 29140 http.cpp:975] Creating default 'basic' HTTP
> authenticator for realm 'mesos-agent-readwrite'
> I0429 19:03:58.352110 29140 slave.cpp:525] Agent resources: cpus(*):2;
> mem(*):1024; disk(*):1024; ports(*):[31000-32000]
> I0429 19:03:58.352210 29140 slave.cpp:533] Agent attributes: [  ]
> I0429 19:03:58.352226 29140 slave.cpp:538] Agent hostname: 53b2d40935db
> I0429 19:03:58.352394 29136 status_update_manager.cpp:177] Pausing sending
> status updates
> I0429 19:03:58.353834 29128 state.cpp:62] Recovering state from
> '/tmp/Endpoint_SlaveEndpointTest_UnauthorizedRequest_2_fvLUPB/meta'
> I0429 19:03:58.354070 29136 status_update_manager.cpp:203] Recovering
> status update manager
> I0429 19:03:58.354404 29136 containerizer.cpp:608] Recovering containerizer
> I0429 19:03:58.355621 29136 provisioner.cpp:410] Provisioner recovery
> complete
> I0429 19:03:58.355942 29142 slave.cpp:5963] Finished recovery
> I0429 19:03:58.356335 29142 slave.cpp:6145] Querying resource estimator
> for oversubscribable resources
> I0429 19:03:58.356581 29131 slave.cpp:6159] Received oversubscribable
> resources {} from the resource estimator
> I0429 19:03:58.358561 29129 process.cpp:3731] Handling HTTP event for
> process 'slave(746)' with path: '/slave(746)/containers'
> I0429 19:03:58.359760 29131 http.cpp:1115] HTTP GET for
> /slave(746)/containers from 172.17.0.3:52448
> I0429 19:03:58.359819 29131 http.cpp:936] Authorizing principal
> 'test-principal' to GET the '/containers' endpoint
> I0429 19:03:58.362304 29131 slave.cpp:790] Agent terminating
> [       OK ] Endpoint/SlaveEndpointTest.UnauthorizedRequest/2 (25 ms)
> [ RUN      ] Endpoint/SlaveEndpointTest.NoAuthorizer/0
> I0429 19:03:58.374527 29109 containerizer.cpp:221] Using isolation:
> posix/cpu,posix/mem,filesystem/posix,network/cni
> W0429 19:03:58.374963 29109 backend.cpp:76] Failed to create 'aufs'
> backend: AufsBackend requires root privileges
> W0429 19:03:58.375056 29109 backend.cpp:76] Failed to create 'bind'
> backend: BindBackend requires root privileges
> I0429 19:03:58.375093 29109 provisioner.cpp:249] Using default backend
> 'copy'
> I0429 19:03:58.376444 29109 cluster.cpp:448] Creating default 'local'
> authorizer
> I0429 19:03:58.377816 29134 slave.cpp:225] Mesos agent started on (747)@
> 172.17.0.3:42932
> I0429 19:03:58.377861 29134 slave.cpp:226] Flags at startup: --acls=""
> --appc_simple_discovery_uri_prefix="http://" --appc_store_dir="/tmp/mesos/store/appc"
> --authenticate_http_readonly="true" --authenticate_http_readwrite="true"
> --authenticatee="crammd5" --authentication_backoff_factor="1secs"
> --authorizer="local" --cgroups_cpu_enable_pids_and_tids_count="false"
> --cgroups_enable_cfs="false" --cgroups_hierarchy="/sys/fs/cgroup"
> --cgroups_limit_swap="false" --cgroups_root="mesos" --container_disk_watch_interval="15secs"
> --containerizers="mesos" --credential="/tmp/Endpoint_SlaveEndpointTest_
> NoAuthorizer_0_eSKtRr/credential" --default_role="*"
> --disk_watch_interval="1mins" --docker="docker"
> --docker_kill_orphans="true" --docker_registry="https://
> registry-1.docker.io" --docker_remove_delay="6hrs"
> --docker_socket="/var/run/docker.sock" --docker_stop_timeout="0ns"
> --docker_store_dir="/tmp/mesos/store/docker" --docker_volume_checkpoint_
> dir="/var/run/mesos/isolators/docker/volume" --enforce_container_disk_quota="false"
> --executor_registration_timeout="1mins" --executor_shutdown_grace_period="5secs"
> --fetcher_cache_dir="/tmp/Endpoint_SlaveEndpointTest_NoAuthorizer_0_eSKtRr/fetch"
> --fetcher_cache_size="2GB" --frameworks_home="" --gc_delay="1weeks"
> --gc_disk_headroom="0.1" --hadoop_home="" --help="false"
> --hostname_lookup="true" --http_command_executor="false"
> --http_credentials="/tmp/Endpoint_SlaveEndpointTest_
> NoAuthorizer_0_eSKtRr/http_credentials" --http_heartbeat_interval="30secs"
> --initialize_driver_logging="true" --isolation="posix/cpu,posix/mem"
> --launcher="posix" --launcher_dir="/mesos/mesos-1.3.0/_build/src"
> --logbufsecs="0" --logging_level="INFO" --max_completed_executors_per_framework="150"
> --oversubscribed_resources_interval="15secs" --perf_duration="10secs"
> --perf_interval="1mins" --port="5051" --qos_correction_interval_min="0ns"
> --quiet="false" --recover="reconnect" --recovery_timeout="15mins"
> --registration_backoff_factor="10ms" --resources="cpus:2;gpus:0;
> mem:1024;disk:1024;ports:[31000-32000]" --revocable_cpu_low_priority="true"
> --runtime_dir="/tmp/Endpoint_SlaveEndpointTest_NoAuthorizer_0_eSKtRr"
> --sandbox_directory="/mnt/mesos/sandbox" --strict="true"
> --switch_user="true" --systemd_enable_support="true"
> --systemd_runtime_directory="/run/systemd/system" --version="false"
> --work_dir="/tmp/Endpoint_SlaveEndpointTest_NoAuthorizer_0_LUeEPt"
> I0429 19:03:58.378362 29134 credentials.hpp:86] Loading credential for
> authentication from '/tmp/Endpoint_SlaveEndpointTest_
> NoAuthorizer_0_eSKtRr/credential'
> I0429 19:03:58.378520 29134 slave.cpp:258] Agent using credential for:
> test-principal
> I0429 19:03:58.378545 29134 credentials.hpp:37] Loading credentials for
> authentication from '/tmp/Endpoint_SlaveEndpointTest_
> NoAuthorizer_0_eSKtRr/http_credentials'
> I0429 19:03:58.378798 29134 http.cpp:975] Creating default 'basic' HTTP
> authenticator for realm 'mesos-agent-readonly'
> I0429 19:03:58.378942 29134 http.cpp:975] Creating default 'basic' HTTP
> authenticator for realm 'mesos-agent-readwrite'
> I0429 19:03:58.380726 29134 slave.cpp:525] Agent resources: cpus(*):2;
> mem(*):1024; disk(*):1024; ports(*):[31000-32000]
> I0429 19:03:58.380825 29134 slave.cpp:533] Agent attributes: [  ]
> I0429 19:03:58.380841 29134 slave.cpp:538] Agent hostname: 53b2d40935db
> I0429 19:03:58.380961 29127 status_update_manager.cpp:177] Pausing sending
> status updates
> I0429 19:03:58.382364 29130 state.cpp:62] Recovering state from
> '/tmp/Endpoint_SlaveEndpointTest_NoAuthorizer_0_LUeEPt/meta'
> I0429 19:03:58.382684 29136 status_update_manager.cpp:203] Recovering
> status update manager
> I0429 19:03:58.382925 29130 containerizer.cpp:608] Recovering containerizer
> I0429 19:03:58.384488 29139 provisioner.cpp:410] Provisioner recovery
> complete
> I0429 19:03:58.385054 29140 slave.cpp:5963] Finished recovery
> I0429 19:03:58.385522 29140 slave.cpp:6145] Querying resource estimator
> for oversubscribable resources
> I0429 19:03:58.385710 29140 slave.cpp:6159] Received oversubscribable
> resources {} from the resource estimator
> I0429 19:03:58.387948 29141 process.cpp:3731] Handling HTTP event for
> process 'slave(747)' with path: '/slave(747)/monitor/statistics'
> I0429 19:03:58.389286 29139 http.cpp:1115] HTTP GET for
> /slave(747)/monitor/statistics from 172.17.0.3:52449
> I0429 19:03:58.389367 29139 http.cpp:936] Authorizing principal
> 'test-principal' to GET the '/monitor/statistics' endpoint
> I0429 19:03:58.393774 29132 slave.cpp:790] Agent terminating
> [       OK ] Endpoint/SlaveEndpointTest.NoAuthorizer/0 (30 ms)
> [ RUN      ] Endpoint/SlaveEndpointTest.NoAuthorizer/1
> I0429 19:03:58.408012 29109 containerizer.cpp:221] Using isolation:
> posix/cpu,posix/mem,filesystem/posix,network/cni
> W0429 19:03:58.408625 29109 backend.cpp:76] Failed to create 'aufs'
> backend: AufsBackend requires root privileges
> W0429 19:03:58.408751 29109 backend.cpp:76] Failed to create 'bind'
> backend: BindBackend requires root privileges
> I0429 19:03:58.408799 29109 provisioner.cpp:249] Using default backend
> 'copy'
> I0429 19:03:58.410573 29109 cluster.cpp:448] Creating default 'local'
> authorizer
> I0429 19:03:58.412359 29136 slave.cpp:225] Mesos agent started on (748)@
> 172.17.0.3:42932
> I0429 19:03:58.412410 29136 slave.cpp:226] Flags at startup: --acls=""
> --appc_simple_discovery_uri_prefix="http://" --appc_store_dir="/tmp/mesos/store/appc"
> --authenticate_http_readonly="true" --authenticate_http_readwrite="true"
> --authenticatee="crammd5" --authentication_backoff_factor="1secs"
> --authorizer="local" --cgroups_cpu_enable_pids_and_tids_count="false"
> --cgroups_enable_cfs="false" --cgroups_hierarchy="/sys/fs/cgroup"
> --cgroups_limit_swap="false" --cgroups_root="mesos" --container_disk_watch_interval="15secs"
> --containerizers="mesos" --credential="/tmp/Endpoint_SlaveEndpointTest_
> NoAuthorizer_1_iLIpgk/credential" --default_role="*"
> --disk_watch_interval="1mins" --docker="docker"
> --docker_kill_orphans="true" --docker_registry="https://
> registry-1.docker.io" --docker_remove_delay="6hrs"
> --docker_socket="/var/run/docker.sock" --docker_stop_timeout="0ns"
> --docker_store_dir="/tmp/mesos/store/docker" --docker_volume_checkpoint_
> dir="/var/run/mesos/isolators/docker/volume" --enforce_container_disk_quota="false"
> --executor_registration_timeout="1mins" --executor_shutdown_grace_period="5secs"
> --fetcher_cache_dir="/tmp/Endpoint_SlaveEndpointTest_NoAuthorizer_1_iLIpgk/fetch"
> --fetcher_cache_size="2GB" --frameworks_home="" --gc_delay="1weeks"
> --gc_disk_headroom="0.1" --hadoop_home="" --help="false"
> --hostname_lookup="true" --http_command_executor="false"
> --http_credentials="/tmp/Endpoint_SlaveEndpointTest_
> NoAuthorizer_1_iLIpgk/http_credentials" --http_heartbeat_interval="30secs"
> --initialize_driver_logging="true" --isolation="posix/cpu,posix/mem"
> --launcher="posix" --launcher_dir="/mesos/mesos-1.3.0/_build/src"
> --logbufsecs="0" --logging_level="INFO" --max_completed_executors_per_framework="150"
> --oversubscribed_resources_interval="15secs" --perf_duration="10secs"
> --perf_interval="1mins" --port="5051" --qos_correction_interval_min="0ns"
> --quiet="false" --recover="reconnect" --recovery_timeout="15mins"
> --registration_backoff_factor="10ms" --resources="cpus:2;gpus:0;
> mem:1024;disk:1024;ports:[31000-32000]" --revocable_cpu_low_priority="true"
> --runtime_dir="/tmp/Endpoint_SlaveEndpointTest_NoAuthorizer_1_iLIpgk"
> --sandbox_directory="/mnt/mesos/sandbox" --strict="true"
> --switch_user="true" --systemd_enable_support="true"
> --systemd_runtime_directory="/run/systemd/system" --version="false"
> --work_dir="/tmp/Endpoint_SlaveEndpointTest_NoAuthorizer_1_vMpi9l"
> I0429 19:03:58.412948 29136 credentials.hpp:86] Loading credential for
> authentication from '/tmp/Endpoint_SlaveEndpointTest_
> NoAuthorizer_1_iLIpgk/credential'
> I0429 19:03:58.413175 29136 slave.cpp:258] Agent using credential for:
> test-principal
> I0429 19:03:58.413206 29136 credentials.hpp:37] Loading credentials for
> authentication from '/tmp/Endpoint_SlaveEndpointTest_
> NoAuthorizer_1_iLIpgk/http_credentials'
> I0429 19:03:58.413496 29136 http.cpp:975] Creating default 'basic' HTTP
> authenticator for realm 'mesos-agent-readonly'
> I0429 19:03:58.413699 29136 http.cpp:975] Creating default 'basic' HTTP
> authenticator for realm 'mesos-agent-readwrite'
> I0429 19:03:58.415105 29136 slave.cpp:525] Agent resources: cpus(*):2;
> mem(*):1024; disk(*):1024; ports(*):[31000-32000]
> I0429 19:03:58.415184 29136 slave.cpp:533] Agent attributes: [  ]
> I0429 19:03:58.415199 29136 slave.cpp:538] Agent hostname: 53b2d40935db
> I0429 19:03:58.415351 29127 status_update_manager.cpp:177] Pausing sending
> status updates
> I0429 19:03:58.416509 29142 state.cpp:62] Recovering state from
> '/tmp/Endpoint_SlaveEndpointTest_NoAuthorizer_1_vMpi9l/meta'
> I0429 19:03:58.416822 29130 status_update_manager.cpp:203] Recovering
> status update manager
> I0429 19:03:58.417078 29139 containerizer.cpp:608] Recovering containerizer
> I0429 19:03:58.418530 29141 provisioner.cpp:410] Provisioner recovery
> complete
> I0429 19:03:58.418932 29132 slave.cpp:5963] Finished recovery
> I0429 19:03:58.419461 29132 slave.cpp:6145] Querying resource estimator
> for oversubscribable resources
> I0429 19:03:58.419684 29139 slave.cpp:6159] Received oversubscribable
> resources {} from the resource estimator
> I0429 19:03:58.421860 29132 process.cpp:3731] Handling HTTP event for
> process 'slave(748)' with path: '/slave(748)/monitor/statistics.json'
> I0429 19:03:58.423069 29130 http.cpp:1115] HTTP GET for
> /slave(748)/monitor/statistics.json from 172.17.0.3:52450
> I0429 19:03:58.423149 29130 http.cpp:936] Authorizing principal
> 'test-principal' to GET the '/monitor/statistics.json' endpoint
> I0429 19:03:58.426801 29142 slave.cpp:790] Agent terminating
> [       OK ] Endpoint/SlaveEndpointTest.NoAuthorizer/1 (30 ms)
> [ RUN      ] Endpoint/SlaveEndpointTest.NoAuthorizer/2
> I0429 19:03:58.438441 29109 containerizer.cpp:221] Using isolation:
> posix/cpu,posix/mem,filesystem/posix,network/cni
> W0429 19:03:58.438908 29109 backend.cpp:76] Failed to create 'aufs'
> backend: AufsBackend requires root privileges
> W0429 19:03:58.439007 29109 backend.cpp:76] Failed to create 'bind'
> backend: BindBackend requires root privileges
> I0429 19:03:58.439038 29109 provisioner.cpp:249] Using default backend
> 'copy'
> I0429 19:03:58.440793 29109 cluster.cpp:448] Creating default 'local'
> authorizer
> I0429 19:03:58.442363 29132 slave.cpp:225] Mesos agent started on (749)@
> 172.17.0.3:42932
> I0429 19:03:58.442399 29132 slave.cpp:226] Flags at startup: --acls=""
> --appc_simple_discovery_uri_prefix="http://" --appc_store_dir="/tmp/mesos/store/appc"
> --authenticate_http_readonly="true" --authenticate_http_readwrite="true"
> --authenticatee="crammd5" --authentication_backoff_factor="1secs"
> --authorizer="local" --cgroups_cpu_enable_pids_and_tids_count="false"
> --cgroups_enable_cfs="false" --cgroups_hierarchy="/sys/fs/cgroup"
> --cgroups_limit_swap="false" --cgroups_root="mesos" --container_disk_watch_interval="15secs"
> --containerizers="mesos" --credential="/tmp/Endpoint_SlaveEndpointTest_
> NoAuthorizer_2_ynVCZc/credential" --default_role="*"
> --disk_watch_interval="1mins" --docker="docker"
> --docker_kill_orphans="true" --docker_registry="https://
> registry-1.docker.io" --docker_remove_delay="6hrs"
> --docker_socket="/var/run/docker.sock" --docker_stop_timeout="0ns"
> --docker_store_dir="/tmp/mesos/store/docker" --docker_volume_checkpoint_
> dir="/var/run/mesos/isolators/docker/volume" --enforce_container_disk_quota="false"
> --executor_registration_timeout="1mins" --executor_shutdown_grace_period="5secs"
> --fetcher_cache_dir="/tmp/Endpoint_SlaveEndpointTest_NoAuthorizer_2_ynVCZc/fetch"
> --fetcher_cache_size="2GB" --frameworks_home="" --gc_delay="1weeks"
> --gc_disk_headroom="0.1" --hadoop_home="" --help="false"
> --hostname_lookup="true" --http_command_executor="false"
> --http_credentials="/tmp/Endpoint_SlaveEndpointTest_
> NoAuthorizer_2_ynVCZc/http_credentials" --http_heartbeat_interval="30secs"
> --initialize_driver_logging="true" --isolation="posix/cpu,posix/mem"
> --launcher="posix" --launcher_dir="/mesos/mesos-1.3.0/_build/src"
> --logbufsecs="0" --logging_level="INFO" --max_completed_executors_per_framework="150"
> --oversubscribed_resources_interval="15secs" --perf_duration="10secs"
> --perf_interval="1mins" --port="5051" --qos_correction_interval_min="0ns"
> --quiet="false" --recover="reconnect" --recovery_timeout="15mins"
> --registration_backoff_factor="10ms" --resources="cpus:2;gpus:0;
> mem:1024;disk:1024;ports:[31000-32000]" --revocable_cpu_low_priority="true"
> --runtime_dir="/tmp/Endpoint_SlaveEndpointTest_NoAuthorizer_2_ynVCZc"
> --sandbox_directory="/mnt/mesos/sandbox" --strict="true"
> --switch_user="true" --systemd_enable_support="true"
> --systemd_runtime_directory="/run/systemd/system" --version="false"
> --work_dir="/tmp/Endpoint_SlaveEndpointTest_NoAuthorizer_2_ZqaANe"
> I0429 19:03:58.442828 29132 credentials.hpp:86] Loading credential for
> authentication from '/tmp/Endpoint_SlaveEndpointTest_
> NoAuthorizer_2_ynVCZc/credential'
> I0429 19:03:58.442981 29132 slave.cpp:258] Agent using credential for:
> test-principal
> I0429 19:03:58.443004 29132 credentials.hpp:37] Loading credentials for
> authentication from '/tmp/Endpoint_SlaveEndpointTest_
> NoAuthorizer_2_ynVCZc/http_credentials'
> I0429 19:03:58.443218 29132 http.cpp:975] Creating default 'basic' HTTP
> authenticator for realm 'mesos-agent-readonly'
> I0429 19:03:58.443425 29132 http.cpp:975] Creating default 'basic' HTTP
> authenticator for realm 'mesos-agent-readwrite'
> I0429 19:03:58.444614 29132 slave.cpp:525] Agent resources: cpus(*):2;
> mem(*):1024; disk(*):1024; ports(*):[31000-32000]
> I0429 19:03:58.444691 29132 slave.cpp:533] Agent attributes: [  ]
> I0429 19:03:58.444710 29132 slave.cpp:538] Agent hostname: 53b2d40935db
> I0429 19:03:58.444905 29137 status_update_manager.cpp:177] Pausing sending
> status updates
> I0429 19:03:58.445971 29136 state.cpp:62] Recovering state from
> '/tmp/Endpoint_SlaveEndpointTest_NoAuthorizer_2_ZqaANe/meta'
> I0429 19:03:58.446262 29132 status_update_manager.cpp:203] Recovering
> status update manager
> I0429 19:03:58.446501 29131 containerizer.cpp:608] Recovering containerizer
> I0429 19:03:58.447878 29132 provisioner.cpp:410] Provisioner recovery
> complete
> I0429 19:03:58.448328 29127 slave.cpp:5963] Finished recovery
> I0429 19:03:58.448781 29127 slave.cpp:6145] Querying resource estimator
> for oversubscribable resources
> I0429 19:03:58.449007 29134 slave.cpp:6159] Received oversubscribable
> resources {} from the resource estimator
> I0429 19:03:58.451055 29130 process.cpp:3731] Handling HTTP event for
> process 'slave(749)' with path: '/slave(749)/containers'
> I0429 19:03:58.452229 29137 http.cpp:1115] HTTP GET for
> /slave(749)/containers from 172.17.0.3:52451
> I0429 19:03:58.452288 29137 http.cpp:936] Authorizing principal
> 'test-principal' to GET the '/containers' endpoint
> I0429 19:03:58.455632 29135 slave.cpp:790] Agent terminating
> [       OK ] Endpoint/SlaveEndpointTest.NoAuthorizer/2 (28 ms)
> [----------] 9 tests from Endpoint/SlaveEndpointTest (290 ms total)
>
> [----------] Global test environment tear-down
> [==========] 1569 tests from 175 test cases ran. (614932 ms total)
> [  PASSED  ] 1568 tests.
> [  FAILED  ] 1 test, listed below:
> [  FAILED  ] RegisterSlaveValidationTest.DropInvalidRegistration
>
>  1 FAILED TEST
>   YOU HAVE 19 DISABLED TESTS
>
> E0429 19:03:58.516456 29143 process.cpp:951] Failed to accept socket:
> future discarded
> make[4]: *** [check-local] Error 1
> make[4]: Leaving directory `/mesos/mesos-1.3.0/_build/src'
> make[3]: *** [check-am] Error 2
> make[3]: Leaving directory `/mesos/mesos-1.3.0/_build/src'
> make[2]: *** [check] Error 2
> make[2]: Leaving directory `/mesos/mesos-1.3.0/_build/src'
> make[1]: *** [check-recursive] Error 1
> make[1]: Leaving directory `/mesos/mesos-1.3.0/_build'
> make: *** [distcheck] Error 1
> + docker rmi mesos-1493489324-25370
> Untagged: mesos-1493489324-25370:latest
> Deleted: sha256:238cbd035b876e8756f5cb2bd95618
> a3d967cc1c1a479407dcbaadd7b07e0560
> Deleted: sha256:081a4050db1a7107f1ebf3dffa1e77
> d2db4b844bd2553aaceaf011bb3feab575
> Deleted: sha256:44aaeaca8aa2d0bf4a921792eecb4e
> e9fb878d874c09200970f0dfc08b035e78
> Deleted: sha256:e1ac1bad134f05ba28b448273dc726
> 899820065cfc0de90cb7ed97e7265517a2
> Deleted: sha256:c7e1f18967daeffe1860a8c072cb35
> 75c6834655203d701d280c9cb55b5c0a0d
> Deleted: sha256:67051b2977647585114c06fb984ead
> bf14bede14c74cfc358c1280274aa7cf39
> Deleted: sha256:051a2308d4d91163e16275e4bce815
> bd3e06b3f8a561263b0f94b91b5884d350
> Deleted: sha256:ddfeb75a4da07ad9cfa94a05ecba04
> ce2efd63245dbe2d4c33a2654254d6caea
> Deleted: sha256:f33ed5f866ac73464e8e1b283baa5e
> 5b662821563e74f108d32aa3494a937c2f
> Deleted: sha256:aa621f824e39f88a56a04d5d953070
> 07a8fffae8530a5b3e991ca821da17ab3a
> Deleted: sha256:d7b20e276fc0b14b293e006eae6a01
> e3c503ba91d1960d18eebedf06846b892e
> Deleted: sha256:883c9c3cee747b8573844790238731
> 381ac6700c478d1719335437c6db4c57f0
> Deleted: sha256:e5a10b5861bfa91834362b5bcf2eba
> 2e2183a33ccec5cde0d56b700a6234d885
> Deleted: sha256:f431cfe19a66b8e039b40eb38ed834
> 6b132c995accc74da0b01f8464a7e2de2b
> Deleted: sha256:f64956c087449d6eb7c72cb6ffa2dc
> dac38a64aad680b1a19cc2444fd8cd18d8
> Deleted: sha256:bbba84f8387a6a9b400d377f455784
> 8c941239957bead50b4285172ccec8953b
> Deleted: sha256:d6aae307f4495d5ad6c49f9fb247f9
> f172377368bfe6c77017febdb50b28b679
> Deleted: sha256:295c37b889ca78947a4822da93b2ea
> 43d2461cc80310a74967096ce76e8e2022
> Deleted: sha256:14bcb907a288d9cee88207def9abc3
> 376de284e1d128bf2f35f039fe93b2921d
> Deleted: sha256:2d027c9b25af4298ad09e8f2ba9792
> a743c3a2edc22aa81468e0dda326f5b9f9
> Deleted: sha256:380faf7bea088a9892e4e304925f6f
> c8cc16c02841246b07744004ce07a58b63
> Deleted: sha256:261306644d02991383b1cf8dd62667
> b592809a57b818fdcebb8adc8b83bf25fd
> Deleted: sha256:02ee8be62adfe0efe58aef0552b3b0
> 3671667558e22b5275490f6f57bc940eb6
> Deleted: sha256:a2e6755d60503ba7758d62cd500029
> 01e4eaea390548ec718b7039e56cf5f6e6
> Build step 'Execute shell' marked build as failure
>

Mime
  • Unnamed multipart/alternative (inline, None, 0 bytes)
View raw message