mesos-builds mailing list archives

Site index · List index
Message view « Date » · « Thread »
Top « Date » · « Thread »
From Alex R <al...@apache.org>
Subject Re: Build failed in Jenkins: Mesos-Buildbot » autotools,gcc,--verbose,GLOG_v=1 MESOS_VERBOSE=1,centos:7,(docker||Hadoop)&&(!ubuntu-us1)&&(!ubuntu-eu2) #3574
Date Thu, 27 Apr 2017 14:19:30 GMT
The task used in `CommandExecutorCheckTest.HTTPCheckDelivered` is a simple
HTTP server, which requires a port to bind to. Even though we try to use a
random "free" port [1], determining whether a port is free is racy. If
anyone has an idea what would be a good and stable solution in this case,
please share!

Alex.

[1]
https://github.com/apache/mesos/blob/5ac18cfcdd2bd08be17c62468f6748dc853e50f6/src/tests/check_tests.cpp#L818

On 27 April 2017 at 15:29, Alex R <alexr@apache.org> wrote:

> Looking into the failure.
>
> On 27 April 2017 at 15:17, Apache Jenkins Server <
> jenkins@builds.apache.org> wrote:
>
>> See <https://builds.apache.org/job/Mesos-Buildbot/BUILDTOOL=auto
>> tools,COMPILER=gcc,CONFIGURATION=--verbose,ENVIRONMENT=GLOG_
>> v=1%20MESOS_VERBOSE=1,OS=centos%3A7,label_exp=(docker%
>> 7C%7CHadoop)&&(!ubuntu-us1)&&(!ubuntu-eu2)/3574/display/
>> redirect?page=changes>
>>
>> Changes:
>>
>> [alexr] Temporarily disabled a test on Windows.
>>
>> ------------------------------------------
>> [...truncated 26.48 MB...]
>> [       OK ] Endpoint/SlaveEndpointTest.AuthorizedRequest/1 (26 ms)
>> [ RUN      ] Endpoint/SlaveEndpointTest.AuthorizedRequest/2
>> I0427 13:17:07.040550 31828 containerizer.cpp:221] Using isolation:
>> posix/cpu,posix/mem,filesystem/posix,network/cni
>> W0427 13:17:07.041075 31828 backend.cpp:76] Failed to create 'aufs'
>> backend: AufsBackend requires root privileges
>> W0427 13:17:07.041182 31828 backend.cpp:76] Failed to create 'bind'
>> backend: BindBackend requires root privileges
>> I0427 13:17:07.041221 31828 provisioner.cpp:249] Using default backend
>> 'copy'
>> I0427 13:17:07.044355 31853 slave.cpp:225] Mesos agent started on (734)@
>> 172.17.0.2:35555
>> I0427 13:17:07.044378 31853 slave.cpp:226] Flags at startup: --acls=""
>> --appc_simple_discovery_uri_prefix="http://"
>> --appc_store_dir="/tmp/mesos/store/appc" --authenticate_http_readonly="true"
>> --authenticate_http_readwrite="true" --authenticatee="crammd5"
>> --authentication_backoff_factor="1secs" --authorizer="local"
>> --cgroups_cpu_enable_pids_and_tids_count="false"
>> --cgroups_enable_cfs="false" --cgroups_hierarchy="/sys/fs/cgroup"
>> --cgroups_limit_swap="false" --cgroups_root="mesos"
>> --container_disk_watch_interval="15secs" --containerizers="mesos"
>> --credential="/tmp/Endpoint_SlaveEndpointTest_AuthorizedRequest_2_XN2vEO/credential"
>> --default_role="*" --disk_watch_interval="1mins" --docker="docker"
>> --docker_kill_orphans="true" --docker_registry="https://reg
>> istry-1.docker.io" --docker_remove_delay="6hrs"
>> --docker_socket="/var/run/docker.sock" --docker_stop_timeout="0ns"
>> --docker_store_dir="/tmp/mesos/store/docker"
>> --docker_volume_checkpoint_dir="/var/run/mesos/isolators/docker/volume"
>> --enforce_container_disk_quota="false" --executor_registration_timeout="1mins"
>> --executor_shutdown_grace_period="5secs" --fetcher_cache_dir="/tmp/Endp
>> oint_SlaveEndpointTest_AuthorizedRequest_2_XN2vEO/fetch"
>> --fetcher_cache_size="2GB" --frameworks_home="" --gc_delay="1weeks"
>> --gc_disk_headroom="0.1" --hadoop_home="" --help="false"
>> --hostname_lookup="true" --http_command_executor="false"
>> --http_credentials="/tmp/Endpoint_SlaveEndpointTest_Authoriz
>> edRequest_2_XN2vEO/http_credentials" --http_heartbeat_interval="30secs"
>> --initialize_driver_logging="true" --isolation="posix/cpu,posix/mem"
>> --launcher="posix" --launcher_dir="/mesos/mesos-1.3.0/_build/src"
>> --logbufsecs="0" --logging_level="INFO" --max_completed_executors_per_framework="150"
>> --oversubscribed_resources_interval="15secs" --perf_duration="10secs"
>> --perf_interval="1mins" --port="5051" --qos_correction_interval_min="0ns"
>> --quiet="false" --recover="reconnect" --recovery_timeout="15mins"
>> --registration_backoff_factor="10ms" --resources="cpus:2;gpus:0;mem
>> :1024;disk:1024;ports:[31000-32000]" --revocable_cpu_low_priority="true"
>> --runtime_dir="/tmp/Endpoint_SlaveEndpointTest_AuthorizedRequest_2_XN2vEO"
>> --sandbox_directory="/mnt/mesos/sandbox" --strict="true"
>> --switch_user="true" --systemd_enable_support="true"
>> --systemd_runtime_directory="/run/systemd/system" --version="false"
>> --work_dir="/tmp/Endpoint_SlaveEndpointTest_AuthorizedRequest_2_x8sbcz"
>> I0427 13:17:07.044772 31853 credentials.hpp:86] Loading credential for
>> authentication from '/tmp/Endpoint_SlaveEndpointTe
>> st_AuthorizedRequest_2_XN2vEO/credential'
>> I0427 13:17:07.044909 31853 slave.cpp:258] Agent using credential for:
>> test-principal
>> I0427 13:17:07.044925 31853 credentials.hpp:37] Loading credentials for
>> authentication from '/tmp/Endpoint_SlaveEndpointTe
>> st_AuthorizedRequest_2_XN2vEO/http_credentials'
>> I0427 13:17:07.045121 31853 http.cpp:975] Creating default 'basic' HTTP
>> authenticator for realm 'mesos-agent-readonly'
>> I0427 13:17:07.045258 31853 http.cpp:975] Creating default 'basic' HTTP
>> authenticator for realm 'mesos-agent-readwrite'
>> I0427 13:17:07.046648 31853 slave.cpp:525] Agent resources: cpus(*):2;
>> mem(*):1024; disk(*):1024; ports(*):[31000-32000]
>> I0427 13:17:07.046739 31853 slave.cpp:533] Agent attributes: [  ]
>> I0427 13:17:07.046758 31853 slave.cpp:538] Agent hostname: ddedc83e4abf
>> I0427 13:17:07.046895 31848 status_update_manager.cpp:177] Pausing
>> sending status updates
>> I0427 13:17:07.048229 31861 state.cpp:62] Recovering state from
>> '/tmp/Endpoint_SlaveEndpointTest_AuthorizedRequest_2_x8sbcz/meta'
>> I0427 13:17:07.048480 31859 status_update_manager.cpp:203] Recovering
>> status update manager
>> I0427 13:17:07.048866 31863 containerizer.cpp:608] Recovering
>> containerizer
>> I0427 13:17:07.050251 31849 provisioner.cpp:410] Provisioner recovery
>> complete
>> I0427 13:17:07.050606 31847 slave.cpp:5963] Finished recovery
>> I0427 13:17:07.051050 31847 slave.cpp:6145] Querying resource estimator
>> for oversubscribable resources
>> I0427 13:17:07.051316 31868 slave.cpp:6159] Received oversubscribable
>> resources {} from the resource estimator
>> I0427 13:17:07.053088 31868 process.cpp:3731] Handling HTTP event for
>> process 'slave(734)' with path: '/slave(734)/containers'
>> I0427 13:17:07.054134 31860 http.cpp:1115] HTTP GET for
>> /slave(734)/containers from 172.17.0.2:43802
>> I0427 13:17:07.054219 31860 http.cpp:936] Authorizing principal
>> 'test-principal' to GET the '/containers' endpoint
>> I0427 13:17:07.057879 31864 slave.cpp:790] Agent terminating
>> [       OK ] Endpoint/SlaveEndpointTest.AuthorizedRequest/2 (26 ms)
>> [ RUN      ] Endpoint/SlaveEndpointTest.UnauthorizedRequest/0
>> I0427 13:17:07.067188 31828 containerizer.cpp:221] Using isolation:
>> posix/cpu,posix/mem,filesystem/posix,network/cni
>> W0427 13:17:07.067646 31828 backend.cpp:76] Failed to create 'aufs'
>> backend: AufsBackend requires root privileges
>> W0427 13:17:07.067739 31828 backend.cpp:76] Failed to create 'bind'
>> backend: BindBackend requires root privileges
>> I0427 13:17:07.067767 31828 provisioner.cpp:249] Using default backend
>> 'copy'
>> I0427 13:17:07.070797 31858 slave.cpp:225] Mesos agent started on (735)@
>> 172.17.0.2:35555
>> I0427 13:17:07.070817 31858 slave.cpp:226] Flags at startup: --acls=""
>> --appc_simple_discovery_uri_prefix="http://"
>> --appc_store_dir="/tmp/mesos/store/appc" --authenticate_http_readonly="true"
>> --authenticate_http_readwrite="true" --authenticatee="crammd5"
>> --authentication_backoff_factor="1secs" --authorizer="local"
>> --cgroups_cpu_enable_pids_and_tids_count="false"
>> --cgroups_enable_cfs="false" --cgroups_hierarchy="/sys/fs/cgroup"
>> --cgroups_limit_swap="false" --cgroups_root="mesos"
>> --container_disk_watch_interval="15secs" --containerizers="mesos"
>> --credential="/tmp/Endpoint_SlaveEndpointTest_UnauthorizedRequest_0_YPIBHO/credential"
>> --default_role="*" --disk_watch_interval="1mins" --docker="docker"
>> --docker_kill_orphans="true" --docker_registry="https://reg
>> istry-1.docker.io" --docker_remove_delay="6hrs"
>> --docker_socket="/var/run/docker.sock" --docker_stop_timeout="0ns"
>> --docker_store_dir="/tmp/mesos/store/docker"
>> --docker_volume_checkpoint_dir="/var/run/mesos/isolators/docker/volume"
>> --enforce_container_disk_quota="false" --executor_registration_timeout="1mins"
>> --executor_shutdown_grace_period="5secs" --fetcher_cache_dir="/tmp/Endp
>> oint_SlaveEndpointTest_UnauthorizedRequest_0_YPIBHO/fetch"
>> --fetcher_cache_size="2GB" --frameworks_home="" --gc_delay="1weeks"
>> --gc_disk_headroom="0.1" --hadoop_home="" --help="false"
>> --hostname_lookup="true" --http_command_executor="false"
>> --http_credentials="/tmp/Endpoint_SlaveEndpointTest_Unauthor
>> izedRequest_0_YPIBHO/http_credentials" --http_heartbeat_interval="30secs"
>> --initialize_driver_logging="true" --isolation="posix/cpu,posix/mem"
>> --launcher="posix" --launcher_dir="/mesos/mesos-1.3.0/_build/src"
>> --logbufsecs="0" --logging_level="INFO" --max_completed_executors_per_framework="150"
>> --oversubscribed_resources_interval="15secs" --perf_duration="10secs"
>> --perf_interval="1mins" --port="5051" --qos_correction_interval_min="0ns"
>> --quiet="false" --recover="reconnect" --recovery_timeout="15mins"
>> --registration_backoff_factor="10ms" --resources="cpus:2;gpus:0;mem
>> :1024;disk:1024;ports:[31000-32000]" --revocable_cpu_low_priority="true"
>> --runtime_dir="/tmp/Endpoint_SlaveEndpointTest_UnauthorizedRequest_0_YPIBHO"
>> --sandbox_directory="/mnt/mesos/sandbox" --strict="true"
>> --switch_user="true" --systemd_enable_support="true"
>> --systemd_runtime_directory="/run/systemd/system" --version="false"
>> --work_dir="/tmp/Endpoint_SlaveEndpointTest_UnauthorizedRequest_0_AXBebz"
>> I0427 13:17:07.071213 31858 credentials.hpp:86] Loading credential for
>> authentication from '/tmp/Endpoint_SlaveEndpointTe
>> st_UnauthorizedRequest_0_YPIBHO/credential'
>> I0427 13:17:07.071334 31858 slave.cpp:258] Agent using credential for:
>> test-principal
>> I0427 13:17:07.071352 31858 credentials.hpp:37] Loading credentials for
>> authentication from '/tmp/Endpoint_SlaveEndpointTe
>> st_UnauthorizedRequest_0_YPIBHO/http_credentials'
>> I0427 13:17:07.071534 31858 http.cpp:975] Creating default 'basic' HTTP
>> authenticator for realm 'mesos-agent-readonly'
>> I0427 13:17:07.071663 31858 http.cpp:975] Creating default 'basic' HTTP
>> authenticator for realm 'mesos-agent-readwrite'
>> I0427 13:17:07.072824 31858 slave.cpp:525] Agent resources: cpus(*):2;
>> mem(*):1024; disk(*):1024; ports(*):[31000-32000]
>> I0427 13:17:07.072899 31858 slave.cpp:533] Agent attributes: [  ]
>> I0427 13:17:07.072911 31858 slave.cpp:538] Agent hostname: ddedc83e4abf
>> I0427 13:17:07.073029 31857 status_update_manager.cpp:177] Pausing
>> sending status updates
>> I0427 13:17:07.074192 31867 state.cpp:62] Recovering state from
>> '/tmp/Endpoint_SlaveEndpointTest_UnauthorizedRequest_0_AXBebz/meta'
>> I0427 13:17:07.074424 31861 status_update_manager.cpp:203] Recovering
>> status update manager
>> I0427 13:17:07.074648 31859 containerizer.cpp:608] Recovering
>> containerizer
>> I0427 13:17:07.075865 31868 provisioner.cpp:410] Provisioner recovery
>> complete
>> I0427 13:17:07.076220 31857 slave.cpp:5963] Finished recovery
>> I0427 13:17:07.076700 31857 slave.cpp:6145] Querying resource estimator
>> for oversubscribable resources
>> I0427 13:17:07.076920 31852 slave.cpp:6159] Received oversubscribable
>> resources {} from the resource estimator
>> I0427 13:17:07.079051 31865 process.cpp:3731] Handling HTTP event for
>> process 'slave(735)' with path: '/slave(735)/monitor/statistics'
>> I0427 13:17:07.080078 31849 http.cpp:1115] HTTP GET for
>> /slave(735)/monitor/statistics from 172.17.0.2:43804
>> I0427 13:17:07.080137 31849 http.cpp:936] Authorizing principal
>> 'test-principal' to GET the '/monitor/statistics' endpoint
>> I0427 13:17:07.082435 31862 slave.cpp:790] Agent terminating
>> [       OK ] Endpoint/SlaveEndpointTest.UnauthorizedRequest/0 (24 ms)
>> [ RUN      ] Endpoint/SlaveEndpointTest.UnauthorizedRequest/1
>> I0427 13:17:07.091701 31828 containerizer.cpp:221] Using isolation:
>> posix/cpu,posix/mem,filesystem/posix,network/cni
>> W0427 13:17:07.092202 31828 backend.cpp:76] Failed to create 'aufs'
>> backend: AufsBackend requires root privileges
>> W0427 13:17:07.092295 31828 backend.cpp:76] Failed to create 'bind'
>> backend: BindBackend requires root privileges
>> I0427 13:17:07.092329 31828 provisioner.cpp:249] Using default backend
>> 'copy'
>> I0427 13:17:07.095304 31865 slave.cpp:225] Mesos agent started on (736)@
>> 172.17.0.2:35555
>> I0427 13:17:07.095331 31865 slave.cpp:226] Flags at startup: --acls=""
>> --appc_simple_discovery_uri_prefix="http://"
>> --appc_store_dir="/tmp/mesos/store/appc" --authenticate_http_readonly="true"
>> --authenticate_http_readwrite="true" --authenticatee="crammd5"
>> --authentication_backoff_factor="1secs" --authorizer="local"
>> --cgroups_cpu_enable_pids_and_tids_count="false"
>> --cgroups_enable_cfs="false" --cgroups_hierarchy="/sys/fs/cgroup"
>> --cgroups_limit_swap="false" --cgroups_root="mesos"
>> --container_disk_watch_interval="15secs" --containerizers="mesos"
>> --credential="/tmp/Endpoint_SlaveEndpointTest_UnauthorizedRequest_1_UIWkZO/credential"
>> --default_role="*" --disk_watch_interval="1mins" --docker="docker"
>> --docker_kill_orphans="true" --docker_registry="https://reg
>> istry-1.docker.io" --docker_remove_delay="6hrs"
>> --docker_socket="/var/run/docker.sock" --docker_stop_timeout="0ns"
>> --docker_store_dir="/tmp/mesos/store/docker"
>> --docker_volume_checkpoint_dir="/var/run/mesos/isolators/docker/volume"
>> --enforce_container_disk_quota="false" --executor_registration_timeout="1mins"
>> --executor_shutdown_grace_period="5secs" --fetcher_cache_dir="/tmp/Endp
>> oint_SlaveEndpointTest_UnauthorizedRequest_1_UIWkZO/fetch"
>> --fetcher_cache_size="2GB" --frameworks_home="" --gc_delay="1weeks"
>> --gc_disk_headroom="0.1" --hadoop_home="" --help="false"
>> --hostname_lookup="true" --http_command_executor="false"
>> --http_credentials="/tmp/Endpoint_SlaveEndpointTest_Unauthor
>> izedRequest_1_UIWkZO/http_credentials" --http_heartbeat_interval="30secs"
>> --initialize_driver_logging="true" --isolation="posix/cpu,posix/mem"
>> --launcher="posix" --launcher_dir="/mesos/mesos-1.3.0/_build/src"
>> --logbufsecs="0" --logging_level="INFO" --max_completed_executors_per_framework="150"
>> --oversubscribed_resources_interval="15secs" --perf_duration="10secs"
>> --perf_interval="1mins" --port="5051" --qos_correction_interval_min="0ns"
>> --quiet="false" --recover="reconnect" --recovery_timeout="15mins"
>> --registration_backoff_factor="10ms" --resources="cpus:2;gpus:0;mem
>> :1024;disk:1024;ports:[31000-32000]" --revocable_cpu_low_priority="true"
>> --runtime_dir="/tmp/Endpoint_SlaveEndpointTest_UnauthorizedRequest_1_UIWkZO"
>> --sandbox_directory="/mnt/mesos/sandbox" --strict="true"
>> --switch_user="true" --systemd_enable_support="true"
>> --systemd_runtime_directory="/run/systemd/system" --version="false"
>> --work_dir="/tmp/Endpoint_SlaveEndpointTest_UnauthorizedRequest_1_2LMlpz"
>> I0427 13:17:07.095881 31865 credentials.hpp:86] Loading credential for
>> authentication from '/tmp/Endpoint_SlaveEndpointTe
>> st_UnauthorizedRequest_1_UIWkZO/credential'
>> I0427 13:17:07.096068 31865 slave.cpp:258] Agent using credential for:
>> test-principal
>> I0427 13:17:07.096098 31865 credentials.hpp:37] Loading credentials for
>> authentication from '/tmp/Endpoint_SlaveEndpointTe
>> st_UnauthorizedRequest_1_UIWkZO/http_credentials'
>> I0427 13:17:07.096421 31865 http.cpp:975] Creating default 'basic' HTTP
>> authenticator for realm 'mesos-agent-readonly'
>> I0427 13:17:07.096590 31865 http.cpp:975] Creating default 'basic' HTTP
>> authenticator for realm 'mesos-agent-readwrite'
>> I0427 13:17:07.097849 31865 slave.cpp:525] Agent resources: cpus(*):2;
>> mem(*):1024; disk(*):1024; ports(*):[31000-32000]
>> I0427 13:17:07.097935 31865 slave.cpp:533] Agent attributes: [  ]
>> I0427 13:17:07.097947 31865 slave.cpp:538] Agent hostname: ddedc83e4abf
>> I0427 13:17:07.098067 31853 status_update_manager.cpp:177] Pausing
>> sending status updates
>> I0427 13:17:07.099480 31848 state.cpp:62] Recovering state from
>> '/tmp/Endpoint_SlaveEndpointTest_UnauthorizedRequest_1_2LMlpz/meta'
>> I0427 13:17:07.099768 31857 status_update_manager.cpp:203] Recovering
>> status update manager
>> I0427 13:17:07.100015 31861 containerizer.cpp:608] Recovering
>> containerizer
>> I0427 13:17:07.101320 31860 provisioner.cpp:410] Provisioner recovery
>> complete
>> I0427 13:17:07.101735 31853 slave.cpp:5963] Finished recovery
>> I0427 13:17:07.102195 31853 slave.cpp:6145] Querying resource estimator
>> for oversubscribable resources
>> I0427 13:17:07.102442 31863 slave.cpp:6159] Received oversubscribable
>> resources {} from the resource estimator
>> I0427 13:17:07.104423 31852 process.cpp:3731] Handling HTTP event for
>> process 'slave(736)' with path: '/slave(736)/monitor/statistics.json'
>> I0427 13:17:07.105602 31859 http.cpp:1115] HTTP GET for
>> /slave(736)/monitor/statistics.json from 172.17.0.2:43806
>> I0427 13:17:07.105659 31859 http.cpp:936] Authorizing principal
>> 'test-principal' to GET the '/monitor/statistics.json' endpoint
>> I0427 13:17:07.107869 31858 slave.cpp:790] Agent terminating
>> [       OK ] Endpoint/SlaveEndpointTest.UnauthorizedRequest/1 (25 ms)
>> [ RUN      ] Endpoint/SlaveEndpointTest.UnauthorizedRequest/2
>> I0427 13:17:07.116974 31828 containerizer.cpp:221] Using isolation:
>> posix/cpu,posix/mem,filesystem/posix,network/cni
>> W0427 13:17:07.117411 31828 backend.cpp:76] Failed to create 'aufs'
>> backend: AufsBackend requires root privileges
>> W0427 13:17:07.117496 31828 backend.cpp:76] Failed to create 'bind'
>> backend: BindBackend requires root privileges
>> I0427 13:17:07.117522 31828 provisioner.cpp:249] Using default backend
>> 'copy'
>> I0427 13:17:07.120314 31858 slave.cpp:225] Mesos agent started on (737)@
>> 172.17.0.2:35555
>> I0427 13:17:07.120337 31858 slave.cpp:226] Flags at startup: --acls=""
>> --appc_simple_discovery_uri_prefix="http://"
>> --appc_store_dir="/tmp/mesos/store/appc" --authenticate_http_readonly="true"
>> --authenticate_http_readwrite="true" --authenticatee="crammd5"
>> --authentication_backoff_factor="1secs" --authorizer="local"
>> --cgroups_cpu_enable_pids_and_tids_count="false"
>> --cgroups_enable_cfs="false" --cgroups_hierarchy="/sys/fs/cgroup"
>> --cgroups_limit_swap="false" --cgroups_root="mesos"
>> --container_disk_watch_interval="15secs" --containerizers="mesos"
>> --credential="/tmp/Endpoint_SlaveEndpointTest_UnauthorizedRequest_2_dNpiwP/credential"
>> --default_role="*" --disk_watch_interval="1mins" --docker="docker"
>> --docker_kill_orphans="true" --docker_registry="https://reg
>> istry-1.docker.io" --docker_remove_delay="6hrs"
>> --docker_socket="/var/run/docker.sock" --docker_stop_timeout="0ns"
>> --docker_store_dir="/tmp/mesos/store/docker"
>> --docker_volume_checkpoint_dir="/var/run/mesos/isolators/docker/volume"
>> --enforce_container_disk_quota="false" --executor_registration_timeout="1mins"
>> --executor_shutdown_grace_period="5secs" --fetcher_cache_dir="/tmp/Endp
>> oint_SlaveEndpointTest_UnauthorizedRequest_2_dNpiwP/fetch"
>> --fetcher_cache_size="2GB" --frameworks_home="" --gc_delay="1weeks"
>> --gc_disk_headroom="0.1" --hadoop_home="" --help="false"
>> --hostname_lookup="true" --http_command_executor="false"
>> --http_credentials="/tmp/Endpoint_SlaveEndpointTest_Unauthor
>> izedRequest_2_dNpiwP/http_credentials" --http_heartbeat_interval="30secs"
>> --initialize_driver_logging="true" --isolation="posix/cpu,posix/mem"
>> --launcher="posix" --launcher_dir="/mesos/mesos-1.3.0/_build/src"
>> --logbufsecs="0" --logging_level="INFO" --max_completed_executors_per_framework="150"
>> --oversubscribed_resources_interval="15secs" --perf_duration="10secs"
>> --perf_interval="1mins" --port="5051" --qos_correction_interval_min="0ns"
>> --quiet="false" --recover="reconnect" --recovery_timeout="15mins"
>> --registration_backoff_factor="10ms" --resources="cpus:2;gpus:0;mem
>> :1024;disk:1024;ports:[31000-32000]" --revocable_cpu_low_priority="true"
>> --runtime_dir="/tmp/Endpoint_SlaveEndpointTest_UnauthorizedRequest_2_dNpiwP"
>> --sandbox_directory="/mnt/mesos/sandbox" --strict="true"
>> --switch_user="true" --systemd_enable_support="true"
>> --systemd_runtime_directory="/run/systemd/system" --version="false"
>> --work_dir="/tmp/Endpoint_SlaveEndpointTest_UnauthorizedRequest_2_l0yvSz"
>> I0427 13:17:07.120688 31858 credentials.hpp:86] Loading credential for
>> authentication from '/tmp/Endpoint_SlaveEndpointTe
>> st_UnauthorizedRequest_2_dNpiwP/credential'
>> I0427 13:17:07.120818 31858 slave.cpp:258] Agent using credential for:
>> test-principal
>> I0427 13:17:07.120836 31858 credentials.hpp:37] Loading credentials for
>> authentication from '/tmp/Endpoint_SlaveEndpointTe
>> st_UnauthorizedRequest_2_dNpiwP/http_credentials'
>> I0427 13:17:07.121022 31858 http.cpp:975] Creating default 'basic' HTTP
>> authenticator for realm 'mesos-agent-readonly'
>> I0427 13:17:07.121153 31858 http.cpp:975] Creating default 'basic' HTTP
>> authenticator for realm 'mesos-agent-readwrite'
>> I0427 13:17:07.122313 31858 slave.cpp:525] Agent resources: cpus(*):2;
>> mem(*):1024; disk(*):1024; ports(*):[31000-32000]
>> I0427 13:17:07.122387 31858 slave.cpp:533] Agent attributes: [  ]
>> I0427 13:17:07.122398 31858 slave.cpp:538] Agent hostname: ddedc83e4abf
>> I0427 13:17:07.122555 31849 status_update_manager.cpp:177] Pausing
>> sending status updates
>> I0427 13:17:07.123594 31854 state.cpp:62] Recovering state from
>> '/tmp/Endpoint_SlaveEndpointTest_UnauthorizedRequest_2_l0yvSz/meta'
>> I0427 13:17:07.124006 31870 status_update_manager.cpp:203] Recovering
>> status update manager
>> I0427 13:17:07.124224 31867 containerizer.cpp:608] Recovering
>> containerizer
>> I0427 13:17:07.125682 31851 provisioner.cpp:410] Provisioner recovery
>> complete
>> I0427 13:17:07.126063 31849 slave.cpp:5963] Finished recovery
>> I0427 13:17:07.126585 31849 slave.cpp:6145] Querying resource estimator
>> for oversubscribable resources
>> I0427 13:17:07.126873 31854 slave.cpp:6159] Received oversubscribable
>> resources {} from the resource estimator
>> I0427 13:17:07.128991 31847 process.cpp:3731] Handling HTTP event for
>> process 'slave(737)' with path: '/slave(737)/containers'
>> I0427 13:17:07.130187 31848 http.cpp:1115] HTTP GET for
>> /slave(737)/containers from 172.17.0.2:43808
>> I0427 13:17:07.130246 31848 http.cpp:936] Authorizing principal
>> 'test-principal' to GET the '/containers' endpoint
>> I0427 13:17:07.132432 31862 slave.cpp:790] Agent terminating
>> [       OK ] Endpoint/SlaveEndpointTest.UnauthorizedRequest/2 (23 ms)
>> [ RUN      ] Endpoint/SlaveEndpointTest.NoAuthorizer/0
>> I0427 13:17:07.140884 31828 containerizer.cpp:221] Using isolation:
>> posix/cpu,posix/mem,filesystem/posix,network/cni
>> W0427 13:17:07.141299 31828 backend.cpp:76] Failed to create 'aufs'
>> backend: AufsBackend requires root privileges
>> W0427 13:17:07.141386 31828 backend.cpp:76] Failed to create 'bind'
>> backend: BindBackend requires root privileges
>> I0427 13:17:07.141427 31828 provisioner.cpp:249] Using default backend
>> 'copy'
>> I0427 13:17:07.142791 31828 cluster.cpp:448] Creating default 'local'
>> authorizer
>> I0427 13:17:07.144186 31862 slave.cpp:225] Mesos agent started on (738)@
>> 172.17.0.2:35555
>> I0427 13:17:07.144207 31862 slave.cpp:226] Flags at startup: --acls=""
>> --appc_simple_discovery_uri_prefix="http://"
>> --appc_store_dir="/tmp/mesos/store/appc" --authenticate_http_readonly="true"
>> --authenticate_http_readwrite="true" --authenticatee="crammd5"
>> --authentication_backoff_factor="1secs" --authorizer="local"
>> --cgroups_cpu_enable_pids_and_tids_count="false"
>> --cgroups_enable_cfs="false" --cgroups_hierarchy="/sys/fs/cgroup"
>> --cgroups_limit_swap="false" --cgroups_root="mesos"
>> --container_disk_watch_interval="15secs" --containerizers="mesos"
>> --credential="/tmp/Endpoint_SlaveEndpointTest_NoAuthorizer_0_A17thQ/credential"
>> --default_role="*" --disk_watch_interval="1mins" --docker="docker"
>> --docker_kill_orphans="true" --docker_registry="https://reg
>> istry-1.docker.io" --docker_remove_delay="6hrs"
>> --docker_socket="/var/run/docker.sock" --docker_stop_timeout="0ns"
>> --docker_store_dir="/tmp/mesos/store/docker"
>> --docker_volume_checkpoint_dir="/var/run/mesos/isolators/docker/volume"
>> --enforce_container_disk_quota="false" --executor_registration_timeout="1mins"
>> --executor_shutdown_grace_period="5secs" --fetcher_cache_dir="/tmp/Endp
>> oint_SlaveEndpointTest_NoAuthorizer_0_A17thQ/fetch"
>> --fetcher_cache_size="2GB" --frameworks_home="" --gc_delay="1weeks"
>> --gc_disk_headroom="0.1" --hadoop_home="" --help="false"
>> --hostname_lookup="true" --http_command_executor="false"
>> --http_credentials="/tmp/Endpoint_SlaveEndpointTest_NoAuthor
>> izer_0_A17thQ/http_credentials" --http_heartbeat_interval="30secs"
>> --initialize_driver_logging="true" --isolation="posix/cpu,posix/mem"
>> --launcher="posix" --launcher_dir="/mesos/mesos-1.3.0/_build/src"
>> --logbufsecs="0" --logging_level="INFO" --max_completed_executors_per_framework="150"
>> --oversubscribed_resources_interval="15secs" --perf_duration="10secs"
>> --perf_interval="1mins" --port="5051" --qos_correction_interval_min="0ns"
>> --quiet="false" --recover="reconnect" --recovery_timeout="15mins"
>> --registration_backoff_factor="10ms" --resources="cpus:2;gpus:0;mem
>> :1024;disk:1024;ports:[31000-32000]" --revocable_cpu_low_priority="true"
>> --runtime_dir="/tmp/Endpoint_SlaveEndpointTest_NoAuthorizer_0_A17thQ"
>> --sandbox_directory="/mnt/mesos/sandbox" --strict="true"
>> --switch_user="true" --systemd_enable_support="true"
>> --systemd_runtime_directory="/run/systemd/system" --version="false"
>> --work_dir="/tmp/Endpoint_SlaveEndpointTest_NoAuthorizer_0_wqoaAA"
>> I0427 13:17:07.144515 31862 credentials.hpp:86] Loading credential for
>> authentication from '/tmp/Endpoint_SlaveEndpointTe
>> st_NoAuthorizer_0_A17thQ/credential'
>> I0427 13:17:07.144637 31862 slave.cpp:258] Agent using credential for:
>> test-principal
>> I0427 13:17:07.144655 31862 credentials.hpp:37] Loading credentials for
>> authentication from '/tmp/Endpoint_SlaveEndpointTe
>> st_NoAuthorizer_0_A17thQ/http_credentials'
>> I0427 13:17:07.144836 31862 http.cpp:975] Creating default 'basic' HTTP
>> authenticator for realm 'mesos-agent-readonly'
>> I0427 13:17:07.144954 31862 http.cpp:975] Creating default 'basic' HTTP
>> authenticator for realm 'mesos-agent-readwrite'
>> I0427 13:17:07.146126 31862 slave.cpp:525] Agent resources: cpus(*):2;
>> mem(*):1024; disk(*):1024; ports(*):[31000-32000]
>> I0427 13:17:07.146198 31862 slave.cpp:533] Agent attributes: [  ]
>> I0427 13:17:07.146209 31862 slave.cpp:538] Agent hostname: ddedc83e4abf
>> I0427 13:17:07.146342 31858 status_update_manager.cpp:177] Pausing
>> sending status updates
>> I0427 13:17:07.147438 31854 state.cpp:62] Recovering state from
>> '/tmp/Endpoint_SlaveEndpointTest_NoAuthorizer_0_wqoaAA/meta'
>> I0427 13:17:07.147732 31865 status_update_manager.cpp:203] Recovering
>> status update manager
>> I0427 13:17:07.148051 31867 containerizer.cpp:608] Recovering
>> containerizer
>> I0427 13:17:07.149441 31848 provisioner.cpp:410] Provisioner recovery
>> complete
>> I0427 13:17:07.149817 31865 slave.cpp:5963] Finished recovery
>> I0427 13:17:07.150228 31865 slave.cpp:6145] Querying resource estimator
>> for oversubscribable resources
>> I0427 13:17:07.150655 31869 slave.cpp:6159] Received oversubscribable
>> resources {} from the resource estimator
>> I0427 13:17:07.152575 31850 process.cpp:3731] Handling HTTP event for
>> process 'slave(738)' with path: '/slave(738)/monitor/statistics'
>> I0427 13:17:07.153619 31859 http.cpp:1115] HTTP GET for
>> /slave(738)/monitor/statistics from 172.17.0.2:43810
>> I0427 13:17:07.153676 31859 http.cpp:936] Authorizing principal
>> 'test-principal' to GET the '/monitor/statistics' endpoint
>> I0427 13:17:07.157068 31870 slave.cpp:790] Agent terminating
>> [       OK ] Endpoint/SlaveEndpointTest.NoAuthorizer/0 (24 ms)
>> [ RUN      ] Endpoint/SlaveEndpointTest.NoAuthorizer/1
>> I0427 13:17:07.166571 31828 containerizer.cpp:221] Using isolation:
>> posix/cpu,posix/mem,filesystem/posix,network/cni
>> W0427 13:17:07.167111 31828 backend.cpp:76] Failed to create 'aufs'
>> backend: AufsBackend requires root privileges
>> W0427 13:17:07.167213 31828 backend.cpp:76] Failed to create 'bind'
>> backend: BindBackend requires root privileges
>> I0427 13:17:07.167253 31828 provisioner.cpp:249] Using default backend
>> 'copy'
>> I0427 13:17:07.168984 31828 cluster.cpp:448] Creating default 'local'
>> authorizer
>> I0427 13:17:07.170557 31870 slave.cpp:225] Mesos agent started on (739)@
>> 172.17.0.2:35555
>> I0427 13:17:07.170578 31870 slave.cpp:226] Flags at startup: --acls=""
>> --appc_simple_discovery_uri_prefix="http://"
>> --appc_store_dir="/tmp/mesos/store/appc" --authenticate_http_readonly="true"
>> --authenticate_http_readwrite="true" --authenticatee="crammd5"
>> --authentication_backoff_factor="1secs" --authorizer="local"
>> --cgroups_cpu_enable_pids_and_tids_count="false"
>> --cgroups_enable_cfs="false" --cgroups_hierarchy="/sys/fs/cgroup"
>> --cgroups_limit_swap="false" --cgroups_root="mesos"
>> --container_disk_watch_interval="15secs" --containerizers="mesos"
>> --credential="/tmp/Endpoint_SlaveEndpointTest_NoAuthorizer_1_GaVshR/credential"
>> --default_role="*" --disk_watch_interval="1mins" --docker="docker"
>> --docker_kill_orphans="true" --docker_registry="https://reg
>> istry-1.docker.io" --docker_remove_delay="6hrs"
>> --docker_socket="/var/run/docker.sock" --docker_stop_timeout="0ns"
>> --docker_store_dir="/tmp/mesos/store/docker"
>> --docker_volume_checkpoint_dir="/var/run/mesos/isolators/docker/volume"
>> --enforce_container_disk_quota="false" --executor_registration_timeout="1mins"
>> --executor_shutdown_grace_period="5secs" --fetcher_cache_dir="/tmp/Endp
>> oint_SlaveEndpointTest_NoAuthorizer_1_GaVshR/fetch"
>> --fetcher_cache_size="2GB" --frameworks_home="" --gc_delay="1weeks"
>> --gc_disk_headroom="0.1" --hadoop_home="" --help="false"
>> --hostname_lookup="true" --http_command_executor="false"
>> --http_credentials="/tmp/Endpoint_SlaveEndpointTest_NoAuthor
>> izer_1_GaVshR/http_credentials" --http_heartbeat_interval="30secs"
>> --initialize_driver_logging="true" --isolation="posix/cpu,posix/mem"
>> --launcher="posix" --launcher_dir="/mesos/mesos-1.3.0/_build/src"
>> --logbufsecs="0" --logging_level="INFO" --max_completed_executors_per_framework="150"
>> --oversubscribed_resources_interval="15secs" --perf_duration="10secs"
>> --perf_interval="1mins" --port="5051" --qos_correction_interval_min="0ns"
>> --quiet="false" --recover="reconnect" --recovery_timeout="15mins"
>> --registration_backoff_factor="10ms" --resources="cpus:2;gpus:0;mem
>> :1024;disk:1024;ports:[31000-32000]" --revocable_cpu_low_priority="true"
>> --runtime_dir="/tmp/Endpoint_SlaveEndpointTest_NoAuthorizer_1_GaVshR"
>> --sandbox_directory="/mnt/mesos/sandbox" --strict="true"
>> --switch_user="true" --systemd_enable_support="true"
>> --systemd_runtime_directory="/run/systemd/system" --version="false"
>> --work_dir="/tmp/Endpoint_SlaveEndpointTest_NoAuthorizer_1_E0EnwB"
>> I0427 13:17:07.170964 31870 credentials.hpp:86] Loading credential for
>> authentication from '/tmp/Endpoint_SlaveEndpointTe
>> st_NoAuthorizer_1_GaVshR/credential'
>> I0427 13:17:07.171145 31870 slave.cpp:258] Agent using credential for:
>> test-principal
>> I0427 13:17:07.171175 31870 credentials.hpp:37] Loading credentials for
>> authentication from '/tmp/Endpoint_SlaveEndpointTe
>> st_NoAuthorizer_1_GaVshR/http_credentials'
>> I0427 13:17:07.171416 31870 http.cpp:975] Creating default 'basic' HTTP
>> authenticator for realm 'mesos-agent-readonly'
>> I0427 13:17:07.171622 31870 http.cpp:975] Creating default 'basic' HTTP
>> authenticator for realm 'mesos-agent-readwrite'
>> I0427 13:17:07.172972 31870 slave.cpp:525] Agent resources: cpus(*):2;
>> mem(*):1024; disk(*):1024; ports(*):[31000-32000]
>> I0427 13:17:07.173056 31870 slave.cpp:533] Agent attributes: [  ]
>> I0427 13:17:07.173069 31870 slave.cpp:538] Agent hostname: ddedc83e4abf
>> I0427 13:17:07.173197 31855 status_update_manager.cpp:177] Pausing
>> sending status updates
>> I0427 13:17:07.174525 31868 state.cpp:62] Recovering state from
>> '/tmp/Endpoint_SlaveEndpointTest_NoAuthorizer_1_E0EnwB/meta'
>> I0427 13:17:07.174803 31870 status_update_manager.cpp:203] Recovering
>> status update manager
>> I0427 13:17:07.175084 31869 containerizer.cpp:608] Recovering
>> containerizer
>> I0427 13:17:07.176420 31859 provisioner.cpp:410] Provisioner recovery
>> complete
>> I0427 13:17:07.176800 31865 slave.cpp:5963] Finished recovery
>> I0427 13:17:07.177265 31865 slave.cpp:6145] Querying resource estimator
>> for oversubscribable resources
>> I0427 13:17:07.177533 31848 slave.cpp:6159] Received oversubscribable
>> resources {} from the resource estimator
>> I0427 13:17:07.179664 31855 process.cpp:3731] Handling HTTP event for
>> process 'slave(739)' with path: '/slave(739)/monitor/statistics.json'
>> I0427 13:17:07.180830 31849 http.cpp:1115] HTTP GET for
>> /slave(739)/monitor/statistics.json from 172.17.0.2:43812
>> I0427 13:17:07.180897 31849 http.cpp:936] Authorizing principal
>> 'test-principal' to GET the '/monitor/statistics.json' endpoint
>> I0427 13:17:07.184032 31867 slave.cpp:790] Agent terminating
>> [       OK ] Endpoint/SlaveEndpointTest.NoAuthorizer/1 (26 ms)
>> [ RUN      ] Endpoint/SlaveEndpointTest.NoAuthorizer/2
>> I0427 13:17:07.193714 31828 containerizer.cpp:221] Using isolation:
>> posix/cpu,posix/mem,filesystem/posix,network/cni
>> W0427 13:17:07.194202 31828 backend.cpp:76] Failed to create 'aufs'
>> backend: AufsBackend requires root privileges
>> W0427 13:17:07.194295 31828 backend.cpp:76] Failed to create 'bind'
>> backend: BindBackend requires root privileges
>> I0427 13:17:07.194324 31828 provisioner.cpp:249] Using default backend
>> 'copy'
>> I0427 13:17:07.195804 31828 cluster.cpp:448] Creating default 'local'
>> authorizer
>> I0427 13:17:07.197329 31861 slave.cpp:225] Mesos agent started on (740)@
>> 172.17.0.2:35555
>> I0427 13:17:07.197355 31861 slave.cpp:226] Flags at startup: --acls=""
>> --appc_simple_discovery_uri_prefix="http://"
>> --appc_store_dir="/tmp/mesos/store/appc" --authenticate_http_readonly="true"
>> --authenticate_http_readwrite="true" --authenticatee="crammd5"
>> --authentication_backoff_factor="1secs" --authorizer="local"
>> --cgroups_cpu_enable_pids_and_tids_count="false"
>> --cgroups_enable_cfs="false" --cgroups_hierarchy="/sys/fs/cgroup"
>> --cgroups_limit_swap="false" --cgroups_root="mesos"
>> --container_disk_watch_interval="15secs" --containerizers="mesos"
>> --credential="/tmp/Endpoint_SlaveEndpointTest_NoAuthorizer_2_QQPBxS/credential"
>> --default_role="*" --disk_watch_interval="1mins" --docker="docker"
>> --docker_kill_orphans="true" --docker_registry="https://reg
>> istry-1.docker.io" --docker_remove_delay="6hrs"
>> --docker_socket="/var/run/docker.sock" --docker_stop_timeout="0ns"
>> --docker_store_dir="/tmp/mesos/store/docker"
>> --docker_volume_checkpoint_dir="/var/run/mesos/isolators/docker/volume"
>> --enforce_container_disk_quota="false" --executor_registration_timeout="1mins"
>> --executor_shutdown_grace_period="5secs" --fetcher_cache_dir="/tmp/Endp
>> oint_SlaveEndpointTest_NoAuthorizer_2_QQPBxS/fetch"
>> --fetcher_cache_size="2GB" --frameworks_home="" --gc_delay="1weeks"
>> --gc_disk_headroom="0.1" --hadoop_home="" --help="false"
>> --hostname_lookup="true" --http_command_executor="false"
>> --http_credentials="/tmp/Endpoint_SlaveEndpointTest_NoAuthor
>> izer_2_QQPBxS/http_credentials" --http_heartbeat_interval="30secs"
>> --initialize_driver_logging="true" --isolation="posix/cpu,posix/mem"
>> --launcher="posix" --launcher_dir="/mesos/mesos-1.3.0/_build/src"
>> --logbufsecs="0" --logging_level="INFO" --max_completed_executors_per_framework="150"
>> --oversubscribed_resources_interval="15secs" --perf_duration="10secs"
>> --perf_interval="1mins" --port="5051" --qos_correction_interval_min="0ns"
>> --quiet="false" --recover="reconnect" --recovery_timeout="15mins"
>> --registration_backoff_factor="10ms" --resources="cpus:2;gpus:0;mem
>> :1024;disk:1024;ports:[31000-32000]" --revocable_cpu_low_priority="true"
>> --runtime_dir="/tmp/Endpoint_SlaveEndpointTest_NoAuthorizer_2_QQPBxS"
>> --sandbox_directory="/mnt/mesos/sandbox" --strict="true"
>> --switch_user="true" --systemd_enable_support="true"
>> --systemd_runtime_directory="/run/systemd/system" --version="false"
>> --work_dir="/tmp/Endpoint_SlaveEndpointTest_NoAuthorizer_2_GZptIC"
>> I0427 13:17:07.197908 31861 credentials.hpp:86] Loading credential for
>> authentication from '/tmp/Endpoint_SlaveEndpointTe
>> st_NoAuthorizer_2_QQPBxS/credential'
>> I0427 13:17:07.198091 31861 slave.cpp:258] Agent using credential for:
>> test-principal
>> I0427 13:17:07.198120 31861 credentials.hpp:37] Loading credentials for
>> authentication from '/tmp/Endpoint_SlaveEndpointTe
>> st_NoAuthorizer_2_QQPBxS/http_credentials'
>> I0427 13:17:07.198443 31861 http.cpp:975] Creating default 'basic' HTTP
>> authenticator for realm 'mesos-agent-readonly'
>> I0427 13:17:07.198622 31861 http.cpp:975] Creating default 'basic' HTTP
>> authenticator for realm 'mesos-agent-readwrite'
>> I0427 13:17:07.199952 31861 slave.cpp:525] Agent resources: cpus(*):2;
>> mem(*):1024; disk(*):1024; ports(*):[31000-32000]
>> I0427 13:17:07.200038 31861 slave.cpp:533] Agent attributes: [  ]
>> I0427 13:17:07.200052 31861 slave.cpp:538] Agent hostname: ddedc83e4abf
>> I0427 13:17:07.200167 31867 status_update_manager.cpp:177] Pausing
>> sending status updates
>> I0427 13:17:07.201472 31851 state.cpp:62] Recovering state from
>> '/tmp/Endpoint_SlaveEndpointTest_NoAuthorizer_2_GZptIC/meta'
>> I0427 13:17:07.201772 31863 status_update_manager.cpp:203] Recovering
>> status update manager
>> I0427 13:17:07.201984 31858 containerizer.cpp:608] Recovering
>> containerizer
>> I0427 13:17:07.203322 31850 provisioner.cpp:410] Provisioner recovery
>> complete
>> I0427 13:17:07.203761 31863 slave.cpp:5963] Finished recovery
>> I0427 13:17:07.204218 31863 slave.cpp:6145] Querying resource estimator
>> for oversubscribable resources
>> I0427 13:17:07.204520 31868 slave.cpp:6159] Received oversubscribable
>> resources {} from the resource estimator
>> I0427 13:17:07.206689 31854 process.cpp:3731] Handling HTTP event for
>> process 'slave(740)' with path: '/slave(740)/containers'
>> I0427 13:17:07.207892 31850 http.cpp:1115] HTTP GET for
>> /slave(740)/containers from 172.17.0.2:43814
>> I0427 13:17:07.207974 31850 http.cpp:936] Authorizing principal
>> 'test-principal' to GET the '/containers' endpoint
>> I0427 13:17:07.211236 31868 slave.cpp:790] Agent terminating
>> [       OK ] Endpoint/SlaveEndpointTest.NoAuthorizer/2 (26 ms)
>> [----------] 9 tests from Endpoint/SlaveEndpointTest (235 ms total)
>>
>> [----------] Global test environment tear-down
>> [==========] 1559 tests from 175 test cases ran. (543451 ms total)
>> [  PASSED  ] 1558 tests.
>> [  FAILED  ] 1 test, listed below:
>> [  FAILED  ] CommandExecutorCheckTest.HTTPCheckDelivered
>>
>>  1 FAILED TEST
>>   YOU HAVE 19 DISABLED TESTS
>>
>> E0427 13:17:07.275519 31871 process.cpp:951] Failed to accept socket:
>> future discarded
>> make[4]: *** [check-local] Error 1
>> make[4]: Leaving directory `/mesos/mesos-1.3.0/_build/src'
>> make[3]: *** [check-am] Error 2
>> make[3]: Leaving directory `/mesos/mesos-1.3.0/_build/src'
>> make[2]: *** [check] Error 2
>> make[2]: Leaving directory `/mesos/mesos-1.3.0/_build/src'
>> make[1]: *** [check-recursive] Error 1
>> make[1]: Leaving directory `/mesos/mesos-1.3.0/_build'
>> make: *** [distcheck] Error 1
>> + docker rmi mesos-1493296577-29426
>> Untagged: mesos-1493296577-29426:latest
>> Deleted: sha256:382c63c54ef5413250fa9a8a96a503130464592be3d3e0eb595dd
>> 4b521c8bcf0
>> Deleted: sha256:b3c19def32a606b374cfcbd0122ead5c58f33a0fdbb25eb7ef6c1
>> 7ac92b85acb
>> Deleted: sha256:b6c203413ebb7661adf5b1dfafc74a8dc4311f9bb017fd01cda91
>> 7f3ed8726a5
>> Deleted: sha256:343aab1525e6d6db0ca6c8f930f799b03ab3c8e7439196f258aa1
>> de564e63a5f
>> Deleted: sha256:5d8ada92cfc2357f2914203b6dfe1fbc7736b17ffa82154f1e097
>> aad4ee90800
>> Deleted: sha256:c3c34af508b9c4d04151f0a4578f65637fa0ce97bb67ec0775980
>> 1bac651e2ae
>> Deleted: sha256:03b345ba028c6fd549ef395574db95e72c4bb6c0b2daf170c80ac
>> 561858dac57
>> Deleted: sha256:7af2caac417973b11b214901422e9f0c60fb89be3bb2cfc350a64
>> f805cab8b41
>> Deleted: sha256:43ac704b4117e289489a3d42f7f7180148abb0bb78372c5a8bfcb
>> 83b2f988c82
>> Deleted: sha256:c0f800439e7146ae8a98b02815ac94ad263e747bfe66624a8a78c
>> d6a6be7e1b6
>> Deleted: sha256:32eb8073a9c821c95bcc581c70cca8859929529cfbdbd47dab8f1
>> aaa7d914091
>> Deleted: sha256:34a57729e47b0be689749c319a628a7d9b35f8ca51859892ffc4e
>> f536e8eb82d
>> Deleted: sha256:1a8d7dd6972bda4a22e2d893b4a61ff56030ae00c041ea02b235d
>> dec0d33eba9
>> Deleted: sha256:7da2479a66c231c3558cc037f9960331a3d677fd03f3161d173ee
>> 071bdc9789e
>> Deleted: sha256:b0664f308624c4d8c8885bdc29630cbaa86785e3cbcc7a38fc1ac
>> 304da97386d
>> Deleted: sha256:51351540baefef7554b1fc83ce682ed5f858369057e5c8819035e
>> 6b5e35bce5b
>> Deleted: sha256:4fd8e57460ee5c3feaeb27d7e412ba57ead524c4b96a43766585e
>> a1a2c708fae
>> Deleted: sha256:0f304cba28b4ddfea3565c0ff3891de35cc9612f78f4ab0a0fba5
>> c496536d798
>> Deleted: sha256:2d94d89466762d700567c1770ae6e5677246e0c35d00797a4a01d
>> 88ab020ed5e
>> Deleted: sha256:2205fac5ea5356716f75a8a25e8ebbd80979cf19c6d2cc3b851b8
>> 51157782bee
>> Deleted: sha256:6a2550e0ff001ec279258b9eaf192ebedf70126cda34b46615fce
>> 31a44c19d90
>> Deleted: sha256:00ccfeaa3c07a340edb6e037a9d4353c38d5947ab7555eba6426e
>> b2807d56b7b
>> Deleted: sha256:d122335a6c18897d44b1e9bb5d16b3cd8c23d9f4d049b8e69693b
>> 895f505bc1d
>> Deleted: sha256:d4e17a86ebea6038051f6c185552e9e25d1161b5406e94e823e47
>> 163f3b27160
>> Deleted: sha256:acdefd3506e400dcea6d7872ad60541f43b3362ec84ce1a0b20d5
>> 6c0970e30d4
>> Build step 'Execute shell' marked build as failure
>>
>
>

Mime
  • Unnamed multipart/alternative (inline, None, 0 bytes)
View raw message