mesos-builds mailing list archives

Site index · List index
Message view « Date » · « Thread »
Top « Date » · « Thread »
From Apache Jenkins Server <jenk...@builds.apache.org>
Subject Build failed in Jenkins: Mesos-Buildbot » autotools,gcc,--verbose --enable-libevent --enable-ssl,GLOG_v=1 MESOS_VERBOSE=1,centos:7,(docker||Hadoop)&&(!ubuntu-us1)&&(!ubuntu-eu2) #3578
Date Thu, 27 Apr 2017 22:27:55 GMT
See <https://builds.apache.org/job/Mesos-Buildbot/BUILDTOOL=autotools,COMPILER=gcc,CONFIGURATION=--verbose%20--enable-libevent%20--enable-ssl,ENVIRONMENT=GLOG_v=1%20MESOS_VERBOSE=1,OS=centos%3A7,label_exp=(docker%7C%7CHadoop)&&(!ubuntu-us1)&&(!ubuntu-eu2)/3578/display/redirect?page=changes>

Changes:

[alexr] Fixed if-clause indentation in "mesos/containerizer.cpp".

------------------------------------------
[...truncated 27.81 MB...]
I0427 22:27:46.094825 21612 slave.cpp:790] Agent terminating
[       OK ] Endpoint/SlaveEndpointTest.AuthorizedRequest/2 (40 ms)
[ RUN      ] Endpoint/SlaveEndpointTest.UnauthorizedRequest/0
I0427 22:27:46.109809  2247 containerizer.cpp:221] Using isolation: posix/cpu,posix/mem,filesystem/posix,network/cni
W0427 22:27:46.110329  2247 backend.cpp:76] Failed to create 'aufs' backend: AufsBackend requires
root privileges
W0427 22:27:46.110453  2247 backend.cpp:76] Failed to create 'bind' backend: BindBackend requires
root privileges
I0427 22:27:46.110496  2247 provisioner.cpp:249] Using default backend 'copy'
I0427 22:27:46.113481 21613 slave.cpp:225] Mesos agent started on (741)@172.17.0.2:39947
I0427 22:27:46.113521 21613 slave.cpp:226] Flags at startup: --acls="" --appc_simple_discovery_uri_prefix="http://"
--appc_store_dir="/tmp/mesos/store/appc" --authenticate_http_executors="true" --authenticate_http_readonly="true"
--authenticate_http_readwrite="true" --authenticatee="crammd5" --authentication_backoff_factor="1secs"
--authorizer="local" --cgroups_cpu_enable_pids_and_tids_count="false" --cgroups_enable_cfs="false"
--cgroups_hierarchy="/sys/fs/cgroup" --cgroups_limit_swap="false" --cgroups_root="mesos" --container_disk_watch_interval="15secs"
--containerizers="mesos" --credential="/tmp/Endpoint_SlaveEndpointTest_UnauthorizedRequest_0_dJrHos/credential"
--default_role="*" --disk_watch_interval="1mins" --docker="docker" --docker_kill_orphans="true"
--docker_registry="https://registry-1.docker.io" --docker_remove_delay="6hrs" --docker_socket="/var/run/docker.sock"
--docker_stop_timeout="0ns" --docker_store_dir="/tmp/mesos/store/docker" --docker_volume_checkpoint_dir="/var/run/mesos/isolators/docker/volume"
--enforce_container_disk_quota="false" --executor_registration_timeout="1mins" --executor_secret_key="/tmp/Endpoint_SlaveEndpointTest_UnauthorizedRequest_0_dJrHos/executor_secret_key"
--executor_shutdown_grace_period="5secs" --fetcher_cache_dir="/tmp/Endpoint_SlaveEndpointTest_UnauthorizedRequest_0_dJrHos/fetch"
--fetcher_cache_size="2GB" --frameworks_home="" --gc_delay="1weeks" --gc_disk_headroom="0.1"
--hadoop_home="" --help="false" --hostname_lookup="true" --http_command_executor="false" --http_credentials="/tmp/Endpoint_SlaveEndpointTest_UnauthorizedRequest_0_dJrHos/http_credentials"
--http_heartbeat_interval="30secs" --initialize_driver_logging="true" --isolation="posix/cpu,posix/mem"
--launcher="posix" --launcher_dir="/mesos/mesos-1.3.0/_build/src" --logbufsecs="0" --logging_level="INFO"
--max_completed_executors_per_framework="150" --oversubscribed_resources_interval="15secs"
--perf_duration="10secs" --perf_interval="1mins" --port="5051" --qos_correction_interval_min="0ns"
--quiet="false" --recover="reconnect" --recovery_timeout="15mins" --registration_backoff_factor="10ms"
--resources="cpus:2;gpus:0;mem:1024;disk:1024;ports:[31000-32000]" --revocable_cpu_low_priority="true"
--runtime_dir="/tmp/Endpoint_SlaveEndpointTest_UnauthorizedRequest_0_dJrHos" --sandbox_directory="/mnt/mesos/sandbox"
--strict="true" --switch_user="true" --systemd_enable_support="true" --systemd_runtime_directory="/run/systemd/system"
--version="false" --work_dir="/tmp/Endpoint_SlaveEndpointTest_UnauthorizedRequest_0_0NOIfx"
I0427 22:27:46.114156 21613 credentials.hpp:86] Loading credential for authentication from
'/tmp/Endpoint_SlaveEndpointTest_UnauthorizedRequest_0_dJrHos/credential'
I0427 22:27:46.114414 21613 slave.cpp:258] Agent using credential for: test-principal
I0427 22:27:46.114441 21613 credentials.hpp:37] Loading credentials for authentication from
'/tmp/Endpoint_SlaveEndpointTest_UnauthorizedRequest_0_dJrHos/http_credentials'
I0427 22:27:46.114830 21613 http.cpp:975] Creating default 'basic' HTTP authenticator for
realm 'mesos-agent-executor'
I0427 22:27:46.115037 21613 http.cpp:996] Creating default 'jwt' HTTP authenticator for realm
'mesos-agent-executor'
I0427 22:27:46.115305 21613 http.cpp:975] Creating default 'basic' HTTP authenticator for
realm 'mesos-agent-readonly'
I0427 22:27:46.115429 21613 http.cpp:996] Creating default 'jwt' HTTP authenticator for realm
'mesos-agent-readonly'
I0427 22:27:46.115650 21613 http.cpp:975] Creating default 'basic' HTTP authenticator for
realm 'mesos-agent-readwrite'
I0427 22:27:46.115757 21613 http.cpp:996] Creating default 'jwt' HTTP authenticator for realm
'mesos-agent-readwrite'
I0427 22:27:46.117898 21613 slave.cpp:525] Agent resources: cpus(*):2; mem(*):1024; disk(*):1024;
ports(*):[31000-32000]
I0427 22:27:46.118022 21613 slave.cpp:533] Agent attributes: [  ]
I0427 22:27:46.118041 21613 slave.cpp:538] Agent hostname: f8b086e5797f
I0427 22:27:46.118213 21606 status_update_manager.cpp:177] Pausing sending status updates
I0427 22:27:46.119948 21608 state.cpp:62] Recovering state from '/tmp/Endpoint_SlaveEndpointTest_UnauthorizedRequest_0_0NOIfx/meta'
I0427 22:27:46.120255 21606 status_update_manager.cpp:203] Recovering status update manager
I0427 22:27:46.120628 21611 containerizer.cpp:608] Recovering containerizer
I0427 22:27:46.122367 21609 provisioner.cpp:410] Provisioner recovery complete
I0427 22:27:46.122802 21617 slave.cpp:5963] Finished recovery
I0427 22:27:46.123333 21617 slave.cpp:6145] Querying resource estimator for oversubscribable
resources
I0427 22:27:46.123688 21603 slave.cpp:6159] Received oversubscribable resources {} from the
resource estimator
I0427 22:27:46.126441 21601 process.cpp:3731] Handling HTTP event for process 'slave(741)'
with path: '/slave(741)/monitor/statistics'
I0427 22:27:46.128633 21622 http.cpp:1115] HTTP GET for /slave(741)/monitor/statistics from
172.17.0.2:54176
I0427 22:27:46.128707 21622 http.cpp:936] Authorizing principal 'test-principal' to GET the
'/monitor/statistics' endpoint
I0427 22:27:46.130959 21605 slave.cpp:790] Agent terminating
[       OK ] Endpoint/SlaveEndpointTest.UnauthorizedRequest/0 (31 ms)
[ RUN      ] Endpoint/SlaveEndpointTest.UnauthorizedRequest/1
I0427 22:27:46.144209  2247 containerizer.cpp:221] Using isolation: posix/cpu,posix/mem,filesystem/posix,network/cni
W0427 22:27:46.145058  2247 backend.cpp:76] Failed to create 'aufs' backend: AufsBackend requires
root privileges
W0427 22:27:46.145192  2247 backend.cpp:76] Failed to create 'bind' backend: BindBackend requires
root privileges
I0427 22:27:46.145239  2247 provisioner.cpp:249] Using default backend 'copy'
I0427 22:27:46.149300 21620 slave.cpp:225] Mesos agent started on (742)@172.17.0.2:39947
I0427 22:27:46.149328 21620 slave.cpp:226] Flags at startup: --acls="" --appc_simple_discovery_uri_prefix="http://"
--appc_store_dir="/tmp/mesos/store/appc" --authenticate_http_executors="true" --authenticate_http_readonly="true"
--authenticate_http_readwrite="true" --authenticatee="crammd5" --authentication_backoff_factor="1secs"
--authorizer="local" --cgroups_cpu_enable_pids_and_tids_count="false" --cgroups_enable_cfs="false"
--cgroups_hierarchy="/sys/fs/cgroup" --cgroups_limit_swap="false" --cgroups_root="mesos" --container_disk_watch_interval="15secs"
--containerizers="mesos" --credential="/tmp/Endpoint_SlaveEndpointTest_UnauthorizedRequest_1_k1f7e9/credential"
--default_role="*" --disk_watch_interval="1mins" --docker="docker" --docker_kill_orphans="true"
--docker_registry="https://registry-1.docker.io" --docker_remove_delay="6hrs" --docker_socket="/var/run/docker.sock"
--docker_stop_timeout="0ns" --docker_store_dir="/tmp/mesos/store/docker" --docker_volume_checkpoint_dir="/var/run/mesos/isolators/docker/volume"
--enforce_container_disk_quota="false" --executor_registration_timeout="1mins" --executor_secret_key="/tmp/Endpoint_SlaveEndpointTest_UnauthorizedRequest_1_k1f7e9/executor_secret_key"
--executor_shutdown_grace_period="5secs" --fetcher_cache_dir="/tmp/Endpoint_SlaveEndpointTest_UnauthorizedRequest_1_k1f7e9/fetch"
--fetcher_cache_size="2GB" --frameworks_home="" --gc_delay="1weeks" --gc_disk_headroom="0.1"
--hadoop_home="" --help="false" --hostname_lookup="true" --http_command_executor="false" --http_credentials="/tmp/Endpoint_SlaveEndpointTest_UnauthorizedRequest_1_k1f7e9/http_credentials"
--http_heartbeat_interval="30secs" --initialize_driver_logging="true" --isolation="posix/cpu,posix/mem"
--launcher="posix" --launcher_dir="/mesos/mesos-1.3.0/_build/src" --logbufsecs="0" --logging_level="INFO"
--max_completed_executors_per_framework="150" --oversubscribed_resources_interval="15secs"
--perf_duration="10secs" --perf_interval="1mins" --port="5051" --qos_correction_interval_min="0ns"
--quiet="false" --recover="reconnect" --recovery_timeout="15mins" --registration_backoff_factor="10ms"
--resources="cpus:2;gpus:0;mem:1024;disk:1024;ports:[31000-32000]" --revocable_cpu_low_priority="true"
--runtime_dir="/tmp/Endpoint_SlaveEndpointTest_UnauthorizedRequest_1_k1f7e9" --sandbox_directory="/mnt/mesos/sandbox"
--strict="true" --switch_user="true" --systemd_enable_support="true" --systemd_runtime_directory="/run/systemd/system"
--version="false" --work_dir="/tmp/Endpoint_SlaveEndpointTest_UnauthorizedRequest_1_ATtf1d"
I0427 22:27:46.149724 21620 credentials.hpp:86] Loading credential for authentication from
'/tmp/Endpoint_SlaveEndpointTest_UnauthorizedRequest_1_k1f7e9/credential'
I0427 22:27:46.149889 21620 slave.cpp:258] Agent using credential for: test-principal
I0427 22:27:46.149909 21620 credentials.hpp:37] Loading credentials for authentication from
'/tmp/Endpoint_SlaveEndpointTest_UnauthorizedRequest_1_k1f7e9/http_credentials'
I0427 22:27:46.150163 21620 http.cpp:975] Creating default 'basic' HTTP authenticator for
realm 'mesos-agent-executor'
I0427 22:27:46.150276 21620 http.cpp:996] Creating default 'jwt' HTTP authenticator for realm
'mesos-agent-executor'
I0427 22:27:46.150615 21620 http.cpp:975] Creating default 'basic' HTTP authenticator for
realm 'mesos-agent-readonly'
I0427 22:27:46.150720 21620 http.cpp:996] Creating default 'jwt' HTTP authenticator for realm
'mesos-agent-readonly'
I0427 22:27:46.151106 21620 http.cpp:975] Creating default 'basic' HTTP authenticator for
realm 'mesos-agent-readwrite'
I0427 22:27:46.151216 21620 http.cpp:996] Creating default 'jwt' HTTP authenticator for realm
'mesos-agent-readwrite'
I0427 22:27:46.152480 21620 slave.cpp:525] Agent resources: cpus(*):2; mem(*):1024; disk(*):1024;
ports(*):[31000-32000]
I0427 22:27:46.152559 21620 slave.cpp:533] Agent attributes: [  ]
I0427 22:27:46.152570 21620 slave.cpp:538] Agent hostname: f8b086e5797f
I0427 22:27:46.152700 21607 status_update_manager.cpp:177] Pausing sending status updates
I0427 22:27:46.154137 21600 state.cpp:62] Recovering state from '/tmp/Endpoint_SlaveEndpointTest_UnauthorizedRequest_1_ATtf1d/meta'
I0427 22:27:46.154389 21615 status_update_manager.cpp:203] Recovering status update manager
I0427 22:27:46.154604 21600 containerizer.cpp:608] Recovering containerizer
I0427 22:27:46.156088 21602 provisioner.cpp:410] Provisioner recovery complete
I0427 22:27:46.156489 21614 slave.cpp:5963] Finished recovery
I0427 22:27:46.157114 21614 slave.cpp:6145] Querying resource estimator for oversubscribable
resources
I0427 22:27:46.157408 21600 slave.cpp:6159] Received oversubscribable resources {} from the
resource estimator
I0427 22:27:46.160063 21618 process.cpp:3731] Handling HTTP event for process 'slave(742)'
with path: '/slave(742)/monitor/statistics.json'
I0427 22:27:46.162246 21604 http.cpp:1115] HTTP GET for /slave(742)/monitor/statistics.json
from 172.17.0.2:54178
I0427 22:27:46.162348 21604 http.cpp:936] Authorizing principal 'test-principal' to GET the
'/monitor/statistics.json' endpoint
I0427 22:27:46.164923 21620 slave.cpp:790] Agent terminating
[       OK ] Endpoint/SlaveEndpointTest.UnauthorizedRequest/1 (33 ms)
[ RUN      ] Endpoint/SlaveEndpointTest.UnauthorizedRequest/2
I0427 22:27:46.175583  2247 containerizer.cpp:221] Using isolation: posix/cpu,posix/mem,filesystem/posix,network/cni
W0427 22:27:46.176128  2247 backend.cpp:76] Failed to create 'aufs' backend: AufsBackend requires
root privileges
W0427 22:27:46.176242  2247 backend.cpp:76] Failed to create 'bind' backend: BindBackend requires
root privileges
I0427 22:27:46.176286  2247 provisioner.cpp:249] Using default backend 'copy'
I0427 22:27:46.179267 21610 slave.cpp:225] Mesos agent started on (743)@172.17.0.2:39947
I0427 22:27:46.179313 21610 slave.cpp:226] Flags at startup: --acls="" --appc_simple_discovery_uri_prefix="http://"
--appc_store_dir="/tmp/mesos/store/appc" --authenticate_http_executors="true" --authenticate_http_readonly="true"
--authenticate_http_readwrite="true" --authenticatee="crammd5" --authentication_backoff_factor="1secs"
--authorizer="local" --cgroups_cpu_enable_pids_and_tids_count="false" --cgroups_enable_cfs="false"
--cgroups_hierarchy="/sys/fs/cgroup" --cgroups_limit_swap="false" --cgroups_root="mesos" --container_disk_watch_interval="15secs"
--containerizers="mesos" --credential="/tmp/Endpoint_SlaveEndpointTest_UnauthorizedRequest_2_VczjpQ/credential"
--default_role="*" --disk_watch_interval="1mins" --docker="docker" --docker_kill_orphans="true"
--docker_registry="https://registry-1.docker.io" --docker_remove_delay="6hrs" --docker_socket="/var/run/docker.sock"
--docker_stop_timeout="0ns" --docker_store_dir="/tmp/mesos/store/docker" --docker_volume_checkpoint_dir="/var/run/mesos/isolators/docker/volume"
--enforce_container_disk_quota="false" --executor_registration_timeout="1mins" --executor_secret_key="/tmp/Endpoint_SlaveEndpointTest_UnauthorizedRequest_2_VczjpQ/executor_secret_key"
--executor_shutdown_grace_period="5secs" --fetcher_cache_dir="/tmp/Endpoint_SlaveEndpointTest_UnauthorizedRequest_2_VczjpQ/fetch"
--fetcher_cache_size="2GB" --frameworks_home="" --gc_delay="1weeks" --gc_disk_headroom="0.1"
--hadoop_home="" --help="false" --hostname_lookup="true" --http_command_executor="false" --http_credentials="/tmp/Endpoint_SlaveEndpointTest_UnauthorizedRequest_2_VczjpQ/http_credentials"
--http_heartbeat_interval="30secs" --initialize_driver_logging="true" --isolation="posix/cpu,posix/mem"
--launcher="posix" --launcher_dir="/mesos/mesos-1.3.0/_build/src" --logbufsecs="0" --logging_level="INFO"
--max_completed_executors_per_framework="150" --oversubscribed_resources_interval="15secs"
--perf_duration="10secs" --perf_interval="1mins" --port="5051" --qos_correction_interval_min="0ns"
--quiet="false" --recover="reconnect" --recovery_timeout="15mins" --registration_backoff_factor="10ms"
--resources="cpus:2;gpus:0;mem:1024;disk:1024;ports:[31000-32000]" --revocable_cpu_low_priority="true"
--runtime_dir="/tmp/Endpoint_SlaveEndpointTest_UnauthorizedRequest_2_VczjpQ" --sandbox_directory="/mnt/mesos/sandbox"
--strict="true" --switch_user="true" --systemd_enable_support="true" --systemd_runtime_directory="/run/systemd/system"
--version="false" --work_dir="/tmp/Endpoint_SlaveEndpointTest_UnauthorizedRequest_2_91Cz6U"
I0427 22:27:46.179986 21610 credentials.hpp:86] Loading credential for authentication from
'/tmp/Endpoint_SlaveEndpointTest_UnauthorizedRequest_2_VczjpQ/credential'
I0427 22:27:46.180248 21610 slave.cpp:258] Agent using credential for: test-principal
I0427 22:27:46.180275 21610 credentials.hpp:37] Loading credentials for authentication from
'/tmp/Endpoint_SlaveEndpointTest_UnauthorizedRequest_2_VczjpQ/http_credentials'
I0427 22:27:46.180655 21610 http.cpp:975] Creating default 'basic' HTTP authenticator for
realm 'mesos-agent-executor'
I0427 22:27:46.180820 21610 http.cpp:996] Creating default 'jwt' HTTP authenticator for realm
'mesos-agent-executor'
I0427 22:27:46.181157 21610 http.cpp:975] Creating default 'basic' HTTP authenticator for
realm 'mesos-agent-readonly'
I0427 22:27:46.181357 21610 http.cpp:996] Creating default 'jwt' HTTP authenticator for realm
'mesos-agent-readonly'
I0427 22:27:46.181685 21610 http.cpp:975] Creating default 'basic' HTTP authenticator for
realm 'mesos-agent-readwrite'
I0427 22:27:46.181790 21610 http.cpp:996] Creating default 'jwt' HTTP authenticator for realm
'mesos-agent-readwrite'
I0427 22:27:46.183545 21610 slave.cpp:525] Agent resources: cpus(*):2; mem(*):1024; disk(*):1024;
ports(*):[31000-32000]
I0427 22:27:46.183672 21610 slave.cpp:533] Agent attributes: [  ]
I0427 22:27:46.183696 21610 slave.cpp:538] Agent hostname: f8b086e5797f
I0427 22:27:46.183890 21603 status_update_manager.cpp:177] Pausing sending status updates
I0427 22:27:46.185626 21607 state.cpp:62] Recovering state from '/tmp/Endpoint_SlaveEndpointTest_UnauthorizedRequest_2_91Cz6U/meta'
I0427 22:27:46.185919 21621 status_update_manager.cpp:203] Recovering status update manager
I0427 22:27:46.186378 21610 containerizer.cpp:608] Recovering containerizer
I0427 22:27:46.187939 21614 provisioner.cpp:410] Provisioner recovery complete
I0427 22:27:46.188292 21600 slave.cpp:5963] Finished recovery
I0427 22:27:46.188781 21600 slave.cpp:6145] Querying resource estimator for oversubscribable
resources
I0427 22:27:46.189086 21622 slave.cpp:6159] Received oversubscribable resources {} from the
resource estimator
I0427 22:27:46.191658 21601 process.cpp:3731] Handling HTTP event for process 'slave(743)'
with path: '/slave(743)/containers'
I0427 22:27:46.193542 21607 http.cpp:1115] HTTP GET for /slave(743)/containers from 172.17.0.2:54180
I0427 22:27:46.193615 21607 http.cpp:936] Authorizing principal 'test-principal' to GET the
'/containers' endpoint
I0427 22:27:46.196305 21620 slave.cpp:790] Agent terminating
[       OK ] Endpoint/SlaveEndpointTest.UnauthorizedRequest/2 (30 ms)
[ RUN      ] Endpoint/SlaveEndpointTest.NoAuthorizer/0
I0427 22:27:46.206645  2247 containerizer.cpp:221] Using isolation: posix/cpu,posix/mem,filesystem/posix,network/cni
W0427 22:27:46.207171  2247 backend.cpp:76] Failed to create 'aufs' backend: AufsBackend requires
root privileges
W0427 22:27:46.207285  2247 backend.cpp:76] Failed to create 'bind' backend: BindBackend requires
root privileges
I0427 22:27:46.207329  2247 provisioner.cpp:249] Using default backend 'copy'
I0427 22:27:46.208925  2247 cluster.cpp:448] Creating default 'local' authorizer
I0427 22:27:46.211170 21602 slave.cpp:225] Mesos agent started on (744)@172.17.0.2:39947
I0427 22:27:46.211191 21602 slave.cpp:226] Flags at startup: --acls="" --appc_simple_discovery_uri_prefix="http://"
--appc_store_dir="/tmp/mesos/store/appc" --authenticate_http_executors="true" --authenticate_http_readonly="true"
--authenticate_http_readwrite="true" --authenticatee="crammd5" --authentication_backoff_factor="1secs"
--authorizer="local" --cgroups_cpu_enable_pids_and_tids_count="false" --cgroups_enable_cfs="false"
--cgroups_hierarchy="/sys/fs/cgroup" --cgroups_limit_swap="false" --cgroups_root="mesos" --container_disk_watch_interval="15secs"
--containerizers="mesos" --credential="/tmp/Endpoint_SlaveEndpointTest_NoAuthorizer_0_J5J5Rx/credential"
--default_role="*" --disk_watch_interval="1mins" --docker="docker" --docker_kill_orphans="true"
--docker_registry="https://registry-1.docker.io" --docker_remove_delay="6hrs" --docker_socket="/var/run/docker.sock"
--docker_stop_timeout="0ns" --docker_store_dir="/tmp/mesos/store/docker" --docker_volume_checkpoint_dir="/var/run/mesos/isolators/docker/volume"
--enforce_container_disk_quota="false" --executor_registration_timeout="1mins" --executor_secret_key="/tmp/Endpoint_SlaveEndpointTest_NoAuthorizer_0_J5J5Rx/executor_secret_key"
--executor_shutdown_grace_period="5secs" --fetcher_cache_dir="/tmp/Endpoint_SlaveEndpointTest_NoAuthorizer_0_J5J5Rx/fetch"
--fetcher_cache_size="2GB" --frameworks_home="" --gc_delay="1weeks" --gc_disk_headroom="0.1"
--hadoop_home="" --help="false" --hostname_lookup="true" --http_command_executor="false" --http_credentials="/tmp/Endpoint_SlaveEndpointTest_NoAuthorizer_0_J5J5Rx/http_credentials"
--http_heartbeat_interval="30secs" --initialize_driver_logging="true" --isolation="posix/cpu,posix/mem"
--launcher="posix" --launcher_dir="/mesos/mesos-1.3.0/_build/src" --logbufsecs="0" --logging_level="INFO"
--max_completed_executors_per_framework="150" --oversubscribed_resources_interval="15secs"
--perf_duration="10secs" --perf_interval="1mins" --port="5051" --qos_correction_interval_min="0ns"
--quiet="false" --recover="reconnect" --recovery_timeout="15mins" --registration_backoff_factor="10ms"
--resources="cpus:2;gpus:0;mem:1024;disk:1024;ports:[31000-32000]" --revocable_cpu_low_priority="true"
--runtime_dir="/tmp/Endpoint_SlaveEndpointTest_NoAuthorizer_0_J5J5Rx" --sandbox_directory="/mnt/mesos/sandbox"
--strict="true" --switch_user="true" --systemd_enable_support="true" --systemd_runtime_directory="/run/systemd/system"
--version="false" --work_dir="/tmp/Endpoint_SlaveEndpointTest_NoAuthorizer_0_YE5JuC"
I0427 22:27:46.211565 21602 credentials.hpp:86] Loading credential for authentication from
'/tmp/Endpoint_SlaveEndpointTest_NoAuthorizer_0_J5J5Rx/credential'
I0427 22:27:46.211732 21602 slave.cpp:258] Agent using credential for: test-principal
I0427 22:27:46.211755 21602 credentials.hpp:37] Loading credentials for authentication from
'/tmp/Endpoint_SlaveEndpointTest_NoAuthorizer_0_J5J5Rx/http_credentials'
I0427 22:27:46.212095 21602 http.cpp:975] Creating default 'basic' HTTP authenticator for
realm 'mesos-agent-executor'
I0427 22:27:46.212216 21602 http.cpp:996] Creating default 'jwt' HTTP authenticator for realm
'mesos-agent-executor'
I0427 22:27:46.212585 21602 http.cpp:975] Creating default 'basic' HTTP authenticator for
realm 'mesos-agent-readonly'
I0427 22:27:46.212710 21602 http.cpp:996] Creating default 'jwt' HTTP authenticator for realm
'mesos-agent-readonly'
I0427 22:27:46.213096 21602 http.cpp:975] Creating default 'basic' HTTP authenticator for
realm 'mesos-agent-readwrite'
I0427 22:27:46.213212 21602 http.cpp:996] Creating default 'jwt' HTTP authenticator for realm
'mesos-agent-readwrite'
I0427 22:27:46.214720 21602 slave.cpp:525] Agent resources: cpus(*):2; mem(*):1024; disk(*):1024;
ports(*):[31000-32000]
I0427 22:27:46.214838 21602 slave.cpp:533] Agent attributes: [  ]
I0427 22:27:46.214860 21602 slave.cpp:538] Agent hostname: f8b086e5797f
I0427 22:27:46.215070 21611 status_update_manager.cpp:177] Pausing sending status updates
I0427 22:27:46.216572 21614 state.cpp:62] Recovering state from '/tmp/Endpoint_SlaveEndpointTest_NoAuthorizer_0_YE5JuC/meta'
I0427 22:27:46.216922 21622 status_update_manager.cpp:203] Recovering status update manager
I0427 22:27:46.217244 21619 containerizer.cpp:608] Recovering containerizer
I0427 22:27:46.218699 21606 provisioner.cpp:410] Provisioner recovery complete
I0427 22:27:46.219223 21616 slave.cpp:5963] Finished recovery
I0427 22:27:46.219756 21616 slave.cpp:6145] Querying resource estimator for oversubscribable
resources
I0427 22:27:46.220173 21616 slave.cpp:6159] Received oversubscribable resources {} from the
resource estimator
I0427 22:27:46.223660 21601 process.cpp:3731] Handling HTTP event for process 'slave(744)'
with path: '/slave(744)/monitor/statistics'
I0427 22:27:46.226244 21614 http.cpp:1115] HTTP GET for /slave(744)/monitor/statistics from
172.17.0.2:54182
I0427 22:27:46.226366 21614 http.cpp:936] Authorizing principal 'test-principal' to GET the
'/monitor/statistics' endpoint
I0427 22:27:46.230732 21610 slave.cpp:790] Agent terminating
[       OK ] Endpoint/SlaveEndpointTest.NoAuthorizer/0 (35 ms)
[ RUN      ] Endpoint/SlaveEndpointTest.NoAuthorizer/1
I0427 22:27:46.242336  2247 containerizer.cpp:221] Using isolation: posix/cpu,posix/mem,filesystem/posix,network/cni
W0427 22:27:46.242866  2247 backend.cpp:76] Failed to create 'aufs' backend: AufsBackend requires
root privileges
W0427 22:27:46.243000  2247 backend.cpp:76] Failed to create 'bind' backend: BindBackend requires
root privileges
I0427 22:27:46.243038  2247 provisioner.cpp:249] Using default backend 'copy'
I0427 22:27:46.244812  2247 cluster.cpp:448] Creating default 'local' authorizer
I0427 22:27:46.246464 21607 slave.cpp:225] Mesos agent started on (745)@172.17.0.2:39947
I0427 22:27:46.246486 21607 slave.cpp:226] Flags at startup: --acls="" --appc_simple_discovery_uri_prefix="http://"
--appc_store_dir="/tmp/mesos/store/appc" --authenticate_http_executors="true" --authenticate_http_readonly="true"
--authenticate_http_readwrite="true" --authenticatee="crammd5" --authentication_backoff_factor="1secs"
--authorizer="local" --cgroups_cpu_enable_pids_and_tids_count="false" --cgroups_enable_cfs="false"
--cgroups_hierarchy="/sys/fs/cgroup" --cgroups_limit_swap="false" --cgroups_root="mesos" --container_disk_watch_interval="15secs"
--containerizers="mesos" --credential="/tmp/Endpoint_SlaveEndpointTest_NoAuthorizer_1_vLinFf/credential"
--default_role="*" --disk_watch_interval="1mins" --docker="docker" --docker_kill_orphans="true"
--docker_registry="https://registry-1.docker.io" --docker_remove_delay="6hrs" --docker_socket="/var/run/docker.sock"
--docker_stop_timeout="0ns" --docker_store_dir="/tmp/mesos/store/docker" --docker_volume_checkpoint_dir="/var/run/mesos/isolators/docker/volume"
--enforce_container_disk_quota="false" --executor_registration_timeout="1mins" --executor_secret_key="/tmp/Endpoint_SlaveEndpointTest_NoAuthorizer_1_vLinFf/executor_secret_key"
--executor_shutdown_grace_period="5secs" --fetcher_cache_dir="/tmp/Endpoint_SlaveEndpointTest_NoAuthorizer_1_vLinFf/fetch"
--fetcher_cache_size="2GB" --frameworks_home="" --gc_delay="1weeks" --gc_disk_headroom="0.1"
--hadoop_home="" --help="false" --hostname_lookup="true" --http_command_executor="false" --http_credentials="/tmp/Endpoint_SlaveEndpointTest_NoAuthorizer_1_vLinFf/http_credentials"
--http_heartbeat_interval="30secs" --initialize_driver_logging="true" --isolation="posix/cpu,posix/mem"
--launcher="posix" --launcher_dir="/mesos/mesos-1.3.0/_build/src" --logbufsecs="0" --logging_level="INFO"
--max_completed_executors_per_framework="150" --oversubscribed_resources_interval="15secs"
--perf_duration="10secs" --perf_interval="1mins" --port="5051" --qos_correction_interval_min="0ns"
--quiet="false" --recover="reconnect" --recovery_timeout="15mins" --registration_backoff_factor="10ms"
--resources="cpus:2;gpus:0;mem:1024;disk:1024;ports:[31000-32000]" --revocable_cpu_low_priority="true"
--runtime_dir="/tmp/Endpoint_SlaveEndpointTest_NoAuthorizer_1_vLinFf" --sandbox_directory="/mnt/mesos/sandbox"
--strict="true" --switch_user="true" --systemd_enable_support="true" --systemd_runtime_directory="/run/systemd/system"
--version="false" --work_dir="/tmp/Endpoint_SlaveEndpointTest_NoAuthorizer_1_3byIck"
I0427 22:27:46.246940 21607 credentials.hpp:86] Loading credential for authentication from
'/tmp/Endpoint_SlaveEndpointTest_NoAuthorizer_1_vLinFf/credential'
I0427 22:27:46.247138 21607 slave.cpp:258] Agent using credential for: test-principal
I0427 22:27:46.247164 21607 credentials.hpp:37] Loading credentials for authentication from
'/tmp/Endpoint_SlaveEndpointTest_NoAuthorizer_1_vLinFf/http_credentials'
I0427 22:27:46.247463 21607 http.cpp:975] Creating default 'basic' HTTP authenticator for
realm 'mesos-agent-executor'
I0427 22:27:46.247613 21607 http.cpp:996] Creating default 'jwt' HTTP authenticator for realm
'mesos-agent-executor'
I0427 22:27:46.247867 21607 http.cpp:975] Creating default 'basic' HTTP authenticator for
realm 'mesos-agent-readonly'
I0427 22:27:46.247982 21607 http.cpp:996] Creating default 'jwt' HTTP authenticator for realm
'mesos-agent-readonly'
I0427 22:27:46.248212 21607 http.cpp:975] Creating default 'basic' HTTP authenticator for
realm 'mesos-agent-readwrite'
I0427 22:27:46.248363 21607 http.cpp:996] Creating default 'jwt' HTTP authenticator for realm
'mesos-agent-readwrite'
I0427 22:27:46.249729 21607 slave.cpp:525] Agent resources: cpus(*):2; mem(*):1024; disk(*):1024;
ports(*):[31000-32000]
I0427 22:27:46.249814 21607 slave.cpp:533] Agent attributes: [  ]
I0427 22:27:46.249835 21607 slave.cpp:538] Agent hostname: f8b086e5797f
I0427 22:27:46.250018 21606 status_update_manager.cpp:177] Pausing sending status updates
I0427 22:27:46.251622 21610 state.cpp:62] Recovering state from '/tmp/Endpoint_SlaveEndpointTest_NoAuthorizer_1_3byIck/meta'
I0427 22:27:46.251925 21621 status_update_manager.cpp:203] Recovering status update manager
I0427 22:27:46.252177 21620 containerizer.cpp:608] Recovering containerizer
I0427 22:27:46.253782 21611 provisioner.cpp:410] Provisioner recovery complete
I0427 22:27:46.254281 21619 slave.cpp:5963] Finished recovery
I0427 22:27:46.254866 21619 slave.cpp:6145] Querying resource estimator for oversubscribable
resources
I0427 22:27:46.255311 21604 slave.cpp:6159] Received oversubscribable resources {} from the
resource estimator
I0427 22:27:46.257830 21602 process.cpp:3731] Handling HTTP event for process 'slave(745)'
with path: '/slave(745)/monitor/statistics.json'
I0427 22:27:46.260066 21621 http.cpp:1115] HTTP GET for /slave(745)/monitor/statistics.json
from 172.17.0.2:54184
I0427 22:27:46.260166 21621 http.cpp:936] Authorizing principal 'test-principal' to GET the
'/monitor/statistics.json' endpoint
I0427 22:27:46.264580 21602 slave.cpp:790] Agent terminating
[       OK ] Endpoint/SlaveEndpointTest.NoAuthorizer/1 (33 ms)
[ RUN      ] Endpoint/SlaveEndpointTest.NoAuthorizer/2
I0427 22:27:46.278479  2247 containerizer.cpp:221] Using isolation: posix/cpu,posix/mem,filesystem/posix,network/cni
W0427 22:27:46.279376  2247 backend.cpp:76] Failed to create 'aufs' backend: AufsBackend requires
root privileges
W0427 22:27:46.279522  2247 backend.cpp:76] Failed to create 'bind' backend: BindBackend requires
root privileges
I0427 22:27:46.279568  2247 provisioner.cpp:249] Using default backend 'copy'
I0427 22:27:46.281826  2247 cluster.cpp:448] Creating default 'local' authorizer
I0427 22:27:46.284276 21601 slave.cpp:225] Mesos agent started on (746)@172.17.0.2:39947
I0427 22:27:46.284299 21601 slave.cpp:226] Flags at startup: --acls="" --appc_simple_discovery_uri_prefix="http://"
--appc_store_dir="/tmp/mesos/store/appc" --authenticate_http_executors="true" --authenticate_http_readonly="true"
--authenticate_http_readwrite="true" --authenticatee="crammd5" --authentication_backoff_factor="1secs"
--authorizer="local" --cgroups_cpu_enable_pids_and_tids_count="false" --cgroups_enable_cfs="false"
--cgroups_hierarchy="/sys/fs/cgroup" --cgroups_limit_swap="false" --cgroups_root="mesos" --container_disk_watch_interval="15secs"
--containerizers="mesos" --credential="/tmp/Endpoint_SlaveEndpointTest_NoAuthorizer_2_5ow7MX/credential"
--default_role="*" --disk_watch_interval="1mins" --docker="docker" --docker_kill_orphans="true"
--docker_registry="https://registry-1.docker.io" --docker_remove_delay="6hrs" --docker_socket="/var/run/docker.sock"
--docker_stop_timeout="0ns" --docker_store_dir="/tmp/mesos/store/docker" --docker_volume_checkpoint_dir="/var/run/mesos/isolators/docker/volume"
--enforce_container_disk_quota="false" --executor_registration_timeout="1mins" --executor_secret_key="/tmp/Endpoint_SlaveEndpointTest_NoAuthorizer_2_5ow7MX/executor_secret_key"
--executor_shutdown_grace_period="5secs" --fetcher_cache_dir="/tmp/Endpoint_SlaveEndpointTest_NoAuthorizer_2_5ow7MX/fetch"
--fetcher_cache_size="2GB" --frameworks_home="" --gc_delay="1weeks" --gc_disk_headroom="0.1"
--hadoop_home="" --help="false" --hostname_lookup="true" --http_command_executor="false" --http_credentials="/tmp/Endpoint_SlaveEndpointTest_NoAuthorizer_2_5ow7MX/http_credentials"
--http_heartbeat_interval="30secs" --initialize_driver_logging="true" --isolation="posix/cpu,posix/mem"
--launcher="posix" --launcher_dir="/mesos/mesos-1.3.0/_build/src" --logbufsecs="0" --logging_level="INFO"
--max_completed_executors_per_framework="150" --oversubscribed_resources_interval="15secs"
--perf_duration="10secs" --perf_interval="1mins" --port="5051" --qos_correction_interval_min="0ns"
--quiet="false" --recover="reconnect" --recovery_timeout="15mins" --registration_backoff_factor="10ms"
--resources="cpus:2;gpus:0;mem:1024;disk:1024;ports:[31000-32000]" --revocable_cpu_low_priority="true"
--runtime_dir="/tmp/Endpoint_SlaveEndpointTest_NoAuthorizer_2_5ow7MX" --sandbox_directory="/mnt/mesos/sandbox"
--strict="true" --switch_user="true" --systemd_enable_support="true" --systemd_runtime_directory="/run/systemd/system"
--version="false" --work_dir="/tmp/Endpoint_SlaveEndpointTest_NoAuthorizer_2_Hmzlf2"
I0427 22:27:46.284647 21601 credentials.hpp:86] Loading credential for authentication from
'/tmp/Endpoint_SlaveEndpointTest_NoAuthorizer_2_5ow7MX/credential'
I0427 22:27:46.284855 21601 slave.cpp:258] Agent using credential for: test-principal
I0427 22:27:46.284875 21601 credentials.hpp:37] Loading credentials for authentication from
'/tmp/Endpoint_SlaveEndpointTest_NoAuthorizer_2_5ow7MX/http_credentials'
I0427 22:27:46.285141 21601 http.cpp:975] Creating default 'basic' HTTP authenticator for
realm 'mesos-agent-executor'
I0427 22:27:46.285260 21601 http.cpp:996] Creating default 'jwt' HTTP authenticator for realm
'mesos-agent-executor'
I0427 22:27:46.285534 21601 http.cpp:975] Creating default 'basic' HTTP authenticator for
realm 'mesos-agent-readonly'
I0427 22:27:46.285624 21601 http.cpp:996] Creating default 'jwt' HTTP authenticator for realm
'mesos-agent-readonly'
I0427 22:27:46.286017 21601 http.cpp:975] Creating default 'basic' HTTP authenticator for
realm 'mesos-agent-readwrite'
I0427 22:27:46.286190 21601 http.cpp:996] Creating default 'jwt' HTTP authenticator for realm
'mesos-agent-readwrite'
I0427 22:27:46.287753 21601 slave.cpp:525] Agent resources: cpus(*):2; mem(*):1024; disk(*):1024;
ports(*):[31000-32000]
I0427 22:27:46.287844 21601 slave.cpp:533] Agent attributes: [  ]
I0427 22:27:46.287865 21601 slave.cpp:538] Agent hostname: f8b086e5797f
I0427 22:27:46.288034 21613 status_update_manager.cpp:177] Pausing sending status updates
I0427 22:27:46.289705 21617 state.cpp:62] Recovering state from '/tmp/Endpoint_SlaveEndpointTest_NoAuthorizer_2_Hmzlf2/meta'
I0427 22:27:46.290276 21611 status_update_manager.cpp:203] Recovering status update manager
I0427 22:27:46.290482 21615 containerizer.cpp:608] Recovering containerizer
I0427 22:27:46.292299 21612 provisioner.cpp:410] Provisioner recovery complete
I0427 22:27:46.292691 21617 slave.cpp:5963] Finished recovery
I0427 22:27:46.293329 21617 slave.cpp:6145] Querying resource estimator for oversubscribable
resources
I0427 22:27:46.293653 21610 slave.cpp:6159] Received oversubscribable resources {} from the
resource estimator
I0427 22:27:46.296084 21609 process.cpp:3731] Handling HTTP event for process 'slave(746)'
with path: '/slave(746)/containers'
I0427 22:27:46.297947 21609 http.cpp:1115] HTTP GET for /slave(746)/containers from 172.17.0.2:54186
I0427 22:27:46.298017 21609 http.cpp:936] Authorizing principal 'test-principal' to GET the
'/containers' endpoint
I0427 22:27:46.302319 21613 slave.cpp:790] Agent terminating
[       OK ] Endpoint/SlaveEndpointTest.NoAuthorizer/2 (37 ms)
[----------] 9 tests from Endpoint/SlaveEndpointTest (315 ms total)

[----------] Global test environment tear-down
[==========] 1567 tests from 177 test cases ran. (604261 ms total)
[  PASSED  ] 1563 tests.
[  FAILED  ] 4 tests, listed below:
[  FAILED  ] CommandExecutorCheckTest.CommandCheckDeliveredAndReconciled
[  FAILED  ] DefaultExecutorCheckTest.CommandCheckDeliveredAndReconciled
[  FAILED  ] DefaultExecutorCheckTest.CommandCheckStatusChange
[  FAILED  ] DefaultExecutorCheckTest.CommandCheckTimeout

 4 FAILED TESTS
  YOU HAVE 19 DISABLED TESTS

E0427 22:27:46.396137 21623 process.cpp:951] Failed to accept socket: future discarded
make[4]: *** [check-local] Error 1
make[4]: Leaving directory `/mesos/mesos-1.3.0/_build/src'
make[3]: *** [check-am] Error 2
make[3]: Leaving directory `/mesos/mesos-1.3.0/_build/src'
make[2]: *** [check] Error 2
make[2]: Leaving directory `/mesos/mesos-1.3.0/_build/src'
make[1]: *** [check-recursive] Error 1
make[1]: Leaving directory `/mesos/mesos-1.3.0/_build'
make: *** [distcheck] Error 1
+ docker rmi mesos-1493329292-28034
Untagged: mesos-1493329292-28034:latest
Deleted: sha256:e4e2c0aca37d5e8744b24d4f1286da863d4b84429a3f139e1cfbc9ecc8273df5
Deleted: sha256:7cfa0bc5366451fbf7ba9d4cee21b8059d001edcc5ca4046489d375ca628f2b0
Deleted: sha256:8a863bc4c348c6cafc5296973f0d0ef069af5f20592905f82a6c5d93aafb643b
Deleted: sha256:bad1dccc954f10382b8e098538acbf4e9c40f79ebfb5282c88821c8a1997fa81
Deleted: sha256:6845428b4cf3b648b1a19de2b8b671f48c38c4e57ff98f5c8c9bb9f0283c0f5a
Deleted: sha256:5c29658c50775956cbd06daf53a7417bc93a53759b31446f609505fc5a72c50d
Deleted: sha256:d1ff45ae554bfee55c1fe8936ddf25130a0fa2775e630b10f24ece32fda7c12c
Deleted: sha256:345f8718c7f34dbdd46fa85cd23b8bb72d0884547d7e1c668b0757ea1f8c50e4
Deleted: sha256:3326975216497b93c240a3d0109700a432643e721378bb56139f0950a991076f
Deleted: sha256:3e9832d577b6772609154317f059960d2ce667e6a457525cbdfd5525ddb83ab9
Deleted: sha256:a5ffb2236fc5bffe1356b7b8f51e074ea5110b50c73c9460f9b1f183ce1bb45b
Deleted: sha256:9c6e953929816cb9007c592fb6f9e3a6bf50c0abdbeaf0c6d6c002406c5d2922
Deleted: sha256:515e654c8e278acd0034d57e6ca7895d7d8ec3f8cae5432b0b478edc95e21901
Deleted: sha256:7fe98c0a668eb3c59ca2b29c39c227ae51d3c09b40ffbc3c1348449616d1b6fc
Deleted: sha256:4998e5b4ecdbca588e0cd14b88bced3285b01965c8a2ec7b5c17c06585e39144
Deleted: sha256:b8e7bff6f99be1b093d0e01bf87b82030518fce6d78d1b9f0a0a0de85fc9d3a1
Deleted: sha256:b63190ad4e68697f061c6f1c465fa9804bb01b1fb4780d3c88ccd8a7a0d1ef16
Deleted: sha256:991b2f50752ed4e8fdeb25627ffc671b46ab736178ab22d4bfbc7f917244f570
Deleted: sha256:b919b55a39598a39832083e7a47e9ce00bc77eace9efa180b3149407d0db30bb
Deleted: sha256:3b41622b244cb27650bddeecf86bd54d0d7d24c25ef3fdfbe6f05b3250dcfa51
Deleted: sha256:94bab9cb29d7b2abc991b13287c416d8ddcc28c74460a23c59b791edf2445235
Deleted: sha256:a40f884bea3d1b0f5f1435233b55dc09b44693311ab24c06da382db3c9d4f836
Deleted: sha256:896d53c55160ba5215ad6360c3f860c850fd889654b5d2448533f9dd23f5f39d
Deleted: sha256:a6deac6f153c0f87812f7376a87206f14fbf5f8545ee47821a37af7fc2ea4375
Deleted: sha256:c975cf7f06306de2bf6a86d0e41f2c194a09b2f68f338e08ecc38772b52f5df8
Build step 'Execute shell' marked build as failure

Mime
View raw message