mesos-builds mailing list archives

Site index · List index
Message view « Date » · « Thread »
Top « Date » · « Thread »
From Apache Jenkins Server <jenk...@builds.apache.org>
Subject Build failed in Jenkins: Mesos-Buildbot » autotools,clang,--verbose,GLOG_v=1 MESOS_VERBOSE=1,ubuntu:14.04,(docker||Hadoop)&&(!ubuntu-us1)&&(!ubuntu-eu2) #3467
Date Tue, 11 Apr 2017 22:10:39 GMT
See <https://builds.apache.org/job/Mesos-Buildbot/BUILDTOOL=autotools,COMPILER=clang,CONFIGURATION=--verbose,ENVIRONMENT=GLOG_v=1%20MESOS_VERBOSE=1,OS=ubuntu%3A14.04,label_exp=(docker%7C%7CHadoop)&&(!ubuntu-us1)&&(!ubuntu-eu2)/3467/display/redirect?page=changes>

Changes:

[josephwu] Added test filters to stout tests.

[josephwu] Added test filters to libprocess tests.

[josephwu] Refactored Mesos tests `Environment` class on stout test changes.

------------------------------------------
[...truncated 255.12 KB...]
checking for BSD- or MS-compatible name lister (nm)... /usr/bin/nm -B
checking the name lister (/usr/bin/nm -B) interface... BSD nm
checking the maximum length of command line arguments... 1572864
checking whether the shell understands some XSI constructs... yes
checking whether the shell understands "+="... yes
checking how to convert x86_64-unknown-linux-gnu file names to x86_64-unknown-linux-gnu format...
func_convert_file_noop
checking how to convert x86_64-unknown-linux-gnu file names to toolchain format... func_convert_file_noop
checking for /usr/bin/ld option to reload object files... -r
checking for objdump... objdump
checking how to recognize dependent libraries... pass_all
checking for dlltool... no
checking how to associate runtime and link libraries... printf %s\n
checking for archiver @FILE support... @
checking for strip... strip
checking for ranlib... ranlib
checking command to parse /usr/bin/nm -B output from clang-3.5 object... ok
checking for sysroot... no
checking for mt... mt
checking if mt is a manifest tool... no
checking how to run the C preprocessor... clang-3.5 -E
checking for ANSI C header files... yes
checking for sys/types.h... yes
checking for sys/stat.h... yes
checking for stdlib.h... yes
checking for string.h... yes
checking for memory.h... yes
checking for strings.h... yes
checking for inttypes.h... yes
checking for stdint.h... yes
checking for unistd.h... yes
checking for dlfcn.h... yes
checking for objdir... .libs
checking if clang-3.5 supports -fno-rtti -fno-exceptions... yes
checking for clang-3.5 option to produce PIC... -fPIC -DPIC
checking if clang-3.5 PIC flag -fPIC -DPIC works... yes
checking if clang-3.5 static flag -static works... yes
checking if clang-3.5 supports -c -o file.o... yes
checking if clang-3.5 supports -c -o file.o... (cached) yes
checking whether the clang-3.5 linker (/usr/bin/ld -m elf_x86_64) supports shared libraries...
yes
checking whether -lc should be explicitly linked in... no
checking dynamic linker characteristics... GNU/Linux ld.so
checking how to hardcode library paths into programs... immediate
checking whether stripping libraries is possible... yes
checking if libtool supports shared libraries... yes
checking whether to build shared libraries... yes
checking whether to build static libraries... no
checking how to run the C++ preprocessor... clang++-3.5 -E
checking for ld used by clang++-3.5... /usr/bin/ld -m elf_x86_64
checking if the linker (/usr/bin/ld -m elf_x86_64) is GNU ld... yes
checking whether the clang++-3.5 linker (/usr/bin/ld -m elf_x86_64) supports shared libraries...
yes
checking for clang++-3.5 option to produce PIC... -fPIC -DPIC
checking if clang++-3.5 PIC flag -fPIC -DPIC works... yes
checking if clang++-3.5 static flag -static works... yes
checking if clang++-3.5 supports -c -o file.o... yes
checking if clang++-3.5 supports -c -o file.o... (cached) yes
checking whether the clang++-3.5 linker (/usr/bin/ld -m elf_x86_64) supports shared libraries...
yes
checking dynamic linker characteristics... (cached) GNU/Linux ld.so
checking how to hardcode library paths into programs... immediate
configure: creating ./config.lt
config.lt: creating libtool
checking whether C++ compiler accepts -fstack-protector-strong... yes
checking whether clang++-3.5 supports C++11 features by default... no
checking whether clang++-3.5 supports C++11 features with -std=c++11... yes
checking if compiler needs -Werror to reject unknown flags... yes
checking for the pthreads library -lpthreads... no
checking whether pthreads work without any flags... no
checking whether pthreads work with -Kthread... no
checking whether pthreads work with -kthread... no
checking for the pthreads library -llthread... no
checking whether pthreads work with -pthread... yes
checking for joinable pthread attribute... PTHREAD_CREATE_JOINABLE
checking if more special flags are required for pthreads... no
checking for PTHREAD_PRIO_INHERIT... yes
configure: Setting up build environment for x86_64 linux-gnu
checking for backtrace in -lunwind... no
checking for main in -lgflags... no
checking for gzread in -lz... yes
checking for patch... patch
checking fts.h usability... yes
checking fts.h presence... yes
checking for fts.h... yes
checking for library containing fts_close... none required
checking apr_pools.h usability... yes
checking apr_pools.h presence... yes
checking for apr_pools.h... yes
checking for apr_initialize in -lapr-1... yes
checking for curl_global_init in -lcurl... yes
checking for javac... /usr/bin/javac
checking for java... /usr/bin/java
checking value of Java system property 'java.home'... /usr/lib/jvm/java-7-openjdk-amd64/jre
configure: using JAVA_HOME=/usr/lib/jvm/java-7-openjdk-amd64
checking whether or not we can build with JNI... yes
checking for mvn... /usr/bin/mvn
checking for sasl_done in -lsasl2... yes
checking SASL CRAM-MD5 support... yes
checking svn_version.h usability... yes
checking svn_version.h presence... yes
checking for svn_version.h... yes
checking for svn_stringbuf_create_ensure in -lsvn_subr-1... yes
checking svn_delta.h usability... yes
checking svn_delta.h presence... yes
checking for svn_delta.h... yes
checking for svn_txdelta in -lsvn_delta-1... yes
checking whether to enable the XFS disk isolator... no
checking for deflate, gzread, gzwrite, inflate in -lz... yes
checking C++ standard library for undefined behaviour with selected optimization level...
no
checking for a Python interpreter with version >= 2.6... python
checking for python... /usr/bin/python
checking for python version... 2.7
checking for python platform... linux2
checking for python script directory... ${prefix}/lib/python2.7/site-packages
checking for python extension module directory... ${exec_prefix}/lib/python2.7/site-packages
checking for python2.7... (cached) /usr/bin/python
checking for a version of Python >= '2.1.0'... yes
checking for a version of Python >= '2.6'... yes
checking for the distutils Python package... yes
checking for Python include path... -I/usr/include/python2.7
checking for Python library path... -L/usr/lib -lpython2.7
checking for Python site-packages path... /usr/lib/python2.7/dist-packages
checking python extra libraries... -lpthread -ldl  -lutil -lm
checking python extra linking flags... -Xlinker -export-dynamic -Wl,-O1 -Wl,-Bsymbolic-functions
checking consistency of all components of python development environment... yes
checking whether we can build usable Python eggs... yes
checking for an old installation of the Mesos egg (before 0.20.0)... no
checking that generated files are newer than configure... done
configure: creating ./config.status
config.status: creating Makefile
config.status: creating mesos.pc
config.status: creating src/Makefile
config.status: creating 3rdparty/Makefile
config.status: creating 3rdparty/libprocess/Makefile
config.status: creating 3rdparty/libprocess/include/Makefile
config.status: creating 3rdparty/stout/Makefile
config.status: creating 3rdparty/stout/include/Makefile
config.status: creating 3rdparty/gmock_sources.cc
config.status: creating bin/mesos.sh
config.status: creating bin/mesos-agent.sh
config.status: creating bin/mesos-local.sh
config.status: creating bin/mesos-master.sh
config.status: creating bin/mesos-slave.sh
config.status: creating bin/mesos-tests.sh
config.status: creating bin/mesos-agent-flags.sh
config.status: creating bin/mesos-local-flags.sh
config.status: creating bin/mesos-master-flags.sh
config.status: creating bin/mesos-slave-flags.sh
config.status: creating bin/mesos-tests-flags.sh
config.status: creating bin/gdb-mesos-agent.sh
config.status: creating bin/gdb-mesos-local.sh
config.status: creating bin/gdb-mesos-master.sh
config.status: creating bin/gdb-mesos-slave.sh
config.status: creating bin/gdb-mesos-tests.sh
config.status: creating bin/lldb-mesos-agent.sh
config.status: creating bin/lldb-mesos-local.sh
config.status: creating bin/lldb-mesos-master.sh
config.status: creating bin/lldb-mesos-slave.sh
config.status: creating bin/lldb-mesos-tests.sh
config.status: creating bin/valgrind-mesos-agent.sh
config.status: creating bin/valgrind-mesos-local.sh
config.status: creating bin/valgrind-mesos-master.sh
config.status: creating bin/valgrind-mesos-slave.sh
config.status: creating bin/valgrind-mesos-tests.sh
config.status: creating src/deploy/mesos-daemon.sh
config.status: creating src/deploy/mesos-start-agents.sh
config.status: creating src/deploy/mesos-start-cluster.sh
config.status: creating src/deploy/mesos-start-masters.sh
config.status: creating src/deploy/mesos-start-slaves.sh
config.status: creating src/deploy/mesos-stop-agents.sh
config.status: creating src/deploy/mesos-stop-cluster.sh
config.status: creating src/deploy/mesos-stop-masters.sh
config.status: creating src/deploy/mesos-stop-slaves.sh
config.status: creating include/mesos/version.hpp
config.status: creating src/java/generated/org/apache/mesos/MesosNativeLibrary.java
config.status: creating mpi/mpiexec-mesos
config.status: creating src/examples/java/test-exception-framework
config.status: creating src/examples/java/test-executor
config.status: creating src/examples/java/test-framework
config.status: creating src/examples/java/test-multiple-executors-framework
config.status: creating src/examples/java/test-log
config.status: creating src/examples/java/v1-test-framework
config.status: creating src/java/mesos.pom
config.status: creating src/examples/python/test-executor
config.status: creating src/examples/python/test-framework
config.status: creating src/python/setup.py
config.status: creating src/python/cli/setup.py
config.status: creating src/python/interface/setup.py
config.status: creating src/python/native_common/ext_modules.py
config.status: creating src/python/executor/setup.py
config.status: creating src/python/native/setup.py
config.status: creating src/python/scheduler/setup.py
config.status: linking src/python/native_common/ext_modules.py to src/python/executor/ext_modules.py
config.status: linking src/python/native_common/ext_modules.py to src/python/scheduler/ext_modules.py
config.status: executing depfiles commands
config.status: executing libtool commands
configure: Build option summary:
    CXX:        clang++-3.5
    CXXFLAGS:   -g1 -O0 -std=c++11
    CPPFLAGS:   -I/usr/include/subversion-1 -I/usr/include/apr-1 -I/usr/include/apr-1.0 
    LDFLAGS:    
    LIBS:       -lz -lsvn_delta-1 -lsvn_subr-1 -lsasl2 -lcurl -lapr-1 -lz  -lrt

make  dist-gzip am__post_remove_distdir='@:'
make[1]: Entering directory `/mesos'
if test -d "mesos-1.3.0"; then find "mesos-1.3.0" -type d ! -perm -200 -exec chmod u+w {}
';' && rm -rf "mesos-1.3.0" || { sleep 5 && rm -rf "mesos-1.3.0"; }; else
:; fi
test -d "mesos-1.3.0" || mkdir "mesos-1.3.0"
 (cd 3rdparty && make  top_distdir=../mesos-1.3.0 distdir=../mesos-1.3.0/3rdparty
\
     am__remove_distdir=: am__skip_length_check=: am__skip_mode_fix=: distdir)
make[2]: Entering directory `/mesos/3rdparty'
 (cd stout && make  top_distdir=../../mesos-1.3.0 distdir=../../mesos-1.3.0/3rdparty/stout
\
     am__remove_distdir=: am__skip_length_check=: am__skip_mode_fix=: distdir)
make[3]: Entering directory `/mesos/3rdparty/stout'
 (cd include && make  top_distdir=../../../mesos-1.3.0 distdir=../../../mesos-1.3.0/3rdparty/stout/include
\
     am__remove_distdir=: am__skip_length_check=: am__skip_mode_fix=: distdir)
make[4]: Entering directory `/mesos/3rdparty/stout/include'
make[4]: *** No rule to make target `stout/environment.hpp', needed by `distdir'.  Stop.
make[4]: Leaving directory `/mesos/3rdparty/stout/include'
make[3]: *** [distdir] Error 1
make[3]: Leaving directory `/mesos/3rdparty/stout'
make[2]: *** [distdir] Error 1
make[2]: Leaving directory `/mesos/3rdparty'
make[1]: *** [distdir] Error 1
make[1]: Leaving directory `/mesos'
make: *** [dist] Error 2
+ docker rmi mesos-1491947776-17777
Untagged: mesos-1491947776-17777:latest
Deleted: sha256:25737b63b60fd2e9101b27cef5aa563dde46c5821acb00b1ceadff4b3380e3a3
Deleted: sha256:d493ae0d63d912570cb1dd045fc3b4ac0280d36616218351d0fc5e2156d6a407
Deleted: sha256:aa30ce785ad3adca0a1e62b3e183b2084bc6dac586085483c8dfc58ecc136bd5
Deleted: sha256:e1d35a2a2a7fc1f68c9a60275444a031bc3f7feaa0f11ab818c1fcc979cfa146
Deleted: sha256:9c4e15292d7902b222913a8c635faff0b4b9708ec0b7d6317b0219e8ca506e65
Deleted: sha256:47f3108531cf7476f6b2db4808601c3eb97edf3cc9b08d4559413a46de2dae22
Deleted: sha256:0b106dca8a1402017847c59b5fae00a130dca89c6972e858dfaf28b9b96977a3
Deleted: sha256:62e9880c610ceb5c7aa00f40c564f9eee46bf5870dab3f6d8250b203ce524338
Deleted: sha256:a6fccd3c28e87ca83fdc943ca9be9ad4cf64544839c1ccdd6a2b40c378185537
Deleted: sha256:e87bbdb6b6a28174760475a824ab10598a3ee64c394277bbab5cd02b5c6419ae
Deleted: sha256:8e4ffd30c43301407c973c94fe276f2d0ddd770d3ea2f72e0081744a8bf99ed1
Deleted: sha256:a1e09b4b462aab0896303c5360184f4bfb92e72d48d8eb6d90717b2927fa41fb
Deleted: sha256:61f891e6b2e87f10f0a4e7dbb78cf58a42c82ecf441f660215ca3e474d739555
Deleted: sha256:3b7474e58ff46bd41e3e15d12c3a4aacf467496c0831657cc46f81f5828b3e6b
Deleted: sha256:7c870ba283df9fbc30b0b77ca190f245b3d9348cbbee316dde1f138cab054871
Deleted: sha256:33c463e2923556289b26d9ac9b7715cc7899c11ee31fc68460e69d123649228b
Deleted: sha256:652b17a4bffbd0ee3c9487f1b8197b85300903f118266c2a42d59c41e9e82582
Deleted: sha256:a392baaeeae14daf0808436103d8e1c82260098f16ab68342a9f98e5b618898b
Deleted: sha256:cdf536f535e767711f9174978faea5936ddc430f146c5d9a60d38a7317321c67
Deleted: sha256:d8a2c14647269e4eea8ecee055d6a89b30de4640cfdb3b04b4777a491d156677
Deleted: sha256:b68d15a0b2db630ed1cea77d98972205a01ff4430b9ee091bbb4c15135ec81e1
Deleted: sha256:6c6a385bbdf785a07858f3b60e5c28d32baefcd626b03734e0bfdc282fddfd2c
Deleted: sha256:27faeaf3055331a60c829261c14cc38e4c6c5ac545201a060c369e5f654f1929
Deleted: sha256:bf705d7d278aa2c078c1fb9005cc4f0acb1cfa1326529669665dd2cfea6ea945
Build step 'Execute shell' marked build as failure

Mime
View raw message