mesos-builds mailing list archives

Site index · List index
Message view « Date » · « Thread »
Top « Date » · « Thread »
From Apache Jenkins Server <jenk...@builds.apache.org>
Subject Build failed in Jenkins: Mesos-Buildbot » cmake,gcc,--verbose,GLOG_v=1 MESOS_VERBOSE=1,centos:7,(docker||Hadoop)&&(!ubuntu-us1)&&(!ubuntu-eu2) #3476
Date Thu, 13 Apr 2017 02:33:03 GMT
See <https://builds.apache.org/job/Mesos-Buildbot/BUILDTOOL=cmake,COMPILER=gcc,CONFIGURATION=--verbose,ENVIRONMENT=GLOG_v=1%20MESOS_VERBOSE=1,OS=centos%3A7,label_exp=(docker%7C%7CHadoop)&&(!ubuntu-us1)&&(!ubuntu-eu2)/3476/display/redirect?page=changes>

Changes:

[toenshoff] Added to MESOS-7383 to CHANGELOG for 1.2.1.

------------------------------------------
[...truncated 23.30 MB...]
I0413 02:32:25.327816 25487 http.cpp:871] Authorizing principal 'test-principal' to GET the
'/monitor/statistics.json' endpoint
I0413 02:32:25.330966 25476 slave.cpp:803] Agent terminating
[       OK ] Endpoint/SlaveEndpointTest.AuthorizedRequest/1 (52 ms)
[ RUN      ] Endpoint/SlaveEndpointTest.AuthorizedRequest/2
I0413 02:32:25.372036 25474 containerizer.cpp:221] Using isolation: posix/cpu,posix/mem,filesystem/posix,network/cni
W0413 02:32:25.372325 25474 backend.cpp:76] Failed to create 'aufs' backend: AufsBackend requires
root privileges
W0413 02:32:25.372375 25474 backend.cpp:76] Failed to create 'bind' backend: BindBackend requires
root privileges
I0413 02:32:25.372397 25474 provisioner.cpp:249] Using default backend 'copy'
I0413 02:32:25.373667 25477 slave.cpp:211] Mesos agent started on (692)@172.17.0.3:37864
I0413 02:32:25.373682 25477 slave.cpp:212] Flags at startup: --acls="" --appc_simple_discovery_uri_prefix="http://"
--appc_store_dir="/tmp/mesos/store/appc" --authenticate_http_readonly="true" --authenticate_http_readwrite="true"
--authenticatee="crammd5" --authentication_backoff_factor="1secs" --authorizer="local" --cgroups_cpu_enable_pids_and_tids_count="false"
--cgroups_enable_cfs="false" --cgroups_hierarchy="/sys/fs/cgroup" --cgroups_limit_swap="false"
--cgroups_root="mesos" --container_disk_watch_interval="15secs" --containerizers="mesos" --credential="/tmp/Endpoint_SlaveEndpointTest_AuthorizedRequest_2_MzrX4U/credential"
--default_role="*" --disk_watch_interval="1mins" --docker="docker" --docker_kill_orphans="true"
--docker_registry="https://registry-1.docker.io" --docker_remove_delay="6hrs" --docker_socket="/var/run/docker.sock"
--docker_stop_timeout="0ns" --docker_store_dir="/tmp/mesos/store/docker" --docker_volume_checkpoint_dir="/var/run/mesos/isolators/docker/volume"
--enforce_container_disk_quota="false" --executor_registration_timeout="1mins" --executor_shutdown_grace_period="5secs"
--fetcher_cache_dir="/tmp/Endpoint_SlaveEndpointTest_AuthorizedRequest_2_MzrX4U/fetch" --fetcher_cache_size="2GB"
--frameworks_home="" --gc_delay="1weeks" --gc_disk_headroom="0.1" --hadoop_home="" --help="false"
--hostname_lookup="true" --http_authenticators="basic" --http_command_executor="false" --http_credentials="/tmp/Endpoint_SlaveEndpointTest_AuthorizedRequest_2_MzrX4U/http_credentials"
--http_heartbeat_interval="30secs" --initialize_driver_logging="true" --isolation="posix/cpu,posix/mem"
--launcher="posix" --launcher_dir="/mesos/build/src" --logbufsecs="0" --logging_level="INFO"
--max_completed_executors_per_framework="150" --oversubscribed_resources_interval="15secs"
--perf_duration="10secs" --perf_interval="1mins" --qos_correction_interval_min="0ns" --quiet="false"
--recover="reconnect" --recovery_timeout="15mins" --registration_backoff_factor="10ms" --resources="cpus:2;gpus:0;mem:1024;disk:1024;ports:[31000-32000]"
--revocable_cpu_low_priority="true" --runtime_dir="/tmp/Endpoint_SlaveEndpointTest_AuthorizedRequest_2_MzrX4U"
--sandbox_directory="/mnt/mesos/sandbox" --strict="true" --switch_user="true" --systemd_enable_support="true"
--systemd_runtime_directory="/run/systemd/system" --version="false" --work_dir="/tmp/Endpoint_SlaveEndpointTest_AuthorizedRequest_2_M4BskO"
I0413 02:32:25.373976 25477 credentials.hpp:86] Loading credential for authentication from
'/tmp/Endpoint_SlaveEndpointTest_AuthorizedRequest_2_MzrX4U/credential'
I0413 02:32:25.374065 25477 slave.cpp:354] Agent using credential for: test-principal
I0413 02:32:25.374080 25477 credentials.hpp:37] Loading credentials for authentication from
'/tmp/Endpoint_SlaveEndpointTest_AuthorizedRequest_2_MzrX4U/http_credentials'
I0413 02:32:25.374178 25477 http.cpp:919] Using default 'basic' HTTP authenticator for realm
'mesos-agent-readonly'
I0413 02:32:25.374240 25477 http.cpp:919] Using default 'basic' HTTP authenticator for realm
'mesos-agent-readwrite'
I0413 02:32:25.374629 25477 slave.cpp:541] Agent resources: cpus(*):2; mem(*):1024; disk(*):1024;
ports(*):[31000-32000]
I0413 02:32:25.374661 25477 slave.cpp:549] Agent attributes: [  ]
I0413 02:32:25.374666 25477 slave.cpp:554] Agent hostname: 116fe5b0723f
I0413 02:32:25.374763 25482 status_update_manager.cpp:177] Pausing sending status updates
I0413 02:32:25.375051 25477 state.cpp:62] Recovering state from '/tmp/Endpoint_SlaveEndpointTest_AuthorizedRequest_2_M4BskO/meta'
I0413 02:32:25.375182 25489 status_update_manager.cpp:203] Recovering status update manager
I0413 02:32:25.375284 25476 containerizer.cpp:600] Recovering containerizer
I0413 02:32:25.375866 25490 provisioner.cpp:410] Provisioner recovery complete
I0413 02:32:25.376170 25475 slave.cpp:5550] Finished recovery
I0413 02:32:25.376749 25475 slave.cpp:5724] Querying resource estimator for oversubscribable
resources
I0413 02:32:25.376943 25485 slave.cpp:5738] Received oversubscribable resources {} from the
resource estimator
I0413 02:32:25.378495 25484 process.cpp:3704] Handling HTTP event for process 'slave(692)'
with path: '/slave(692)/containers'
I0413 02:32:25.379075 25485 http.cpp:871] Authorizing principal 'test-principal' to GET the
'/containers' endpoint
I0413 02:32:25.380661 25476 slave.cpp:803] Agent terminating
[       OK ] Endpoint/SlaveEndpointTest.AuthorizedRequest/2 (13 ms)
[ RUN      ] Endpoint/SlaveEndpointTest.UnauthorizedRequest/0
I0413 02:32:25.395977 25474 containerizer.cpp:221] Using isolation: posix/cpu,posix/mem,filesystem/posix,network/cni
W0413 02:32:25.396304 25474 backend.cpp:76] Failed to create 'aufs' backend: AufsBackend requires
root privileges
W0413 02:32:25.396350 25474 backend.cpp:76] Failed to create 'bind' backend: BindBackend requires
root privileges
I0413 02:32:25.396415 25474 provisioner.cpp:249] Using default backend 'copy'
I0413 02:32:25.400198 25477 slave.cpp:211] Mesos agent started on (693)@172.17.0.3:37864
I0413 02:32:25.400221 25477 slave.cpp:212] Flags at startup: --acls="" --appc_simple_discovery_uri_prefix="http://"
--appc_store_dir="/tmp/mesos/store/appc" --authenticate_http_readonly="true" --authenticate_http_readwrite="true"
--authenticatee="crammd5" --authentication_backoff_factor="1secs" --authorizer="local" --cgroups_cpu_enable_pids_and_tids_count="false"
--cgroups_enable_cfs="false" --cgroups_hierarchy="/sys/fs/cgroup" --cgroups_limit_swap="false"
--cgroups_root="mesos" --container_disk_watch_interval="15secs" --containerizers="mesos" --credential="/tmp/Endpoint_SlaveEndpointTest_UnauthorizedRequest_0_iOFohm/credential"
--default_role="*" --disk_watch_interval="1mins" --docker="docker" --docker_kill_orphans="true"
--docker_registry="https://registry-1.docker.io" --docker_remove_delay="6hrs" --docker_socket="/var/run/docker.sock"
--docker_stop_timeout="0ns" --docker_store_dir="/tmp/mesos/store/docker" --docker_volume_checkpoint_dir="/var/run/mesos/isolators/docker/volume"
--enforce_container_disk_quota="false" --executor_registration_timeout="1mins" --executor_shutdown_grace_period="5secs"
--fetcher_cache_dir="/tmp/Endpoint_SlaveEndpointTest_UnauthorizedRequest_0_iOFohm/fetch" --fetcher_cache_size="2GB"
--frameworks_home="" --gc_delay="1weeks" --gc_disk_headroom="0.1" --hadoop_home="" --help="false"
--hostname_lookup="true" --http_authenticators="basic" --http_command_executor="false" --http_credentials="/tmp/Endpoint_SlaveEndpointTest_UnauthorizedRequest_0_iOFohm/http_credentials"
--http_heartbeat_interval="30secs" --initialize_driver_logging="true" --isolation="posix/cpu,posix/mem"
--launcher="posix" --launcher_dir="/mesos/build/src" --logbufsecs="0" --logging_level="INFO"
--max_completed_executors_per_framework="150" --oversubscribed_resources_interval="15secs"
--perf_duration="10secs" --perf_interval="1mins" --qos_correction_interval_min="0ns" --quiet="false"
--recover="reconnect" --recovery_timeout="15mins" --registration_backoff_factor="10ms" --resources="cpus:2;gpus:0;mem:1024;disk:1024;ports:[31000-32000]"
--revocable_cpu_low_priority="true" --runtime_dir="/tmp/Endpoint_SlaveEndpointTest_UnauthorizedRequest_0_iOFohm"
--sandbox_directory="/mnt/mesos/sandbox" --strict="true" --switch_user="true" --systemd_enable_support="true"
--systemd_runtime_directory="/run/systemd/system" --version="false" --work_dir="/tmp/Endpoint_SlaveEndpointTest_UnauthorizedRequest_0_EI5Zsf"
I0413 02:32:25.400596 25477 credentials.hpp:86] Loading credential for authentication from
'/tmp/Endpoint_SlaveEndpointTest_UnauthorizedRequest_0_iOFohm/credential'
I0413 02:32:25.436558 25477 slave.cpp:354] Agent using credential for: test-principal
I0413 02:32:25.436599 25477 credentials.hpp:37] Loading credentials for authentication from
'/tmp/Endpoint_SlaveEndpointTest_UnauthorizedRequest_0_iOFohm/http_credentials'
I0413 02:32:25.436743 25477 http.cpp:919] Using default 'basic' HTTP authenticator for realm
'mesos-agent-readonly'
I0413 02:32:25.436835 25477 http.cpp:919] Using default 'basic' HTTP authenticator for realm
'mesos-agent-readwrite'
I0413 02:32:25.437366 25477 slave.cpp:541] Agent resources: cpus(*):2; mem(*):1024; disk(*):1024;
ports(*):[31000-32000]
I0413 02:32:25.437409 25477 slave.cpp:549] Agent attributes: [  ]
I0413 02:32:25.437414 25477 slave.cpp:554] Agent hostname: 116fe5b0723f
I0413 02:32:25.437510 25488 status_update_manager.cpp:177] Pausing sending status updates
I0413 02:32:25.437857 25484 state.cpp:62] Recovering state from '/tmp/Endpoint_SlaveEndpointTest_UnauthorizedRequest_0_EI5Zsf/meta'
I0413 02:32:25.438005 25485 status_update_manager.cpp:203] Recovering status update manager
I0413 02:32:25.438163 25479 containerizer.cpp:600] Recovering containerizer
I0413 02:32:25.438773 25479 provisioner.cpp:410] Provisioner recovery complete
I0413 02:32:25.438940 25476 slave.cpp:5550] Finished recovery
I0413 02:32:25.439318 25476 slave.cpp:5724] Querying resource estimator for oversubscribable
resources
I0413 02:32:25.439431 25489 slave.cpp:5738] Received oversubscribable resources {} from the
resource estimator
I0413 02:32:25.440253 25484 process.cpp:3704] Handling HTTP event for process 'slave(693)'
with path: '/slave(693)/monitor/statistics'
I0413 02:32:25.440683 25478 http.cpp:871] Authorizing principal 'test-principal' to GET the
'/monitor/statistics' endpoint
I0413 02:32:25.441813 25487 slave.cpp:803] Agent terminating
[       OK ] Endpoint/SlaveEndpointTest.UnauthorizedRequest/0 (50 ms)
[ RUN      ] Endpoint/SlaveEndpointTest.UnauthorizedRequest/1
I0413 02:32:25.497174 25474 containerizer.cpp:221] Using isolation: posix/cpu,posix/mem,filesystem/posix,network/cni
W0413 02:32:25.497462 25474 backend.cpp:76] Failed to create 'aufs' backend: AufsBackend requires
root privileges
W0413 02:32:25.497495 25474 backend.cpp:76] Failed to create 'bind' backend: BindBackend requires
root privileges
I0413 02:32:25.497508 25474 provisioner.cpp:249] Using default backend 'copy'
I0413 02:32:25.498397 25484 slave.cpp:211] Mesos agent started on (694)@172.17.0.3:37864
I0413 02:32:25.498414 25484 slave.cpp:212] Flags at startup: --acls="" --appc_simple_discovery_uri_prefix="http://"
--appc_store_dir="/tmp/mesos/store/appc" --authenticate_http_readonly="true" --authenticate_http_readwrite="true"
--authenticatee="crammd5" --authentication_backoff_factor="1secs" --authorizer="local" --cgroups_cpu_enable_pids_and_tids_count="false"
--cgroups_enable_cfs="false" --cgroups_hierarchy="/sys/fs/cgroup" --cgroups_limit_swap="false"
--cgroups_root="mesos" --container_disk_watch_interval="15secs" --containerizers="mesos" --credential="/tmp/Endpoint_SlaveEndpointTest_UnauthorizedRequest_1_UN2nrO/credential"
--default_role="*" --disk_watch_interval="1mins" --docker="docker" --docker_kill_orphans="true"
--docker_registry="https://registry-1.docker.io" --docker_remove_delay="6hrs" --docker_socket="/var/run/docker.sock"
--docker_stop_timeout="0ns" --docker_store_dir="/tmp/mesos/store/docker" --docker_volume_checkpoint_dir="/var/run/mesos/isolators/docker/volume"
--enforce_container_disk_quota="false" --executor_registration_timeout="1mins" --executor_shutdown_grace_period="5secs"
--fetcher_cache_dir="/tmp/Endpoint_SlaveEndpointTest_UnauthorizedRequest_1_UN2nrO/fetch" --fetcher_cache_size="2GB"
--frameworks_home="" --gc_delay="1weeks" --gc_disk_headroom="0.1" --hadoop_home="" --help="false"
--hostname_lookup="true" --http_authenticators="basic" --http_command_executor="false" --http_credentials="/tmp/Endpoint_SlaveEndpointTest_UnauthorizedRequest_1_UN2nrO/http_credentials"
--http_heartbeat_interval="30secs" --initialize_driver_logging="true" --isolation="posix/cpu,posix/mem"
--launcher="posix" --launcher_dir="/mesos/build/src" --logbufsecs="0" --logging_level="INFO"
--max_completed_executors_per_framework="150" --oversubscribed_resources_interval="15secs"
--perf_duration="10secs" --perf_interval="1mins" --qos_correction_interval_min="0ns" --quiet="false"
--recover="reconnect" --recovery_timeout="15mins" --registration_backoff_factor="10ms" --resources="cpus:2;gpus:0;mem:1024;disk:1024;ports:[31000-32000]"
--revocable_cpu_low_priority="true" --runtime_dir="/tmp/Endpoint_SlaveEndpointTest_UnauthorizedRequest_1_UN2nrO"
--sandbox_directory="/mnt/mesos/sandbox" --strict="true" --switch_user="true" --systemd_enable_support="true"
--systemd_runtime_directory="/run/systemd/system" --version="false" --work_dir="/tmp/Endpoint_SlaveEndpointTest_UnauthorizedRequest_1_GLexmH"
I0413 02:32:25.498728 25484 credentials.hpp:86] Loading credential for authentication from
'/tmp/Endpoint_SlaveEndpointTest_UnauthorizedRequest_1_UN2nrO/credential'
I0413 02:32:25.498805 25484 slave.cpp:354] Agent using credential for: test-principal
I0413 02:32:25.498817 25484 credentials.hpp:37] Loading credentials for authentication from
'/tmp/Endpoint_SlaveEndpointTest_UnauthorizedRequest_1_UN2nrO/http_credentials'
I0413 02:32:25.498920 25484 http.cpp:919] Using default 'basic' HTTP authenticator for realm
'mesos-agent-readonly'
I0413 02:32:25.498971 25484 http.cpp:919] Using default 'basic' HTTP authenticator for realm
'mesos-agent-readwrite'
I0413 02:32:25.499383 25484 slave.cpp:541] Agent resources: cpus(*):2; mem(*):1024; disk(*):1024;
ports(*):[31000-32000]
I0413 02:32:25.499420 25484 slave.cpp:549] Agent attributes: [  ]
I0413 02:32:25.499428 25484 slave.cpp:554] Agent hostname: 116fe5b0723f
I0413 02:32:25.499513 25477 status_update_manager.cpp:177] Pausing sending status updates
I0413 02:32:25.499819 25480 state.cpp:62] Recovering state from '/tmp/Endpoint_SlaveEndpointTest_UnauthorizedRequest_1_GLexmH/meta'
I0413 02:32:25.500001 25478 status_update_manager.cpp:203] Recovering status update manager
I0413 02:32:25.500119 25486 containerizer.cpp:600] Recovering containerizer
I0413 02:32:25.500645 25478 provisioner.cpp:410] Provisioner recovery complete
I0413 02:32:25.500831 25487 slave.cpp:5550] Finished recovery
I0413 02:32:25.501144 25487 slave.cpp:5724] Querying resource estimator for oversubscribable
resources
I0413 02:32:25.501243 25481 slave.cpp:5738] Received oversubscribable resources {} from the
resource estimator
I0413 02:32:25.502230 25486 process.cpp:3704] Handling HTTP event for process 'slave(694)'
with path: '/slave(694)/monitor/statistics.json'
I0413 02:32:25.502678 25476 http.cpp:871] Authorizing principal 'test-principal' to GET the
'/monitor/statistics.json' endpoint
I0413 02:32:25.503523 25489 slave.cpp:803] Agent terminating
[       OK ] Endpoint/SlaveEndpointTest.UnauthorizedRequest/1 (10 ms)
[ RUN      ] Endpoint/SlaveEndpointTest.UnauthorizedRequest/2
I0413 02:32:25.540189 25474 containerizer.cpp:221] Using isolation: posix/cpu,posix/mem,filesystem/posix,network/cni
W0413 02:32:25.540674 25474 backend.cpp:76] Failed to create 'aufs' backend: AufsBackend requires
root privileges
W0413 02:32:25.540776 25474 backend.cpp:76] Failed to create 'bind' backend: BindBackend requires
root privileges
I0413 02:32:25.540854 25474 provisioner.cpp:249] Using default backend 'copy'
I0413 02:32:25.542273 25485 slave.cpp:211] Mesos agent started on (695)@172.17.0.3:37864
I0413 02:32:25.542291 25485 slave.cpp:212] Flags at startup: --acls="" --appc_simple_discovery_uri_prefix="http://"
--appc_store_dir="/tmp/mesos/store/appc" --authenticate_http_readonly="true" --authenticate_http_readwrite="true"
--authenticatee="crammd5" --authentication_backoff_factor="1secs" --authorizer="local" --cgroups_cpu_enable_pids_and_tids_count="false"
--cgroups_enable_cfs="false" --cgroups_hierarchy="/sys/fs/cgroup" --cgroups_limit_swap="false"
--cgroups_root="mesos" --container_disk_watch_interval="15secs" --containerizers="mesos" --credential="/tmp/Endpoint_SlaveEndpointTest_UnauthorizedRequest_2_ozPT5g/credential"
--default_role="*" --disk_watch_interval="1mins" --docker="docker" --docker_kill_orphans="true"
--docker_registry="https://registry-1.docker.io" --docker_remove_delay="6hrs" --docker_socket="/var/run/docker.sock"
--docker_stop_timeout="0ns" --docker_store_dir="/tmp/mesos/store/docker" --docker_volume_checkpoint_dir="/var/run/mesos/isolators/docker/volume"
--enforce_container_disk_quota="false" --executor_registration_timeout="1mins" --executor_shutdown_grace_period="5secs"
--fetcher_cache_dir="/tmp/Endpoint_SlaveEndpointTest_UnauthorizedRequest_2_ozPT5g/fetch" --fetcher_cache_size="2GB"
--frameworks_home="" --gc_delay="1weeks" --gc_disk_headroom="0.1" --hadoop_home="" --help="false"
--hostname_lookup="true" --http_authenticators="basic" --http_command_executor="false" --http_credentials="/tmp/Endpoint_SlaveEndpointTest_UnauthorizedRequest_2_ozPT5g/http_credentials"
--http_heartbeat_interval="30secs" --initialize_driver_logging="true" --isolation="posix/cpu,posix/mem"
--launcher="posix" --launcher_dir="/mesos/build/src" --logbufsecs="0" --logging_level="INFO"
--max_completed_executors_per_framework="150" --oversubscribed_resources_interval="15secs"
--perf_duration="10secs" --perf_interval="1mins" --qos_correction_interval_min="0ns" --quiet="false"
--recover="reconnect" --recovery_timeout="15mins" --registration_backoff_factor="10ms" --resources="cpus:2;gpus:0;mem:1024;disk:1024;ports:[31000-32000]"
--revocable_cpu_low_priority="true" --runtime_dir="/tmp/Endpoint_SlaveEndpointTest_UnauthorizedRequest_2_ozPT5g"
--sandbox_directory="/mnt/mesos/sandbox" --strict="true" --switch_user="true" --systemd_enable_support="true"
--systemd_runtime_directory="/run/systemd/system" --version="false" --work_dir="/tmp/Endpoint_SlaveEndpointTest_UnauthorizedRequest_2_YnpcU9"
I0413 02:32:25.542703 25485 credentials.hpp:86] Loading credential for authentication from
'/tmp/Endpoint_SlaveEndpointTest_UnauthorizedRequest_2_ozPT5g/credential'
I0413 02:32:25.542810 25485 slave.cpp:354] Agent using credential for: test-principal
I0413 02:32:25.542829 25485 credentials.hpp:37] Loading credentials for authentication from
'/tmp/Endpoint_SlaveEndpointTest_UnauthorizedRequest_2_ozPT5g/http_credentials'
I0413 02:32:25.542949 25485 http.cpp:919] Using default 'basic' HTTP authenticator for realm
'mesos-agent-readonly'
I0413 02:32:25.543009 25485 http.cpp:919] Using default 'basic' HTTP authenticator for realm
'mesos-agent-readwrite'
I0413 02:32:25.543552 25485 slave.cpp:541] Agent resources: cpus(*):2; mem(*):1024; disk(*):1024;
ports(*):[31000-32000]
I0413 02:32:25.543606 25485 slave.cpp:549] Agent attributes: [  ]
I0413 02:32:25.543612 25485 slave.cpp:554] Agent hostname: 116fe5b0723f
I0413 02:32:25.543700 25483 status_update_manager.cpp:177] Pausing sending status updates
I0413 02:32:25.544010 25485 state.cpp:62] Recovering state from '/tmp/Endpoint_SlaveEndpointTest_UnauthorizedRequest_2_YnpcU9/meta'
I0413 02:32:25.544590 25486 status_update_manager.cpp:203] Recovering status update manager
I0413 02:32:25.544667 25486 containerizer.cpp:600] Recovering containerizer
I0413 02:32:25.545074 25486 provisioner.cpp:410] Provisioner recovery complete
I0413 02:32:25.545205 25486 slave.cpp:5550] Finished recovery
I0413 02:32:25.545528 25486 slave.cpp:5724] Querying resource estimator for oversubscribable
resources
I0413 02:32:25.545673 25486 slave.cpp:5738] Received oversubscribable resources {} from the
resource estimator
I0413 02:32:25.546440 25490 process.cpp:3704] Handling HTTP event for process 'slave(695)'
with path: '/slave(695)/containers'
I0413 02:32:25.546780 25490 http.cpp:871] Authorizing principal 'test-principal' to GET the
'/containers' endpoint
I0413 02:32:25.547885 25474 slave.cpp:803] Agent terminating
[       OK ] Endpoint/SlaveEndpointTest.UnauthorizedRequest/2 (13 ms)
[ RUN      ] Endpoint/SlaveEndpointTest.NoAuthorizer/0
I0413 02:32:25.578222 25474 containerizer.cpp:221] Using isolation: posix/cpu,posix/mem,filesystem/posix,network/cni
W0413 02:32:25.578855 25474 backend.cpp:76] Failed to create 'aufs' backend: AufsBackend requires
root privileges
W0413 02:32:25.578956 25474 backend.cpp:76] Failed to create 'bind' backend: BindBackend requires
root privileges
I0413 02:32:25.579026 25474 provisioner.cpp:249] Using default backend 'copy'
I0413 02:32:25.579955 25474 cluster.cpp:446] Creating default 'local' authorizer
I0413 02:32:25.580790 25481 slave.cpp:211] Mesos agent started on (696)@172.17.0.3:37864
I0413 02:32:25.580821 25481 slave.cpp:212] Flags at startup: --acls="" --appc_simple_discovery_uri_prefix="http://"
--appc_store_dir="/tmp/mesos/store/appc" --authenticate_http_readonly="true" --authenticate_http_readwrite="true"
--authenticatee="crammd5" --authentication_backoff_factor="1secs" --authorizer="local" --cgroups_cpu_enable_pids_and_tids_count="false"
--cgroups_enable_cfs="false" --cgroups_hierarchy="/sys/fs/cgroup" --cgroups_limit_swap="false"
--cgroups_root="mesos" --container_disk_watch_interval="15secs" --containerizers="mesos" --credential="/tmp/Endpoint_SlaveEndpointTest_NoAuthorizer_0_k76faK/credential"
--default_role="*" --disk_watch_interval="1mins" --docker="docker" --docker_kill_orphans="true"
--docker_registry="https://registry-1.docker.io" --docker_remove_delay="6hrs" --docker_socket="/var/run/docker.sock"
--docker_stop_timeout="0ns" --docker_store_dir="/tmp/mesos/store/docker" --docker_volume_checkpoint_dir="/var/run/mesos/isolators/docker/volume"
--enforce_container_disk_quota="false" --executor_registration_timeout="1mins" --executor_shutdown_grace_period="5secs"
--fetcher_cache_dir="/tmp/Endpoint_SlaveEndpointTest_NoAuthorizer_0_k76faK/fetch" --fetcher_cache_size="2GB"
--frameworks_home="" --gc_delay="1weeks" --gc_disk_headroom="0.1" --hadoop_home="" --help="false"
--hostname_lookup="true" --http_authenticators="basic" --http_command_executor="false" --http_credentials="/tmp/Endpoint_SlaveEndpointTest_NoAuthorizer_0_k76faK/http_credentials"
--http_heartbeat_interval="30secs" --initialize_driver_logging="true" --isolation="posix/cpu,posix/mem"
--launcher="posix" --launcher_dir="/mesos/build/src" --logbufsecs="0" --logging_level="INFO"
--max_completed_executors_per_framework="150" --oversubscribed_resources_interval="15secs"
--perf_duration="10secs" --perf_interval="1mins" --qos_correction_interval_min="0ns" --quiet="false"
--recover="reconnect" --recovery_timeout="15mins" --registration_backoff_factor="10ms" --resources="cpus:2;gpus:0;mem:1024;disk:1024;ports:[31000-32000]"
--revocable_cpu_low_priority="true" --runtime_dir="/tmp/Endpoint_SlaveEndpointTest_NoAuthorizer_0_k76faK"
--sandbox_directory="/mnt/mesos/sandbox" --strict="true" --switch_user="true" --systemd_enable_support="true"
--systemd_runtime_directory="/run/systemd/system" --version="false" --work_dir="/tmp/Endpoint_SlaveEndpointTest_NoAuthorizer_0_KkPlSC"
I0413 02:32:25.581331 25481 credentials.hpp:86] Loading credential for authentication from
'/tmp/Endpoint_SlaveEndpointTest_NoAuthorizer_0_k76faK/credential'
I0413 02:32:25.581470 25481 slave.cpp:354] Agent using credential for: test-principal
I0413 02:32:25.581482 25481 credentials.hpp:37] Loading credentials for authentication from
'/tmp/Endpoint_SlaveEndpointTest_NoAuthorizer_0_k76faK/http_credentials'
I0413 02:32:25.581601 25481 http.cpp:919] Using default 'basic' HTTP authenticator for realm
'mesos-agent-readonly'
I0413 02:32:25.581672 25481 http.cpp:919] Using default 'basic' HTTP authenticator for realm
'mesos-agent-readwrite'
I0413 02:32:25.582231 25481 slave.cpp:541] Agent resources: cpus(*):2; mem(*):1024; disk(*):1024;
ports(*):[31000-32000]
I0413 02:32:25.582273 25481 slave.cpp:549] Agent attributes: [  ]
I0413 02:32:25.582279 25481 slave.cpp:554] Agent hostname: 116fe5b0723f
I0413 02:32:25.582370 25482 status_update_manager.cpp:177] Pausing sending status updates
I0413 02:32:25.582753 25477 state.cpp:62] Recovering state from '/tmp/Endpoint_SlaveEndpointTest_NoAuthorizer_0_KkPlSC/meta'
I0413 02:32:25.582936 25477 status_update_manager.cpp:203] Recovering status update manager
I0413 02:32:25.582995 25477 containerizer.cpp:600] Recovering containerizer
I0413 02:32:25.583511 25477 provisioner.cpp:410] Provisioner recovery complete
I0413 02:32:25.583680 25477 slave.cpp:5550] Finished recovery
I0413 02:32:25.584138 25477 slave.cpp:5724] Querying resource estimator for oversubscribable
resources
I0413 02:32:25.584298 25477 slave.cpp:5738] Received oversubscribable resources {} from the
resource estimator
I0413 02:32:25.585322 25485 process.cpp:3704] Handling HTTP event for process 'slave(696)'
with path: '/slave(696)/monitor/statistics'
I0413 02:32:25.585836 25479 http.cpp:871] Authorizing principal 'test-principal' to GET the
'/monitor/statistics' endpoint
I0413 02:32:25.589018 25477 slave.cpp:803] Agent terminating
[       OK ] Endpoint/SlaveEndpointTest.NoAuthorizer/0 (15 ms)
[ RUN      ] Endpoint/SlaveEndpointTest.NoAuthorizer/1
I0413 02:32:25.604522 25474 containerizer.cpp:221] Using isolation: posix/cpu,posix/mem,filesystem/posix,network/cni
W0413 02:32:25.604794 25474 backend.cpp:76] Failed to create 'aufs' backend: AufsBackend requires
root privileges
W0413 02:32:25.604831 25474 backend.cpp:76] Failed to create 'bind' backend: BindBackend requires
root privileges
I0413 02:32:25.604846 25474 provisioner.cpp:249] Using default backend 'copy'
I0413 02:32:25.605548 25474 cluster.cpp:446] Creating default 'local' authorizer
I0413 02:32:25.606097 25476 slave.cpp:211] Mesos agent started on (697)@172.17.0.3:37864
I0413 02:32:25.606117 25476 slave.cpp:212] Flags at startup: --acls="" --appc_simple_discovery_uri_prefix="http://"
--appc_store_dir="/tmp/mesos/store/appc" --authenticate_http_readonly="true" --authenticate_http_readwrite="true"
--authenticatee="crammd5" --authentication_backoff_factor="1secs" --authorizer="local" --cgroups_cpu_enable_pids_and_tids_count="false"
--cgroups_enable_cfs="false" --cgroups_hierarchy="/sys/fs/cgroup" --cgroups_limit_swap="false"
--cgroups_root="mesos" --container_disk_watch_interval="15secs" --containerizers="mesos" --credential="/tmp/Endpoint_SlaveEndpointTest_NoAuthorizer_1_QbeZxd/credential"
--default_role="*" --disk_watch_interval="1mins" --docker="docker" --docker_kill_orphans="true"
--docker_registry="https://registry-1.docker.io" --docker_remove_delay="6hrs" --docker_socket="/var/run/docker.sock"
--docker_stop_timeout="0ns" --docker_store_dir="/tmp/mesos/store/docker" --docker_volume_checkpoint_dir="/var/run/mesos/isolators/docker/volume"
--enforce_container_disk_quota="false" --executor_registration_timeout="1mins" --executor_shutdown_grace_period="5secs"
--fetcher_cache_dir="/tmp/Endpoint_SlaveEndpointTest_NoAuthorizer_1_QbeZxd/fetch" --fetcher_cache_size="2GB"
--frameworks_home="" --gc_delay="1weeks" --gc_disk_headroom="0.1" --hadoop_home="" --help="false"
--hostname_lookup="true" --http_authenticators="basic" --http_command_executor="false" --http_credentials="/tmp/Endpoint_SlaveEndpointTest_NoAuthorizer_1_QbeZxd/http_credentials"
--http_heartbeat_interval="30secs" --initialize_driver_logging="true" --isolation="posix/cpu,posix/mem"
--launcher="posix" --launcher_dir="/mesos/build/src" --logbufsecs="0" --logging_level="INFO"
--max_completed_executors_per_framework="150" --oversubscribed_resources_interval="15secs"
--perf_duration="10secs" --perf_interval="1mins" --qos_correction_interval_min="0ns" --quiet="false"
--recover="reconnect" --recovery_timeout="15mins" --registration_backoff_factor="10ms" --resources="cpus:2;gpus:0;mem:1024;disk:1024;ports:[31000-32000]"
--revocable_cpu_low_priority="true" --runtime_dir="/tmp/Endpoint_SlaveEndpointTest_NoAuthorizer_1_QbeZxd"
--sandbox_directory="/mnt/mesos/sandbox" --strict="true" --switch_user="true" --systemd_enable_support="true"
--systemd_runtime_directory="/run/systemd/system" --version="false" --work_dir="/tmp/Endpoint_SlaveEndpointTest_NoAuthorizer_1_yapJb6"
I0413 02:32:25.606482 25476 credentials.hpp:86] Loading credential for authentication from
'/tmp/Endpoint_SlaveEndpointTest_NoAuthorizer_1_QbeZxd/credential'
I0413 02:32:25.606619 25476 slave.cpp:354] Agent using credential for: test-principal
I0413 02:32:25.606636 25476 credentials.hpp:37] Loading credentials for authentication from
'/tmp/Endpoint_SlaveEndpointTest_NoAuthorizer_1_QbeZxd/http_credentials'
I0413 02:32:25.606756 25476 http.cpp:919] Using default 'basic' HTTP authenticator for realm
'mesos-agent-readonly'
I0413 02:32:25.606812 25476 http.cpp:919] Using default 'basic' HTTP authenticator for realm
'mesos-agent-readwrite'
I0413 02:32:25.607182 25476 slave.cpp:541] Agent resources: cpus(*):2; mem(*):1024; disk(*):1024;
ports(*):[31000-32000]
I0413 02:32:25.607218 25476 slave.cpp:549] Agent attributes: [  ]
I0413 02:32:25.607226 25476 slave.cpp:554] Agent hostname: 116fe5b0723f
I0413 02:32:25.607328 25484 status_update_manager.cpp:177] Pausing sending status updates
I0413 02:32:25.607635 25479 state.cpp:62] Recovering state from '/tmp/Endpoint_SlaveEndpointTest_NoAuthorizer_1_yapJb6/meta'
I0413 02:32:25.607916 25476 status_update_manager.cpp:203] Recovering status update manager
I0413 02:32:25.608024 25485 containerizer.cpp:600] Recovering containerizer
I0413 02:32:25.608513 25488 provisioner.cpp:410] Provisioner recovery complete
I0413 02:32:25.608685 25478 slave.cpp:5550] Finished recovery
I0413 02:32:25.609022 25478 slave.cpp:5724] Querying resource estimator for oversubscribable
resources
I0413 02:32:25.609110 25483 slave.cpp:5738] Received oversubscribable resources {} from the
resource estimator
I0413 02:32:25.609791 25484 process.cpp:3704] Handling HTTP event for process 'slave(697)'
with path: '/slave(697)/monitor/statistics.json'
I0413 02:32:25.610172 25480 http.cpp:871] Authorizing principal 'test-principal' to GET the
'/monitor/statistics.json' endpoint
I0413 02:32:25.611084 25479 slave.cpp:803] Agent terminating
[       OK ] Endpoint/SlaveEndpointTest.NoAuthorizer/1 (11 ms)
[ RUN      ] Endpoint/SlaveEndpointTest.NoAuthorizer/2
I0413 02:32:25.653084 25474 containerizer.cpp:221] Using isolation: posix/cpu,posix/mem,filesystem/posix,network/cni
W0413 02:32:25.653416 25474 backend.cpp:76] Failed to create 'aufs' backend: AufsBackend requires
root privileges
W0413 02:32:25.653453 25474 backend.cpp:76] Failed to create 'bind' backend: BindBackend requires
root privileges
I0413 02:32:25.653466 25474 provisioner.cpp:249] Using default backend 'copy'
I0413 02:32:25.654096 25474 cluster.cpp:446] Creating default 'local' authorizer
I0413 02:32:25.654588 25478 slave.cpp:211] Mesos agent started on (698)@172.17.0.3:37864
I0413 02:32:25.654604 25478 slave.cpp:212] Flags at startup: --acls="" --appc_simple_discovery_uri_prefix="http://"
--appc_store_dir="/tmp/mesos/store/appc" --authenticate_http_readonly="true" --authenticate_http_readwrite="true"
--authenticatee="crammd5" --authentication_backoff_factor="1secs" --authorizer="local" --cgroups_cpu_enable_pids_and_tids_count="false"
--cgroups_enable_cfs="false" --cgroups_hierarchy="/sys/fs/cgroup" --cgroups_limit_swap="false"
--cgroups_root="mesos" --container_disk_watch_interval="15secs" --containerizers="mesos" --credential="/tmp/Endpoint_SlaveEndpointTest_NoAuthorizer_2_M76fnH/credential"
--default_role="*" --disk_watch_interval="1mins" --docker="docker" --docker_kill_orphans="true"
--docker_registry="https://registry-1.docker.io" --docker_remove_delay="6hrs" --docker_socket="/var/run/docker.sock"
--docker_stop_timeout="0ns" --docker_store_dir="/tmp/mesos/store/docker" --docker_volume_checkpoint_dir="/var/run/mesos/isolators/docker/volume"
--enforce_container_disk_quota="false" --executor_registration_timeout="1mins" --executor_shutdown_grace_period="5secs"
--fetcher_cache_dir="/tmp/Endpoint_SlaveEndpointTest_NoAuthorizer_2_M76fnH/fetch" --fetcher_cache_size="2GB"
--frameworks_home="" --gc_delay="1weeks" --gc_disk_headroom="0.1" --hadoop_home="" --help="false"
--hostname_lookup="true" --http_authenticators="basic" --http_command_executor="false" --http_credentials="/tmp/Endpoint_SlaveEndpointTest_NoAuthorizer_2_M76fnH/http_credentials"
--http_heartbeat_interval="30secs" --initialize_driver_logging="true" --isolation="posix/cpu,posix/mem"
--launcher="posix" --launcher_dir="/mesos/build/src" --logbufsecs="0" --logging_level="INFO"
--max_completed_executors_per_framework="150" --oversubscribed_resources_interval="15secs"
--perf_duration="10secs" --perf_interval="1mins" --qos_correction_interval_min="0ns" --quiet="false"
--recover="reconnect" --recovery_timeout="15mins" --registration_backoff_factor="10ms" --resources="cpus:2;gpus:0;mem:1024;disk:1024;ports:[31000-32000]"
--revocable_cpu_low_priority="true" --runtime_dir="/tmp/Endpoint_SlaveEndpointTest_NoAuthorizer_2_M76fnH"
--sandbox_directory="/mnt/mesos/sandbox" --strict="true" --switch_user="true" --systemd_enable_support="true"
--systemd_runtime_directory="/run/systemd/system" --version="false" --work_dir="/tmp/Endpoint_SlaveEndpointTest_NoAuthorizer_2_WujaTz"
I0413 02:32:25.654886 25478 credentials.hpp:86] Loading credential for authentication from
'/tmp/Endpoint_SlaveEndpointTest_NoAuthorizer_2_M76fnH/credential'
I0413 02:32:25.654954 25478 slave.cpp:354] Agent using credential for: test-principal
I0413 02:32:25.654966 25478 credentials.hpp:37] Loading credentials for authentication from
'/tmp/Endpoint_SlaveEndpointTest_NoAuthorizer_2_M76fnH/http_credentials'
I0413 02:32:25.655095 25478 http.cpp:919] Using default 'basic' HTTP authenticator for realm
'mesos-agent-readonly'
I0413 02:32:25.655139 25478 http.cpp:919] Using default 'basic' HTTP authenticator for realm
'mesos-agent-readwrite'
I0413 02:32:25.655544 25478 slave.cpp:541] Agent resources: cpus(*):2; mem(*):1024; disk(*):1024;
ports(*):[31000-32000]
I0413 02:32:25.655577 25478 slave.cpp:549] Agent attributes: [  ]
I0413 02:32:25.655582 25478 slave.cpp:554] Agent hostname: 116fe5b0723f
I0413 02:32:25.655690 25475 status_update_manager.cpp:177] Pausing sending status updates
I0413 02:32:25.656002 25483 state.cpp:62] Recovering state from '/tmp/Endpoint_SlaveEndpointTest_NoAuthorizer_2_WujaTz/meta'
I0413 02:32:25.656106 25488 status_update_manager.cpp:203] Recovering status update manager
I0413 02:32:25.656220 25485 containerizer.cpp:600] Recovering containerizer
I0413 02:32:25.656656 25483 provisioner.cpp:410] Provisioner recovery complete
I0413 02:32:25.656852 25489 slave.cpp:5550] Finished recovery
I0413 02:32:25.657163 25489 slave.cpp:5724] Querying resource estimator for oversubscribable
resources
I0413 02:32:25.657258 25488 slave.cpp:5738] Received oversubscribable resources {} from the
resource estimator
I0413 02:32:25.657855 25479 process.cpp:3704] Handling HTTP event for process 'slave(698)'
with path: '/slave(698)/containers'
I0413 02:32:25.658171 25485 http.cpp:871] Authorizing principal 'test-principal' to GET the
'/containers' endpoint
I0413 02:32:25.659309 25480 slave.cpp:803] Agent terminating
[       OK ] Endpoint/SlaveEndpointTest.NoAuthorizer/2 (10 ms)
[----------] 9 tests from Endpoint/SlaveEndpointTest (447 ms total)

[----------] Global test environment tear-down
/mesos/src/tests/environment.cpp:836: Failure
Failed
Tests completed with child processes remaining:
-+- 25474 src/mesos-tests 
 |--- 28982 mesos-io-switchboard --heartbeat_interval=30secs --help=false --socket_address=/tmp/mesos-io-switchboard-f87e5d85-7db9-43e0-bbcb-406bc5c2907f
--stderr_from_fd=6 --stderr_to_fd=2 --stdin_to_fd=6 --stdout_from_fd=6 --stdout_to_fd=1 --tty=true
--wait_for_connection=false 
 \-+- 28983 /mesos/build/src/mesos-containerizer launch 
   \--- 28984 sleep 1000 
[==========] 1439 tests from 159 test cases ran. (502731 ms total)
[  PASSED  ] 1437 tests.
[  FAILED  ] 2 tests, listed below:
[  FAILED  ] IOSwitchboardTest.ContainerAttach
[  FAILED  ] ContentType/AgentAPITest.LaunchNestedContainerSessionDisconnected/1, where GetParam()
= application/json

 2 FAILED TESTS
  YOU HAVE 11 DISABLED TESTS

make[3]: *** [CMakeFiles/check] Error 1
make[3]: Leaving directory `/mesos/build'
make[2]: *** [CMakeFiles/check.dir/all] Error 2
make[2]: Leaving directory `/mesos/build'
make[1]: *** [CMakeFiles/check.dir/rule] Error 2
make[1]: Leaving directory `/mesos/build'
make: *** [check] Error 2
+ docker rmi mesos-1492046589-16288
Untagged: mesos-1492046589-16288:latest
Deleted: sha256:c403e5fd6c5c4691ad2cdbc783039c761860bfc074bf209b7bacb0562a25f20a
Deleted: sha256:5010bb9e7db3918e734633e384cece45fc4ffb66a4cb0e81921cd89dda200449
Deleted: sha256:971d9f26d08705b8d2bcb412fcb3a8dbf1ae33d3b483d7ac0bc36d4320447ed6
Deleted: sha256:58f1c3fd8444b117e544283a0dd40e79fab998c5e715fd3a3aa617f84fd271a8
Deleted: sha256:2a6b45d49d781a6eafeafce8ed43210d74401a275fbd561a0b6f87d6bfdd934d
Deleted: sha256:ac2ad47106f099ee16af0a72085078554f4524603320eaea2febf6f3e0ebafc8
Deleted: sha256:253c9ab6cf17d27134a87eb90576064584436d58a86d2f00732723dbc17e3f7c
Deleted: sha256:2ec6824914d993d246afb1e01289afe0a4553337a387fe09e934f13897b04bfb
Deleted: sha256:2b1c8bccda85be4baadee3eda831672a26e9f2b0575ffd392a0ad80e0cd6d879
Deleted: sha256:1daece0b9f94d4e0687f2e0190885c9c67b944b2e647c0658330e48b92f1376b
Deleted: sha256:9c1b702ffed697efa8d904e1890aefe92f61f9497c3b35460da9c8e26c21b70c
Deleted: sha256:5d79c76206eaf98702f11a3343fa1d285b0d9a497da62c9cbd9f9755f7976759
Deleted: sha256:ae1f86ba76d971c3c3e8abac7e360aaef11cacf8751c2b6b7847a425dd23b9f5
Deleted: sha256:d19db4343075bf3b9b0b2a5c45f9dc8125a97770961db66338152779e0e72f1f
Deleted: sha256:ca2911160dd37f2c3b2ca806ce0784b8c29ac7d5206a1fe52ad8032dab193f51
Deleted: sha256:53c4652817cbf7b4d9e6e6e2bd60f7683d6c3ccd4f1edb19f6b739d55b8be6c3
Deleted: sha256:f75780291cbbd3914555ea48c96ea322bc10c53419be4744afcecfc5f948f99e
Deleted: sha256:23478d681f4ce05430840a33b79aee358fced17ae6a1259ce6290e2a1de38712
Deleted: sha256:fb6f8697d865d4e17d97c5c440d23d77cd972868bd33abcce9e12975091c62fb
Deleted: sha256:0df55b30716aadbe85fd6e37f23d1035a7f62c842002960363352d0942342684
Deleted: sha256:14545ec5b7e0d00f9d5dbc3f6150faa1be4c9c86afa7ab6be692c10145c99149
Deleted: sha256:0f74cfd5ea035ecbc72f37ba96d5ee817b5da1043b2543194c08468c2e9c74ee
Deleted: sha256:941b6ba7ec1f6baa1bf851370787bb4297c3e36fcc9863f34a1ab52ee5f08dbf
Deleted: sha256:9d5a4d516e16689a9ac5a642f13b05007dd30f95eca2b94cf0499286c396fce6
Deleted: sha256:d42170d5a93a7a6bf9a331f7621f65bdf6dc2696f401a7e4d887695a91aeee1c
Build step 'Execute shell' marked build as failure

Mime
View raw message