mesos-builds mailing list archives

Site index · List index
Message view « Date » · « Thread »
Top « Date » · « Thread »
From Apache Jenkins Server <jenk...@builds.apache.org>
Subject Build failed in Jenkins: Mesos-Reviewbot #17871
Date Thu, 27 Apr 2017 13:22:05 GMT
See <https://builds.apache.org/job/Mesos-Reviewbot/17871/display/redirect?page=changes>

Changes:

[alexr] Temporarily disabled a test on Windows.

------------------------------------------
[...truncated 26.60 MB...]
I0427 13:22:00.221575 30677 slave.cpp:790] Agent terminating
[       OK ] Endpoint/SlaveEndpointTest.AuthorizedRequest/1 (30 ms)
[ RUN      ] Endpoint/SlaveEndpointTest.AuthorizedRequest/2
I0427 13:22:00.231930 30648 containerizer.cpp:221] Using isolation: posix/cpu,posix/mem,filesystem/posix,network/cni
W0427 13:22:00.232528 30648 backend.cpp:76] Failed to create 'aufs' backend: AufsBackend requires
root privileges
W0427 13:22:00.232666 30648 backend.cpp:76] Failed to create 'bind' backend: BindBackend requires
root privileges
I0427 13:22:00.232718 30648 provisioner.cpp:249] Using default backend 'copy'
I0427 13:22:00.236590 30673 slave.cpp:225] Mesos agent started on (737)@172.17.0.2:57666
I0427 13:22:00.236618 30673 slave.cpp:226] Flags at startup: --acls="" --appc_simple_discovery_uri_prefix="http://"
--appc_store_dir="/tmp/mesos/store/appc" --authenticate_http_readonly="true" --authenticate_http_readwrite="true"
--authenticatee="crammd5" --authentication_backoff_factor="1secs" --authorizer="local" --cgroups_cpu_enable_pids_and_tids_count="false"
--cgroups_enable_cfs="false" --cgroups_hierarchy="/sys/fs/cgroup" --cgroups_limit_swap="false"
--cgroups_root="mesos" --container_disk_watch_interval="15secs" --containerizers="mesos" --credential="/tmp/Endpoint_SlaveEndpointTest_AuthorizedRequest_2_KP3UXW/credential"
--default_role="*" --disk_watch_interval="1mins" --docker="docker" --docker_kill_orphans="true"
--docker_registry="https://registry-1.docker.io" --docker_remove_delay="6hrs" --docker_socket="/var/run/docker.sock"
--docker_stop_timeout="0ns" --docker_store_dir="/tmp/mesos/store/docker" --docker_volume_checkpoint_dir="/var/run/mesos/isolators/docker/volume"
--enforce_container_disk_quota="false" --executor_registration_timeout="1mins" --executor_shutdown_grace_period="5secs"
--fetcher_cache_dir="/tmp/Endpoint_SlaveEndpointTest_AuthorizedRequest_2_KP3UXW/fetch" --fetcher_cache_size="2GB"
--frameworks_home="" --gc_delay="1weeks" --gc_disk_headroom="0.1" --hadoop_home="" --help="false"
--hostname_lookup="true" --http_command_executor="false" --http_credentials="/tmp/Endpoint_SlaveEndpointTest_AuthorizedRequest_2_KP3UXW/http_credentials"
--http_heartbeat_interval="30secs" --initialize_driver_logging="true" --isolation="posix/cpu,posix/mem"
--launcher="posix" --launcher_dir="/mesos/mesos-1.3.0/_build/src" --logbufsecs="0" --logging_level="INFO"
--max_completed_executors_per_framework="150" --oversubscribed_resources_interval="15secs"
--perf_duration="10secs" --perf_interval="1mins" --port="5051" --qos_correction_interval_min="0ns"
--quiet="false" --recover="reconnect" --recovery_timeout="15mins" --registration_backoff_factor="10ms"
--resources="cpus:2;gpus:0;mem:1024;disk:1024;ports:[31000-32000]" --revocable_cpu_low_priority="true"
--runtime_dir="/tmp/Endpoint_SlaveEndpointTest_AuthorizedRequest_2_KP3UXW" --sandbox_directory="/mnt/mesos/sandbox"
--strict="true" --switch_user="true" --systemd_enable_support="true" --systemd_runtime_directory="/run/systemd/system"
--version="false" --work_dir="/tmp/Endpoint_SlaveEndpointTest_AuthorizedRequest_2_kwdzP1"
I0427 13:22:00.237226 30673 credentials.hpp:86] Loading credential for authentication from
'/tmp/Endpoint_SlaveEndpointTest_AuthorizedRequest_2_KP3UXW/credential'
I0427 13:22:00.237396 30673 slave.cpp:258] Agent using credential for: test-principal
I0427 13:22:00.237428 30673 credentials.hpp:37] Loading credentials for authentication from
'/tmp/Endpoint_SlaveEndpointTest_AuthorizedRequest_2_KP3UXW/http_credentials'
I0427 13:22:00.237735 30673 http.cpp:975] Creating default 'basic' HTTP authenticator for
realm 'mesos-agent-readonly'
I0427 13:22:00.237900 30673 http.cpp:975] Creating default 'basic' HTTP authenticator for
realm 'mesos-agent-readwrite'
I0427 13:22:00.239634 30673 slave.cpp:525] Agent resources: cpus(*):2; mem(*):1024; disk(*):1024;
ports(*):[31000-32000]
I0427 13:22:00.239738 30673 slave.cpp:533] Agent attributes: [  ]
I0427 13:22:00.239754 30673 slave.cpp:538] Agent hostname: de5380ca50b2
I0427 13:22:00.239938 30675 status_update_manager.cpp:177] Pausing sending status updates
I0427 13:22:00.241330 30668 state.cpp:62] Recovering state from '/tmp/Endpoint_SlaveEndpointTest_AuthorizedRequest_2_kwdzP1/meta'
I0427 13:22:00.241741 30668 status_update_manager.cpp:203] Recovering status update manager
I0427 13:22:00.241968 30671 containerizer.cpp:608] Recovering containerizer
I0427 13:22:00.243577 30669 provisioner.cpp:410] Provisioner recovery complete
I0427 13:22:00.244004 30674 slave.cpp:5963] Finished recovery
I0427 13:22:00.244446 30674 slave.cpp:6145] Querying resource estimator for oversubscribable
resources
I0427 13:22:00.244729 30667 slave.cpp:6159] Received oversubscribable resources {} from the
resource estimator
I0427 13:22:00.247526 30675 process.cpp:3731] Handling HTTP event for process 'slave(737)'
with path: '/slave(737)/containers'
I0427 13:22:00.249181 30673 http.cpp:1115] HTTP GET for /slave(737)/containers from 172.17.0.2:60625
I0427 13:22:00.249289 30673 http.cpp:936] Authorizing principal 'test-principal' to GET the
'/containers' endpoint
I0427 13:22:00.253213 30668 slave.cpp:790] Agent terminating
[       OK ] Endpoint/SlaveEndpointTest.AuthorizedRequest/2 (31 ms)
[ RUN      ] Endpoint/SlaveEndpointTest.UnauthorizedRequest/0
I0427 13:22:00.262167 30648 containerizer.cpp:221] Using isolation: posix/cpu,posix/mem,filesystem/posix,network/cni
W0427 13:22:00.262753 30648 backend.cpp:76] Failed to create 'aufs' backend: AufsBackend requires
root privileges
W0427 13:22:00.262866 30648 backend.cpp:76] Failed to create 'bind' backend: BindBackend requires
root privileges
I0427 13:22:00.262905 30648 provisioner.cpp:249] Using default backend 'copy'
I0427 13:22:00.266469 30675 slave.cpp:225] Mesos agent started on (738)@172.17.0.2:57666
I0427 13:22:00.266496 30675 slave.cpp:226] Flags at startup: --acls="" --appc_simple_discovery_uri_prefix="http://"
--appc_store_dir="/tmp/mesos/store/appc" --authenticate_http_readonly="true" --authenticate_http_readwrite="true"
--authenticatee="crammd5" --authentication_backoff_factor="1secs" --authorizer="local" --cgroups_cpu_enable_pids_and_tids_count="false"
--cgroups_enable_cfs="false" --cgroups_hierarchy="/sys/fs/cgroup" --cgroups_limit_swap="false"
--cgroups_root="mesos" --container_disk_watch_interval="15secs" --containerizers="mesos" --credential="/tmp/Endpoint_SlaveEndpointTest_UnauthorizedRequest_0_kgApMD/credential"
--default_role="*" --disk_watch_interval="1mins" --docker="docker" --docker_kill_orphans="true"
--docker_registry="https://registry-1.docker.io" --docker_remove_delay="6hrs" --docker_socket="/var/run/docker.sock"
--docker_stop_timeout="0ns" --docker_store_dir="/tmp/mesos/store/docker" --docker_volume_checkpoint_dir="/var/run/mesos/isolators/docker/volume"
--enforce_container_disk_quota="false" --executor_registration_timeout="1mins" --executor_shutdown_grace_period="5secs"
--fetcher_cache_dir="/tmp/Endpoint_SlaveEndpointTest_UnauthorizedRequest_0_kgApMD/fetch" --fetcher_cache_size="2GB"
--frameworks_home="" --gc_delay="1weeks" --gc_disk_headroom="0.1" --hadoop_home="" --help="false"
--hostname_lookup="true" --http_command_executor="false" --http_credentials="/tmp/Endpoint_SlaveEndpointTest_UnauthorizedRequest_0_kgApMD/http_credentials"
--http_heartbeat_interval="30secs" --initialize_driver_logging="true" --isolation="posix/cpu,posix/mem"
--launcher="posix" --launcher_dir="/mesos/mesos-1.3.0/_build/src" --logbufsecs="0" --logging_level="INFO"
--max_completed_executors_per_framework="150" --oversubscribed_resources_interval="15secs"
--perf_duration="10secs" --perf_interval="1mins" --port="5051" --qos_correction_interval_min="0ns"
--quiet="false" --recover="reconnect" --recovery_timeout="15mins" --registration_backoff_factor="10ms"
--resources="cpus:2;gpus:0;mem:1024;disk:1024;ports:[31000-32000]" --revocable_cpu_low_priority="true"
--runtime_dir="/tmp/Endpoint_SlaveEndpointTest_UnauthorizedRequest_0_kgApMD" --sandbox_directory="/mnt/mesos/sandbox"
--strict="true" --switch_user="true" --systemd_enable_support="true" --systemd_runtime_directory="/run/systemd/system"
--version="false" --work_dir="/tmp/Endpoint_SlaveEndpointTest_UnauthorizedRequest_0_Ct25yI"
I0427 13:22:00.266943 30675 credentials.hpp:86] Loading credential for authentication from
'/tmp/Endpoint_SlaveEndpointTest_UnauthorizedRequest_0_kgApMD/credential'
I0427 13:22:00.267122 30675 slave.cpp:258] Agent using credential for: test-principal
I0427 13:22:00.267150 30675 credentials.hpp:37] Loading credentials for authentication from
'/tmp/Endpoint_SlaveEndpointTest_UnauthorizedRequest_0_kgApMD/http_credentials'
I0427 13:22:00.267429 30675 http.cpp:975] Creating default 'basic' HTTP authenticator for
realm 'mesos-agent-readonly'
I0427 13:22:00.267586 30675 http.cpp:975] Creating default 'basic' HTTP authenticator for
realm 'mesos-agent-readwrite'
I0427 13:22:00.269016 30675 slave.cpp:525] Agent resources: cpus(*):2; mem(*):1024; disk(*):1024;
ports(*):[31000-32000]
I0427 13:22:00.269114 30675 slave.cpp:533] Agent attributes: [  ]
I0427 13:22:00.269136 30675 slave.cpp:538] Agent hostname: de5380ca50b2
I0427 13:22:00.269335 30679 status_update_manager.cpp:177] Pausing sending status updates
I0427 13:22:00.270613 30678 state.cpp:62] Recovering state from '/tmp/Endpoint_SlaveEndpointTest_UnauthorizedRequest_0_Ct25yI/meta'
I0427 13:22:00.271064 30674 status_update_manager.cpp:203] Recovering status update manager
I0427 13:22:00.271347 30676 containerizer.cpp:608] Recovering containerizer
I0427 13:22:00.272900 30668 provisioner.cpp:410] Provisioner recovery complete
I0427 13:22:00.273334 30667 slave.cpp:5963] Finished recovery
I0427 13:22:00.273836 30667 slave.cpp:6145] Querying resource estimator for oversubscribable
resources
I0427 13:22:00.274215 30681 slave.cpp:6159] Received oversubscribable resources {} from the
resource estimator
I0427 13:22:00.276998 30675 process.cpp:3731] Handling HTTP event for process 'slave(738)'
with path: '/slave(738)/monitor/statistics'
I0427 13:22:00.278604 30677 http.cpp:1115] HTTP GET for /slave(738)/monitor/statistics from
172.17.0.2:60627
I0427 13:22:00.278765 30677 http.cpp:936] Authorizing principal 'test-principal' to GET the
'/monitor/statistics' endpoint
I0427 13:22:00.281487 30671 slave.cpp:790] Agent terminating
[       OK ] Endpoint/SlaveEndpointTest.UnauthorizedRequest/0 (29 ms)
[ RUN      ] Endpoint/SlaveEndpointTest.UnauthorizedRequest/1
I0427 13:22:00.292291 30648 containerizer.cpp:221] Using isolation: posix/cpu,posix/mem,filesystem/posix,network/cni
W0427 13:22:00.292894 30648 backend.cpp:76] Failed to create 'aufs' backend: AufsBackend requires
root privileges
W0427 13:22:00.293007 30648 backend.cpp:76] Failed to create 'bind' backend: BindBackend requires
root privileges
I0427 13:22:00.293053 30648 provisioner.cpp:249] Using default backend 'copy'
I0427 13:22:00.296638 30680 slave.cpp:225] Mesos agent started on (739)@172.17.0.2:57666
I0427 13:22:00.296705 30680 slave.cpp:226] Flags at startup: --acls="" --appc_simple_discovery_uri_prefix="http://"
--appc_store_dir="/tmp/mesos/store/appc" --authenticate_http_readonly="true" --authenticate_http_readwrite="true"
--authenticatee="crammd5" --authentication_backoff_factor="1secs" --authorizer="local" --cgroups_cpu_enable_pids_and_tids_count="false"
--cgroups_enable_cfs="false" --cgroups_hierarchy="/sys/fs/cgroup" --cgroups_limit_swap="false"
--cgroups_root="mesos" --container_disk_watch_interval="15secs" --containerizers="mesos" --credential="/tmp/Endpoint_SlaveEndpointTest_UnauthorizedRequest_1_TvNeUk/credential"
--default_role="*" --disk_watch_interval="1mins" --docker="docker" --docker_kill_orphans="true"
--docker_registry="https://registry-1.docker.io" --docker_remove_delay="6hrs" --docker_socket="/var/run/docker.sock"
--docker_stop_timeout="0ns" --docker_store_dir="/tmp/mesos/store/docker" --docker_volume_checkpoint_dir="/var/run/mesos/isolators/docker/volume"
--enforce_container_disk_quota="false" --executor_registration_timeout="1mins" --executor_shutdown_grace_period="5secs"
--fetcher_cache_dir="/tmp/Endpoint_SlaveEndpointTest_UnauthorizedRequest_1_TvNeUk/fetch" --fetcher_cache_size="2GB"
--frameworks_home="" --gc_delay="1weeks" --gc_disk_headroom="0.1" --hadoop_home="" --help="false"
--hostname_lookup="true" --http_command_executor="false" --http_credentials="/tmp/Endpoint_SlaveEndpointTest_UnauthorizedRequest_1_TvNeUk/http_credentials"
--http_heartbeat_interval="30secs" --initialize_driver_logging="true" --isolation="posix/cpu,posix/mem"
--launcher="posix" --launcher_dir="/mesos/mesos-1.3.0/_build/src" --logbufsecs="0" --logging_level="INFO"
--max_completed_executors_per_framework="150" --oversubscribed_resources_interval="15secs"
--perf_duration="10secs" --perf_interval="1mins" --port="5051" --qos_correction_interval_min="0ns"
--quiet="false" --recover="reconnect" --recovery_timeout="15mins" --registration_backoff_factor="10ms"
--resources="cpus:2;gpus:0;mem:1024;disk:1024;ports:[31000-32000]" --revocable_cpu_low_priority="true"
--runtime_dir="/tmp/Endpoint_SlaveEndpointTest_UnauthorizedRequest_1_TvNeUk" --sandbox_directory="/mnt/mesos/sandbox"
--strict="true" --switch_user="true" --systemd_enable_support="true" --systemd_runtime_directory="/run/systemd/system"
--version="false" --work_dir="/tmp/Endpoint_SlaveEndpointTest_UnauthorizedRequest_1_Yos2Bp"
I0427 13:22:00.297175 30680 credentials.hpp:86] Loading credential for authentication from
'/tmp/Endpoint_SlaveEndpointTest_UnauthorizedRequest_1_TvNeUk/credential'
I0427 13:22:00.297353 30680 slave.cpp:258] Agent using credential for: test-principal
I0427 13:22:00.297380 30680 credentials.hpp:37] Loading credentials for authentication from
'/tmp/Endpoint_SlaveEndpointTest_UnauthorizedRequest_1_TvNeUk/http_credentials'
I0427 13:22:00.297684 30680 http.cpp:975] Creating default 'basic' HTTP authenticator for
realm 'mesos-agent-readonly'
I0427 13:22:00.297864 30680 http.cpp:975] Creating default 'basic' HTTP authenticator for
realm 'mesos-agent-readwrite'
I0427 13:22:00.299759 30680 slave.cpp:525] Agent resources: cpus(*):2; mem(*):1024; disk(*):1024;
ports(*):[31000-32000]
I0427 13:22:00.299866 30680 slave.cpp:533] Agent attributes: [  ]
I0427 13:22:00.299882 30680 slave.cpp:538] Agent hostname: de5380ca50b2
I0427 13:22:00.300047 30677 status_update_manager.cpp:177] Pausing sending status updates
I0427 13:22:00.301589 30682 state.cpp:62] Recovering state from '/tmp/Endpoint_SlaveEndpointTest_UnauthorizedRequest_1_Yos2Bp/meta'
I0427 13:22:00.301959 30675 status_update_manager.cpp:203] Recovering status update manager
I0427 13:22:00.302237 30672 containerizer.cpp:608] Recovering containerizer
I0427 13:22:00.303925 30675 provisioner.cpp:410] Provisioner recovery complete
I0427 13:22:00.304474 30667 slave.cpp:5963] Finished recovery
I0427 13:22:00.305084 30667 slave.cpp:6145] Querying resource estimator for oversubscribable
resources
I0427 13:22:00.305347 30681 slave.cpp:6159] Received oversubscribable resources {} from the
resource estimator
I0427 13:22:00.307554 30667 process.cpp:3731] Handling HTTP event for process 'slave(739)'
with path: '/slave(739)/monitor/statistics.json'
I0427 13:22:00.309007 30676 http.cpp:1115] HTTP GET for /slave(739)/monitor/statistics.json
from 172.17.0.2:60630
I0427 13:22:00.309154 30676 http.cpp:936] Authorizing principal 'test-principal' to GET the
'/monitor/statistics.json' endpoint
I0427 13:22:00.312357 30676 slave.cpp:790] Agent terminating
[       OK ] Endpoint/SlaveEndpointTest.UnauthorizedRequest/1 (30 ms)
[ RUN      ] Endpoint/SlaveEndpointTest.UnauthorizedRequest/2
I0427 13:22:00.322496 30648 containerizer.cpp:221] Using isolation: posix/cpu,posix/mem,filesystem/posix,network/cni
W0427 13:22:00.323051 30648 backend.cpp:76] Failed to create 'aufs' backend: AufsBackend requires
root privileges
W0427 13:22:00.323153 30648 backend.cpp:76] Failed to create 'bind' backend: BindBackend requires
root privileges
I0427 13:22:00.323191 30648 provisioner.cpp:249] Using default backend 'copy'
I0427 13:22:00.326073 30673 slave.cpp:225] Mesos agent started on (740)@172.17.0.2:57666
I0427 13:22:00.326100 30673 slave.cpp:226] Flags at startup: --acls="" --appc_simple_discovery_uri_prefix="http://"
--appc_store_dir="/tmp/mesos/store/appc" --authenticate_http_readonly="true" --authenticate_http_readwrite="true"
--authenticatee="crammd5" --authentication_backoff_factor="1secs" --authorizer="local" --cgroups_cpu_enable_pids_and_tids_count="false"
--cgroups_enable_cfs="false" --cgroups_hierarchy="/sys/fs/cgroup" --cgroups_limit_swap="false"
--cgroups_root="mesos" --container_disk_watch_interval="15secs" --containerizers="mesos" --credential="/tmp/Endpoint_SlaveEndpointTest_UnauthorizedRequest_2_17jUl2/credential"
--default_role="*" --disk_watch_interval="1mins" --docker="docker" --docker_kill_orphans="true"
--docker_registry="https://registry-1.docker.io" --docker_remove_delay="6hrs" --docker_socket="/var/run/docker.sock"
--docker_stop_timeout="0ns" --docker_store_dir="/tmp/mesos/store/docker" --docker_volume_checkpoint_dir="/var/run/mesos/isolators/docker/volume"
--enforce_container_disk_quota="false" --executor_registration_timeout="1mins" --executor_shutdown_grace_period="5secs"
--fetcher_cache_dir="/tmp/Endpoint_SlaveEndpointTest_UnauthorizedRequest_2_17jUl2/fetch" --fetcher_cache_size="2GB"
--frameworks_home="" --gc_delay="1weeks" --gc_disk_headroom="0.1" --hadoop_home="" --help="false"
--hostname_lookup="true" --http_command_executor="false" --http_credentials="/tmp/Endpoint_SlaveEndpointTest_UnauthorizedRequest_2_17jUl2/http_credentials"
--http_heartbeat_interval="30secs" --initialize_driver_logging="true" --isolation="posix/cpu,posix/mem"
--launcher="posix" --launcher_dir="/mesos/mesos-1.3.0/_build/src" --logbufsecs="0" --logging_level="INFO"
--max_completed_executors_per_framework="150" --oversubscribed_resources_interval="15secs"
--perf_duration="10secs" --perf_interval="1mins" --port="5051" --qos_correction_interval_min="0ns"
--quiet="false" --recover="reconnect" --recovery_timeout="15mins" --registration_backoff_factor="10ms"
--resources="cpus:2;gpus:0;mem:1024;disk:1024;ports:[31000-32000]" --revocable_cpu_low_priority="true"
--runtime_dir="/tmp/Endpoint_SlaveEndpointTest_UnauthorizedRequest_2_17jUl2" --sandbox_directory="/mnt/mesos/sandbox"
--strict="true" --switch_user="true" --systemd_enable_support="true" --systemd_runtime_directory="/run/systemd/system"
--version="false" --work_dir="/tmp/Endpoint_SlaveEndpointTest_UnauthorizedRequest_2_J1ONY6"
I0427 13:22:00.326464 30673 credentials.hpp:86] Loading credential for authentication from
'/tmp/Endpoint_SlaveEndpointTest_UnauthorizedRequest_2_17jUl2/credential'
I0427 13:22:00.326620 30673 slave.cpp:258] Agent using credential for: test-principal
I0427 13:22:00.326647 30673 credentials.hpp:37] Loading credentials for authentication from
'/tmp/Endpoint_SlaveEndpointTest_UnauthorizedRequest_2_17jUl2/http_credentials'
I0427 13:22:00.326891 30673 http.cpp:975] Creating default 'basic' HTTP authenticator for
realm 'mesos-agent-readonly'
I0427 13:22:00.327030 30673 http.cpp:975] Creating default 'basic' HTTP authenticator for
realm 'mesos-agent-readwrite'
I0427 13:22:00.328310 30673 slave.cpp:525] Agent resources: cpus(*):2; mem(*):1024; disk(*):1024;
ports(*):[31000-32000]
I0427 13:22:00.328393 30673 slave.cpp:533] Agent attributes: [  ]
I0427 13:22:00.328407 30673 slave.cpp:538] Agent hostname: de5380ca50b2
I0427 13:22:00.328546 30668 status_update_manager.cpp:177] Pausing sending status updates
I0427 13:22:00.329869 30669 state.cpp:62] Recovering state from '/tmp/Endpoint_SlaveEndpointTest_UnauthorizedRequest_2_J1ONY6/meta'
I0427 13:22:00.330093 30671 status_update_manager.cpp:203] Recovering status update manager
I0427 13:22:00.330318 30678 containerizer.cpp:608] Recovering containerizer
I0427 13:22:00.331563 30668 provisioner.cpp:410] Provisioner recovery complete
I0427 13:22:00.331944 30678 slave.cpp:5963] Finished recovery
I0427 13:22:00.332396 30678 slave.cpp:6145] Querying resource estimator for oversubscribable
resources
I0427 13:22:00.332715 30679 slave.cpp:6159] Received oversubscribable resources {} from the
resource estimator
I0427 13:22:00.334856 30677 process.cpp:3731] Handling HTTP event for process 'slave(740)'
with path: '/slave(740)/containers'
I0427 13:22:00.336331 30668 http.cpp:1115] HTTP GET for /slave(740)/containers from 172.17.0.2:60632
I0427 13:22:00.336408 30668 http.cpp:936] Authorizing principal 'test-principal' to GET the
'/containers' endpoint
I0427 13:22:00.338698 30677 slave.cpp:790] Agent terminating
[       OK ] Endpoint/SlaveEndpointTest.UnauthorizedRequest/2 (26 ms)
[ RUN      ] Endpoint/SlaveEndpointTest.NoAuthorizer/0
I0427 13:22:00.349859 30648 containerizer.cpp:221] Using isolation: posix/cpu,posix/mem,filesystem/posix,network/cni
W0427 13:22:00.350451 30648 backend.cpp:76] Failed to create 'aufs' backend: AufsBackend requires
root privileges
W0427 13:22:00.350570 30648 backend.cpp:76] Failed to create 'bind' backend: BindBackend requires
root privileges
I0427 13:22:00.350620 30648 provisioner.cpp:249] Using default backend 'copy'
I0427 13:22:00.352039 30648 cluster.cpp:448] Creating default 'local' authorizer
I0427 13:22:00.353515 30673 slave.cpp:225] Mesos agent started on (741)@172.17.0.2:57666
I0427 13:22:00.353533 30673 slave.cpp:226] Flags at startup: --acls="" --appc_simple_discovery_uri_prefix="http://"
--appc_store_dir="/tmp/mesos/store/appc" --authenticate_http_readonly="true" --authenticate_http_readwrite="true"
--authenticatee="crammd5" --authentication_backoff_factor="1secs" --authorizer="local" --cgroups_cpu_enable_pids_and_tids_count="false"
--cgroups_enable_cfs="false" --cgroups_hierarchy="/sys/fs/cgroup" --cgroups_limit_swap="false"
--cgroups_root="mesos" --container_disk_watch_interval="15secs" --containerizers="mesos" --credential="/tmp/Endpoint_SlaveEndpointTest_NoAuthorizer_0_V3N04J/credential"
--default_role="*" --disk_watch_interval="1mins" --docker="docker" --docker_kill_orphans="true"
--docker_registry="https://registry-1.docker.io" --docker_remove_delay="6hrs" --docker_socket="/var/run/docker.sock"
--docker_stop_timeout="0ns" --docker_store_dir="/tmp/mesos/store/docker" --docker_volume_checkpoint_dir="/var/run/mesos/isolators/docker/volume"
--enforce_container_disk_quota="false" --executor_registration_timeout="1mins" --executor_shutdown_grace_period="5secs"
--fetcher_cache_dir="/tmp/Endpoint_SlaveEndpointTest_NoAuthorizer_0_V3N04J/fetch" --fetcher_cache_size="2GB"
--frameworks_home="" --gc_delay="1weeks" --gc_disk_headroom="0.1" --hadoop_home="" --help="false"
--hostname_lookup="true" --http_command_executor="false" --http_credentials="/tmp/Endpoint_SlaveEndpointTest_NoAuthorizer_0_V3N04J/http_credentials"
--http_heartbeat_interval="30secs" --initialize_driver_logging="true" --isolation="posix/cpu,posix/mem"
--launcher="posix" --launcher_dir="/mesos/mesos-1.3.0/_build/src" --logbufsecs="0" --logging_level="INFO"
--max_completed_executors_per_framework="150" --oversubscribed_resources_interval="15secs"
--perf_duration="10secs" --perf_interval="1mins" --port="5051" --qos_correction_interval_min="0ns"
--quiet="false" --recover="reconnect" --recovery_timeout="15mins" --registration_backoff_factor="10ms"
--resources="cpus:2;gpus:0;mem:1024;disk:1024;ports:[31000-32000]" --revocable_cpu_low_priority="true"
--runtime_dir="/tmp/Endpoint_SlaveEndpointTest_NoAuthorizer_0_V3N04J" --sandbox_directory="/mnt/mesos/sandbox"
--strict="true" --switch_user="true" --systemd_enable_support="true" --systemd_runtime_directory="/run/systemd/system"
--version="false" --work_dir="/tmp/Endpoint_SlaveEndpointTest_NoAuthorizer_0_dFiyDO"
I0427 13:22:00.353891 30673 credentials.hpp:86] Loading credential for authentication from
'/tmp/Endpoint_SlaveEndpointTest_NoAuthorizer_0_V3N04J/credential'
I0427 13:22:00.354040 30673 slave.cpp:258] Agent using credential for: test-principal
I0427 13:22:00.354063 30673 credentials.hpp:37] Loading credentials for authentication from
'/tmp/Endpoint_SlaveEndpointTest_NoAuthorizer_0_V3N04J/http_credentials'
I0427 13:22:00.354293 30673 http.cpp:975] Creating default 'basic' HTTP authenticator for
realm 'mesos-agent-readonly'
I0427 13:22:00.354434 30673 http.cpp:975] Creating default 'basic' HTTP authenticator for
realm 'mesos-agent-readwrite'
I0427 13:22:00.355639 30673 slave.cpp:525] Agent resources: cpus(*):2; mem(*):1024; disk(*):1024;
ports(*):[31000-32000]
I0427 13:22:00.355721 30673 slave.cpp:533] Agent attributes: [  ]
I0427 13:22:00.355734 30673 slave.cpp:538] Agent hostname: de5380ca50b2
I0427 13:22:00.355911 30679 status_update_manager.cpp:177] Pausing sending status updates
I0427 13:22:00.357020 30667 state.cpp:62] Recovering state from '/tmp/Endpoint_SlaveEndpointTest_NoAuthorizer_0_dFiyDO/meta'
I0427 13:22:00.357466 30672 status_update_manager.cpp:203] Recovering status update manager
I0427 13:22:00.357681 30677 containerizer.cpp:608] Recovering containerizer
I0427 13:22:00.359292 30672 provisioner.cpp:410] Provisioner recovery complete
I0427 13:22:00.359681 30674 slave.cpp:5963] Finished recovery
I0427 13:22:00.360270 30674 slave.cpp:6145] Querying resource estimator for oversubscribable
resources
I0427 13:22:00.360551 30676 slave.cpp:6159] Received oversubscribable resources {} from the
resource estimator
I0427 13:22:00.363025 30670 process.cpp:3731] Handling HTTP event for process 'slave(741)'
with path: '/slave(741)/monitor/statistics'
I0427 13:22:00.364552 30671 http.cpp:1115] HTTP GET for /slave(741)/monitor/statistics from
172.17.0.2:60633
I0427 13:22:00.364634 30671 http.cpp:936] Authorizing principal 'test-principal' to GET the
'/monitor/statistics' endpoint
I0427 13:22:00.368456 30678 slave.cpp:790] Agent terminating
[       OK ] Endpoint/SlaveEndpointTest.NoAuthorizer/0 (29 ms)
[ RUN      ] Endpoint/SlaveEndpointTest.NoAuthorizer/1
I0427 13:22:00.379814 30648 containerizer.cpp:221] Using isolation: posix/cpu,posix/mem,filesystem/posix,network/cni
W0427 13:22:00.380393 30648 backend.cpp:76] Failed to create 'aufs' backend: AufsBackend requires
root privileges
W0427 13:22:00.380506 30648 backend.cpp:76] Failed to create 'bind' backend: BindBackend requires
root privileges
I0427 13:22:00.380544 30648 provisioner.cpp:249] Using default backend 'copy'
I0427 13:22:00.382361 30648 cluster.cpp:448] Creating default 'local' authorizer
I0427 13:22:00.384248 30679 slave.cpp:225] Mesos agent started on (742)@172.17.0.2:57666
I0427 13:22:00.384276 30679 slave.cpp:226] Flags at startup: --acls="" --appc_simple_discovery_uri_prefix="http://"
--appc_store_dir="/tmp/mesos/store/appc" --authenticate_http_readonly="true" --authenticate_http_readwrite="true"
--authenticatee="crammd5" --authentication_backoff_factor="1secs" --authorizer="local" --cgroups_cpu_enable_pids_and_tids_count="false"
--cgroups_enable_cfs="false" --cgroups_hierarchy="/sys/fs/cgroup" --cgroups_limit_swap="false"
--cgroups_root="mesos" --container_disk_watch_interval="15secs" --containerizers="mesos" --credential="/tmp/Endpoint_SlaveEndpointTest_NoAuthorizer_1_f7Uf7r/credential"
--default_role="*" --disk_watch_interval="1mins" --docker="docker" --docker_kill_orphans="true"
--docker_registry="https://registry-1.docker.io" --docker_remove_delay="6hrs" --docker_socket="/var/run/docker.sock"
--docker_stop_timeout="0ns" --docker_store_dir="/tmp/mesos/store/docker" --docker_volume_checkpoint_dir="/var/run/mesos/isolators/docker/volume"
--enforce_container_disk_quota="false" --executor_registration_timeout="1mins" --executor_shutdown_grace_period="5secs"
--fetcher_cache_dir="/tmp/Endpoint_SlaveEndpointTest_NoAuthorizer_1_f7Uf7r/fetch" --fetcher_cache_size="2GB"
--frameworks_home="" --gc_delay="1weeks" --gc_disk_headroom="0.1" --hadoop_home="" --help="false"
--hostname_lookup="true" --http_command_executor="false" --http_credentials="/tmp/Endpoint_SlaveEndpointTest_NoAuthorizer_1_f7Uf7r/http_credentials"
--http_heartbeat_interval="30secs" --initialize_driver_logging="true" --isolation="posix/cpu,posix/mem"
--launcher="posix" --launcher_dir="/mesos/mesos-1.3.0/_build/src" --logbufsecs="0" --logging_level="INFO"
--max_completed_executors_per_framework="150" --oversubscribed_resources_interval="15secs"
--perf_duration="10secs" --perf_interval="1mins" --port="5051" --qos_correction_interval_min="0ns"
--quiet="false" --recover="reconnect" --recovery_timeout="15mins" --registration_backoff_factor="10ms"
--resources="cpus:2;gpus:0;mem:1024;disk:1024;ports:[31000-32000]" --revocable_cpu_low_priority="true"
--runtime_dir="/tmp/Endpoint_SlaveEndpointTest_NoAuthorizer_1_f7Uf7r" --sandbox_directory="/mnt/mesos/sandbox"
--strict="true" --switch_user="true" --systemd_enable_support="true" --systemd_runtime_directory="/run/systemd/system"
--version="false" --work_dir="/tmp/Endpoint_SlaveEndpointTest_NoAuthorizer_1_XnAVAw"
I0427 13:22:00.384726 30679 credentials.hpp:86] Loading credential for authentication from
'/tmp/Endpoint_SlaveEndpointTest_NoAuthorizer_1_f7Uf7r/credential'
I0427 13:22:00.384882 30679 slave.cpp:258] Agent using credential for: test-principal
I0427 13:22:00.384904 30679 credentials.hpp:37] Loading credentials for authentication from
'/tmp/Endpoint_SlaveEndpointTest_NoAuthorizer_1_f7Uf7r/http_credentials'
I0427 13:22:00.385113 30679 http.cpp:975] Creating default 'basic' HTTP authenticator for
realm 'mesos-agent-readonly'
I0427 13:22:00.385236 30679 http.cpp:975] Creating default 'basic' HTTP authenticator for
realm 'mesos-agent-readwrite'
I0427 13:22:00.386541 30679 slave.cpp:525] Agent resources: cpus(*):2; mem(*):1024; disk(*):1024;
ports(*):[31000-32000]
I0427 13:22:00.386651 30679 slave.cpp:533] Agent attributes: [  ]
I0427 13:22:00.386678 30679 slave.cpp:538] Agent hostname: de5380ca50b2
I0427 13:22:00.386867 30670 status_update_manager.cpp:177] Pausing sending status updates
I0427 13:22:00.388295 30669 state.cpp:62] Recovering state from '/tmp/Endpoint_SlaveEndpointTest_NoAuthorizer_1_XnAVAw/meta'
I0427 13:22:00.388950 30670 status_update_manager.cpp:203] Recovering status update manager
I0427 13:22:00.389214 30669 containerizer.cpp:608] Recovering containerizer
I0427 13:22:00.390981 30671 provisioner.cpp:410] Provisioner recovery complete
I0427 13:22:00.391335 30672 slave.cpp:5963] Finished recovery
I0427 13:22:00.392078 30672 slave.cpp:6145] Querying resource estimator for oversubscribable
resources
I0427 13:22:00.392428 30680 slave.cpp:6159] Received oversubscribable resources {} from the
resource estimator
I0427 13:22:00.395236 30669 process.cpp:3731] Handling HTTP event for process 'slave(742)'
with path: '/slave(742)/monitor/statistics.json'
I0427 13:22:00.396940 30667 http.cpp:1115] HTTP GET for /slave(742)/monitor/statistics.json
from 172.17.0.2:60635
I0427 13:22:00.397066 30667 http.cpp:936] Authorizing principal 'test-principal' to GET the
'/monitor/statistics.json' endpoint
I0427 13:22:00.401461 30668 slave.cpp:790] Agent terminating
[       OK ] Endpoint/SlaveEndpointTest.NoAuthorizer/1 (33 ms)
[ RUN      ] Endpoint/SlaveEndpointTest.NoAuthorizer/2
I0427 13:22:00.413318 30648 containerizer.cpp:221] Using isolation: posix/cpu,posix/mem,filesystem/posix,network/cni
W0427 13:22:00.413924 30648 backend.cpp:76] Failed to create 'aufs' backend: AufsBackend requires
root privileges
W0427 13:22:00.414052 30648 backend.cpp:76] Failed to create 'bind' backend: BindBackend requires
root privileges
I0427 13:22:00.414096 30648 provisioner.cpp:249] Using default backend 'copy'
I0427 13:22:00.415874 30648 cluster.cpp:448] Creating default 'local' authorizer
I0427 13:22:00.417824 30667 slave.cpp:225] Mesos agent started on (743)@172.17.0.2:57666
I0427 13:22:00.417858 30667 slave.cpp:226] Flags at startup: --acls="" --appc_simple_discovery_uri_prefix="http://"
--appc_store_dir="/tmp/mesos/store/appc" --authenticate_http_readonly="true" --authenticate_http_readwrite="true"
--authenticatee="crammd5" --authentication_backoff_factor="1secs" --authorizer="local" --cgroups_cpu_enable_pids_and_tids_count="false"
--cgroups_enable_cfs="false" --cgroups_hierarchy="/sys/fs/cgroup" --cgroups_limit_swap="false"
--cgroups_root="mesos" --container_disk_watch_interval="15secs" --containerizers="mesos" --credential="/tmp/Endpoint_SlaveEndpointTest_NoAuthorizer_2_r0CXua/credential"
--default_role="*" --disk_watch_interval="1mins" --docker="docker" --docker_kill_orphans="true"
--docker_registry="https://registry-1.docker.io" --docker_remove_delay="6hrs" --docker_socket="/var/run/docker.sock"
--docker_stop_timeout="0ns" --docker_store_dir="/tmp/mesos/store/docker" --docker_volume_checkpoint_dir="/var/run/mesos/isolators/docker/volume"
--enforce_container_disk_quota="false" --executor_registration_timeout="1mins" --executor_shutdown_grace_period="5secs"
--fetcher_cache_dir="/tmp/Endpoint_SlaveEndpointTest_NoAuthorizer_2_r0CXua/fetch" --fetcher_cache_size="2GB"
--frameworks_home="" --gc_delay="1weeks" --gc_disk_headroom="0.1" --hadoop_home="" --help="false"
--hostname_lookup="true" --http_command_executor="false" --http_credentials="/tmp/Endpoint_SlaveEndpointTest_NoAuthorizer_2_r0CXua/http_credentials"
--http_heartbeat_interval="30secs" --initialize_driver_logging="true" --isolation="posix/cpu,posix/mem"
--launcher="posix" --launcher_dir="/mesos/mesos-1.3.0/_build/src" --logbufsecs="0" --logging_level="INFO"
--max_completed_executors_per_framework="150" --oversubscribed_resources_interval="15secs"
--perf_duration="10secs" --perf_interval="1mins" --port="5051" --qos_correction_interval_min="0ns"
--quiet="false" --recover="reconnect" --recovery_timeout="15mins" --registration_backoff_factor="10ms"
--resources="cpus:2;gpus:0;mem:1024;disk:1024;ports:[31000-32000]" --revocable_cpu_low_priority="true"
--runtime_dir="/tmp/Endpoint_SlaveEndpointTest_NoAuthorizer_2_r0CXua" --sandbox_directory="/mnt/mesos/sandbox"
--strict="true" --switch_user="true" --systemd_enable_support="true" --systemd_runtime_directory="/run/systemd/system"
--version="false" --work_dir="/tmp/Endpoint_SlaveEndpointTest_NoAuthorizer_2_VrNbTe"
I0427 13:22:00.418323 30667 credentials.hpp:86] Loading credential for authentication from
'/tmp/Endpoint_SlaveEndpointTest_NoAuthorizer_2_r0CXua/credential'
I0427 13:22:00.418517 30667 slave.cpp:258] Agent using credential for: test-principal
I0427 13:22:00.418546 30667 credentials.hpp:37] Loading credentials for authentication from
'/tmp/Endpoint_SlaveEndpointTest_NoAuthorizer_2_r0CXua/http_credentials'
I0427 13:22:00.418895 30667 http.cpp:975] Creating default 'basic' HTTP authenticator for
realm 'mesos-agent-readonly'
I0427 13:22:00.419080 30667 http.cpp:975] Creating default 'basic' HTTP authenticator for
realm 'mesos-agent-readwrite'
I0427 13:22:00.421113 30667 slave.cpp:525] Agent resources: cpus(*):2; mem(*):1024; disk(*):1024;
ports(*):[31000-32000]
I0427 13:22:00.421221 30667 slave.cpp:533] Agent attributes: [  ]
I0427 13:22:00.421232 30667 slave.cpp:538] Agent hostname: de5380ca50b2
I0427 13:22:00.421388 30669 status_update_manager.cpp:177] Pausing sending status updates
I0427 13:22:00.422936 30682 state.cpp:62] Recovering state from '/tmp/Endpoint_SlaveEndpointTest_NoAuthorizer_2_VrNbTe/meta'
I0427 13:22:00.423326 30677 status_update_manager.cpp:203] Recovering status update manager
I0427 13:22:00.423604 30672 containerizer.cpp:608] Recovering containerizer
I0427 13:22:00.425381 30669 provisioner.cpp:410] Provisioner recovery complete
I0427 13:22:00.425793 30671 slave.cpp:5963] Finished recovery
I0427 13:22:00.426421 30671 slave.cpp:6145] Querying resource estimator for oversubscribable
resources
I0427 13:22:00.426726 30668 slave.cpp:6159] Received oversubscribable resources {} from the
resource estimator
I0427 13:22:00.429381 30681 process.cpp:3731] Handling HTTP event for process 'slave(743)'
with path: '/slave(743)/containers'
I0427 13:22:00.430832 30667 http.cpp:1115] HTTP GET for /slave(743)/containers from 172.17.0.2:60637
I0427 13:22:00.430913 30667 http.cpp:936] Authorizing principal 'test-principal' to GET the
'/containers' endpoint
I0427 13:22:00.435816 30680 slave.cpp:790] Agent terminating
[       OK ] Endpoint/SlaveEndpointTest.NoAuthorizer/2 (34 ms)
[----------] 9 tests from Endpoint/SlaveEndpointTest (279 ms total)

[----------] Global test environment tear-down
[==========] 1562 tests from 175 test cases ran. (458502 ms total)
[  PASSED  ] 1561 tests.
[  FAILED  ] 1 test, listed below:
[  FAILED  ] RegisterSlaveValidationTest.DropInvalidRegistration

 1 FAILED TEST
  YOU HAVE 19 DISABLED TESTS

E0427 13:22:00.498281 30683 process.cpp:951] Failed to accept socket: future discarded
make[4]: *** [check-local] Error 1
make[4]: Leaving directory `/mesos/mesos-1.3.0/_build/src'
make[3]: *** [check-am] Error 2
make[3]: Leaving directory `/mesos/mesos-1.3.0/_build/src'
make[2]: *** [check] Error 2
make[2]: Leaving directory `/mesos/mesos-1.3.0/_build/src'
make[1]: *** [check-recursive] Error 1
make[1]: Leaving directory `/mesos/mesos-1.3.0/_build'
make: *** [distcheck] Error 1
+ docker rmi mesos-1493296410-28561
Untagged: mesos-1493296410-28561:latest
Deleted: sha256:9e575efe5033408572a0e57fd4691ee801e97fd7d2e5674473667f81cb50b864
Deleted: sha256:ba015b3417568c78ae88d55ee26f830fcaa889e99357f1f8a8a9d589ce912198
Deleted: sha256:75c9f3ca5faf8d7300c8adc4caa1d51e91814e931827a8fee7dc2c36e03641ca
Deleted: sha256:6e7433f864efe477cf6a01024282703bd3339ddb5eb04e92a45c0a4e4a56d34f
Deleted: sha256:f3f75d76d0cf3cec8c7384dadc276860ed25f2d021a277c3614e99868fc9ef9c
Deleted: sha256:185d174d0716a057acdf727026a691f2394909d9b19c522a5bab1f4e0314d02b
Deleted: sha256:be5c6270f8c3b6218b8352f0c14f898c9c83c5f7ad685ebd7687fda46469de76
Deleted: sha256:8fc2497f90b45aa6fa55a69179bb99785cdf7cb7a4ff573c07426aedabb6002b
Deleted: sha256:01879d83f50d095eeffba0852be73cd079aee139770d7b21b44331f3912af0dd
Deleted: sha256:df15ef5afc99bf53ba97e1efd2a2f5dba979ad32dbc6c53c7a3379287fd37085
Deleted: sha256:bc64e54edf394e446dcf83dc19c4eca95f8eb8f81c22acb6f458dc9978f3eda3
Deleted: sha256:44800490803db5bd5fdfcfaa9b93c5b44e7af5df58e3ebe87e31ec10552399c0
Deleted: sha256:6fccd0a786c428634c38bb6383468093d6c9a4149b95afb45bf34d50aaf69e1e
Deleted: sha256:ae86d5a3411eb3af156ddfe54d71ff40ab71aa57b62fac91651ce2d406aa19f6
Deleted: sha256:b8b1a94e67b3280b1d5e33a7878ca036fd6f11a13f259f1e62434cb2586b3d09
Deleted: sha256:567f25ddb170dbcd9e61a00495df742a82d57b75b80797ee6aba6c96b65959ea
Deleted: sha256:973b7c60264ca18ae11ae3220dccfb02f68261c5b4f8e932582fc666f40294c8
Deleted: sha256:66394a49b83aef148ae5480a09ee49429a5bcbbc224b117da3d041c55a0b4970
Deleted: sha256:f263648b3541e461691e6ba21921da81dbb76574e49f1c3bde8825491b8826d2
Deleted: sha256:2a3720cfb14eb6b05f6a8873db824a03c32321d54ea2fecd365b372df9972ccf
Deleted: sha256:3939f9f2d2227d7145cd06c64b5397d72fa5d9e8f1ad5a9f3e3d3504c5cb728a
Deleted: sha256:cee4f9d41a790b30d4477f7d9a8a5f5b9cac1e20c5757f5b7e3743741dafa930
Deleted: sha256:16eea7287339db5c18932990e28a1384a82511f8a97b9393736260046f078b2c
Deleted: sha256:39782be03707fa6bc4f8cc2366b917e2d17b13d74f87c035e16f9af1e9f2b64c
Build step 'Execute shell' marked build as failure

Mime
View raw message