mesos-builds mailing list archives

Site index · List index
Message view « Date » · « Thread »
Top « Date » · « Thread »
From Apache Jenkins Server <jenk...@builds.apache.org>
Subject Build failed in Jenkins: Mesos-Buildbot » cmake,clang,--verbose --enable-libevent --enable-ssl,GLOG_v=1 MESOS_VERBOSE=1,ubuntu:14.04,(docker||Hadoop)&&(!ubuntu-us1)&&(!ubuntu-eu2) #3576
Date Thu, 27 Apr 2017 16:07:50 GMT
See <https://builds.apache.org/job/Mesos-Buildbot/BUILDTOOL=cmake,COMPILER=clang,CONFIGURATION=--verbose%20--enable-libevent%20--enable-ssl,ENVIRONMENT=GLOG_v=1%20MESOS_VERBOSE=1,OS=ubuntu%3A14.04,label_exp=(docker%7C%7CHadoop)&&(!ubuntu-us1)&&(!ubuntu-eu2)/3576/display/redirect?page=changes>

Changes:

[alexr] Removed unused variable from api tests.

------------------------------------------
[...truncated 26.10 MB...]
I0427 16:07:40.679008 31718 slave.cpp:6145] Querying resource estimator for oversubscribable
resources
I0427 16:07:40.679142 31704 slave.cpp:6159] Received oversubscribable resources {} from the
resource estimator
I0427 16:07:40.680663 31707 process.cpp:3731] Handling HTTP event for process 'slave(740)'
with path: '/slave(740)/containers'
I0427 16:07:40.681206 31705 http.cpp:1115] HTTP GET for /slave(740)/containers from 172.17.0.2:48571
I0427 16:07:40.681254 31705 http.cpp:936] Authorizing principal 'test-principal' to GET the
'/containers' endpoint
I0427 16:07:40.689587 25997 slave.cpp:790] Agent terminating
[       OK ] Endpoint/SlaveEndpointTest.AuthorizedRequest/2 (31 ms)
[ RUN      ] Endpoint/SlaveEndpointTest.UnauthorizedRequest/0
I0427 16:07:40.705731 25997 containerizer.cpp:221] Using isolation: posix/cpu,posix/mem,filesystem/posix,network/cni
W0427 16:07:40.706123 25997 backend.cpp:76] Failed to create 'aufs' backend: AufsBackend requires
root privileges
W0427 16:07:40.706233 25997 backend.cpp:76] Failed to create 'bind' backend: BindBackend requires
root privileges
I0427 16:07:40.706257 25997 provisioner.cpp:249] Using default backend 'copy'
I0427 16:07:40.707674 31710 slave.cpp:225] Mesos agent started on (741)@172.17.0.2:46469
I0427 16:07:40.707706 31710 slave.cpp:226] Flags at startup: --acls="" --appc_simple_discovery_uri_prefix="http://"
--appc_store_dir="/tmp/mesos/store/appc" --authenticate_http_executors="true" --authenticate_http_readonly="true"
--authenticate_http_readwrite="true" --authenticatee="crammd5" --authentication_backoff_factor="1secs"
--authorizer="local" --cgroups_cpu_enable_pids_and_tids_count="false" --cgroups_enable_cfs="false"
--cgroups_hierarchy="/sys/fs/cgroup" --cgroups_limit_swap="false" --cgroups_root="mesos" --container_disk_watch_interval="15secs"
--containerizers="mesos" --credential="/tmp/Endpoint_SlaveEndpointTest_UnauthorizedRequest_0_QYhYW0/credential"
--default_role="*" --disk_watch_interval="1mins" --docker="docker" --docker_kill_orphans="true"
--docker_registry="https://registry-1.docker.io" --docker_remove_delay="6hrs" --docker_socket="/var/run/docker.sock"
--docker_stop_timeout="0ns" --docker_store_dir="/tmp/mesos/store/docker" --docker_volume_checkpoint_dir="/var/run/mesos/isolators/docker/volume"
--enforce_container_disk_quota="false" --executor_registration_timeout="1mins" --executor_secret_key="/tmp/Endpoint_SlaveEndpointTest_UnauthorizedRequest_0_QYhYW0/executor_secret_key"
--executor_shutdown_grace_period="5secs" --fetcher_cache_dir="/tmp/Endpoint_SlaveEndpointTest_UnauthorizedRequest_0_QYhYW0/fetch"
--fetcher_cache_size="2GB" --frameworks_home="" --gc_delay="1weeks" --gc_disk_headroom="0.1"
--hadoop_home="" --help="false" --hostname_lookup="true" --http_command_executor="false" --http_credentials="/tmp/Endpoint_SlaveEndpointTest_UnauthorizedRequest_0_QYhYW0/http_credentials"
--http_heartbeat_interval="30secs" --initialize_driver_logging="true" --isolation="posix/cpu,posix/mem"
--launcher="posix" --launcher_dir="/mesos/build/src" --logbufsecs="0" --logging_level="INFO"
--max_completed_executors_per_framework="150" --oversubscribed_resources_interval="15secs"
--perf_duration="10secs" --perf_interval="1mins" --port="5051" --qos_correction_interval_min="0ns"
--quiet="false" --recover="reconnect" --recovery_timeout="15mins" --registration_backoff_factor="10ms"
--resources="cpus:2;gpus:0;mem:1024;disk:1024;ports:[31000-32000]" --revocable_cpu_low_priority="true"
--runtime_dir="/tmp/Endpoint_SlaveEndpointTest_UnauthorizedRequest_0_QYhYW0" --sandbox_directory="/mnt/mesos/sandbox"
--strict="true" --switch_user="true" --systemd_enable_support="true" --systemd_runtime_directory="/run/systemd/system"
--version="false" --work_dir="/tmp/Endpoint_SlaveEndpointTest_UnauthorizedRequest_0_B5RA8z"
I0427 16:07:40.707906 31710 credentials.hpp:86] Loading credential for authentication from
'/tmp/Endpoint_SlaveEndpointTest_UnauthorizedRequest_0_QYhYW0/credential'
I0427 16:07:40.708000 31710 slave.cpp:258] Agent using credential for: test-principal
I0427 16:07:40.708009 31710 credentials.hpp:37] Loading credentials for authentication from
'/tmp/Endpoint_SlaveEndpointTest_UnauthorizedRequest_0_QYhYW0/http_credentials'
I0427 16:07:40.708139 31710 http.cpp:975] Creating default 'basic' HTTP authenticator for
realm 'mesos-agent-executor'
I0427 16:07:40.708180 31710 http.cpp:996] Creating default 'jwt' HTTP authenticator for realm
'mesos-agent-executor'
I0427 16:07:40.708220 31710 http.cpp:975] Creating default 'basic' HTTP authenticator for
realm 'mesos-agent-readonly'
I0427 16:07:40.708235 31710 http.cpp:996] Creating default 'jwt' HTTP authenticator for realm
'mesos-agent-readonly'
I0427 16:07:40.708256 31710 http.cpp:975] Creating default 'basic' HTTP authenticator for
realm 'mesos-agent-readwrite'
I0427 16:07:40.708269 31710 http.cpp:996] Creating default 'jwt' HTTP authenticator for realm
'mesos-agent-readwrite'
I0427 16:07:40.708595 31710 slave.cpp:525] Agent resources: cpus(*):2; mem(*):1024; disk(*):1024;
ports(*):[31000-32000]
I0427 16:07:40.708623 31710 slave.cpp:533] Agent attributes: [  ]
I0427 16:07:40.708628 31710 slave.cpp:538] Agent hostname: b3f87a15ae7d
I0427 16:07:40.708770 31713 status_update_manager.cpp:177] Pausing sending status updates
I0427 16:07:40.709074 31710 state.cpp:62] Recovering state from '/tmp/Endpoint_SlaveEndpointTest_UnauthorizedRequest_0_B5RA8z/meta'
I0427 16:07:40.709241 31710 status_update_manager.cpp:203] Recovering status update manager
I0427 16:07:40.709358 31703 containerizer.cpp:608] Recovering containerizer
I0427 16:07:40.710023 31703 provisioner.cpp:410] Provisioner recovery complete
I0427 16:07:40.710227 31703 slave.cpp:5963] Finished recovery
I0427 16:07:40.710747 31703 slave.cpp:6145] Querying resource estimator for oversubscribable
resources
I0427 16:07:40.710855 31704 slave.cpp:6159] Received oversubscribable resources {} from the
resource estimator
I0427 16:07:40.711869 31718 process.cpp:3731] Handling HTTP event for process 'slave(741)'
with path: '/slave(741)/monitor/statistics'
I0427 16:07:40.712554 31716 http.cpp:1115] HTTP GET for /slave(741)/monitor/statistics from
172.17.0.2:48572
I0427 16:07:40.712610 31716 http.cpp:936] Authorizing principal 'test-principal' to GET the
'/monitor/statistics' endpoint
I0427 16:07:40.713760 31703 slave.cpp:790] Agent terminating
[       OK ] Endpoint/SlaveEndpointTest.UnauthorizedRequest/0 (13 ms)
[ RUN      ] Endpoint/SlaveEndpointTest.UnauthorizedRequest/1
I0427 16:07:40.727022 25997 containerizer.cpp:221] Using isolation: posix/cpu,posix/mem,filesystem/posix,network/cni
W0427 16:07:40.727304 25997 backend.cpp:76] Failed to create 'aufs' backend: AufsBackend requires
root privileges
W0427 16:07:40.727347 25997 backend.cpp:76] Failed to create 'bind' backend: BindBackend requires
root privileges
I0427 16:07:40.727361 25997 provisioner.cpp:249] Using default backend 'copy'
I0427 16:07:40.728608 31709 slave.cpp:225] Mesos agent started on (742)@172.17.0.2:46469
I0427 16:07:40.728638 31709 slave.cpp:226] Flags at startup: --acls="" --appc_simple_discovery_uri_prefix="http://"
--appc_store_dir="/tmp/mesos/store/appc" --authenticate_http_executors="true" --authenticate_http_readonly="true"
--authenticate_http_readwrite="true" --authenticatee="crammd5" --authentication_backoff_factor="1secs"
--authorizer="local" --cgroups_cpu_enable_pids_and_tids_count="false" --cgroups_enable_cfs="false"
--cgroups_hierarchy="/sys/fs/cgroup" --cgroups_limit_swap="false" --cgroups_root="mesos" --container_disk_watch_interval="15secs"
--containerizers="mesos" --credential="/tmp/Endpoint_SlaveEndpointTest_UnauthorizedRequest_1_wxs0nK/credential"
--default_role="*" --disk_watch_interval="1mins" --docker="docker" --docker_kill_orphans="true"
--docker_registry="https://registry-1.docker.io" --docker_remove_delay="6hrs" --docker_socket="/var/run/docker.sock"
--docker_stop_timeout="0ns" --docker_store_dir="/tmp/mesos/store/docker" --docker_volume_checkpoint_dir="/var/run/mesos/isolators/docker/volume"
--enforce_container_disk_quota="false" --executor_registration_timeout="1mins" --executor_secret_key="/tmp/Endpoint_SlaveEndpointTest_UnauthorizedRequest_1_wxs0nK/executor_secret_key"
--executor_shutdown_grace_period="5secs" --fetcher_cache_dir="/tmp/Endpoint_SlaveEndpointTest_UnauthorizedRequest_1_wxs0nK/fetch"
--fetcher_cache_size="2GB" --frameworks_home="" --gc_delay="1weeks" --gc_disk_headroom="0.1"
--hadoop_home="" --help="false" --hostname_lookup="true" --http_command_executor="false" --http_credentials="/tmp/Endpoint_SlaveEndpointTest_UnauthorizedRequest_1_wxs0nK/http_credentials"
--http_heartbeat_interval="30secs" --initialize_driver_logging="true" --isolation="posix/cpu,posix/mem"
--launcher="posix" --launcher_dir="/mesos/build/src" --logbufsecs="0" --logging_level="INFO"
--max_completed_executors_per_framework="150" --oversubscribed_resources_interval="15secs"
--perf_duration="10secs" --perf_interval="1mins" --port="5051" --qos_correction_interval_min="0ns"
--quiet="false" --recover="reconnect" --recovery_timeout="15mins" --registration_backoff_factor="10ms"
--resources="cpus:2;gpus:0;mem:1024;disk:1024;ports:[31000-32000]" --revocable_cpu_low_priority="true"
--runtime_dir="/tmp/Endpoint_SlaveEndpointTest_UnauthorizedRequest_1_wxs0nK" --sandbox_directory="/mnt/mesos/sandbox"
--strict="true" --switch_user="true" --systemd_enable_support="true" --systemd_runtime_directory="/run/systemd/system"
--version="false" --work_dir="/tmp/Endpoint_SlaveEndpointTest_UnauthorizedRequest_1_VHh5vj"
I0427 16:07:40.728868 31709 credentials.hpp:86] Loading credential for authentication from
'/tmp/Endpoint_SlaveEndpointTest_UnauthorizedRequest_1_wxs0nK/credential'
I0427 16:07:40.728988 31709 slave.cpp:258] Agent using credential for: test-principal
I0427 16:07:40.729004 31709 credentials.hpp:37] Loading credentials for authentication from
'/tmp/Endpoint_SlaveEndpointTest_UnauthorizedRequest_1_wxs0nK/http_credentials'
I0427 16:07:40.729171 31709 http.cpp:975] Creating default 'basic' HTTP authenticator for
realm 'mesos-agent-executor'
I0427 16:07:40.729216 31709 http.cpp:996] Creating default 'jwt' HTTP authenticator for realm
'mesos-agent-executor'
I0427 16:07:40.729271 31709 http.cpp:975] Creating default 'basic' HTTP authenticator for
realm 'mesos-agent-readonly'
I0427 16:07:40.729303 31709 http.cpp:996] Creating default 'jwt' HTTP authenticator for realm
'mesos-agent-readonly'
I0427 16:07:40.729344 31709 http.cpp:975] Creating default 'basic' HTTP authenticator for
realm 'mesos-agent-readwrite'
I0427 16:07:40.729373 31709 http.cpp:996] Creating default 'jwt' HTTP authenticator for realm
'mesos-agent-readwrite'
I0427 16:07:40.729862 31709 slave.cpp:525] Agent resources: cpus(*):2; mem(*):1024; disk(*):1024;
ports(*):[31000-32000]
I0427 16:07:40.729912 31709 slave.cpp:533] Agent attributes: [  ]
I0427 16:07:40.729923 31709 slave.cpp:538] Agent hostname: b3f87a15ae7d
I0427 16:07:40.732571 31716 status_update_manager.cpp:177] Pausing sending status updates
I0427 16:07:40.732962 31704 state.cpp:62] Recovering state from '/tmp/Endpoint_SlaveEndpointTest_UnauthorizedRequest_1_VHh5vj/meta'
I0427 16:07:40.733167 31704 status_update_manager.cpp:203] Recovering status update manager
I0427 16:07:40.733239 31704 containerizer.cpp:608] Recovering containerizer
I0427 16:07:40.733846 31704 provisioner.cpp:410] Provisioner recovery complete
I0427 16:07:40.734025 31704 slave.cpp:5963] Finished recovery
I0427 16:07:40.734483 31704 slave.cpp:6145] Querying resource estimator for oversubscribable
resources
I0427 16:07:40.734566 31713 slave.cpp:6159] Received oversubscribable resources {} from the
resource estimator
I0427 16:07:40.738723 31708 process.cpp:3731] Handling HTTP event for process 'slave(742)'
with path: '/slave(742)/monitor/statistics.json'
I0427 16:07:40.739370 31708 http.cpp:1115] HTTP GET for /slave(742)/monitor/statistics.json
from 172.17.0.2:48573
I0427 16:07:40.739424 31708 http.cpp:936] Authorizing principal 'test-principal' to GET the
'/monitor/statistics.json' endpoint
I0427 16:07:40.740528 31718 slave.cpp:790] Agent terminating
[       OK ] Endpoint/SlaveEndpointTest.UnauthorizedRequest/1 (19 ms)
[ RUN      ] Endpoint/SlaveEndpointTest.UnauthorizedRequest/2
I0427 16:07:40.760215 25997 containerizer.cpp:221] Using isolation: posix/cpu,posix/mem,filesystem/posix,network/cni
W0427 16:07:40.760740 25997 backend.cpp:76] Failed to create 'aufs' backend: AufsBackend requires
root privileges
W0427 16:07:40.760836 25997 backend.cpp:76] Failed to create 'bind' backend: BindBackend requires
root privileges
I0427 16:07:40.760896 25997 provisioner.cpp:249] Using default backend 'copy'
I0427 16:07:40.768421 31704 slave.cpp:225] Mesos agent started on (743)@172.17.0.2:46469
I0427 16:07:40.768482 31704 slave.cpp:226] Flags at startup: --acls="" --appc_simple_discovery_uri_prefix="http://"
--appc_store_dir="/tmp/mesos/store/appc" --authenticate_http_executors="true" --authenticate_http_readonly="true"
--authenticate_http_readwrite="true" --authenticatee="crammd5" --authentication_backoff_factor="1secs"
--authorizer="local" --cgroups_cpu_enable_pids_and_tids_count="false" --cgroups_enable_cfs="false"
--cgroups_hierarchy="/sys/fs/cgroup" --cgroups_limit_swap="false" --cgroups_root="mesos" --container_disk_watch_interval="15secs"
--containerizers="mesos" --credential="/tmp/Endpoint_SlaveEndpointTest_UnauthorizedRequest_2_ubTU7t/credential"
--default_role="*" --disk_watch_interval="1mins" --docker="docker" --docker_kill_orphans="true"
--docker_registry="https://registry-1.docker.io" --docker_remove_delay="6hrs" --docker_socket="/var/run/docker.sock"
--docker_stop_timeout="0ns" --docker_store_dir="/tmp/mesos/store/docker" --docker_volume_checkpoint_dir="/var/run/mesos/isolators/docker/volume"
--enforce_container_disk_quota="false" --executor_registration_timeout="1mins" --executor_secret_key="/tmp/Endpoint_SlaveEndpointTest_UnauthorizedRequest_2_ubTU7t/executor_secret_key"
--executor_shutdown_grace_period="5secs" --fetcher_cache_dir="/tmp/Endpoint_SlaveEndpointTest_UnauthorizedRequest_2_ubTU7t/fetch"
--fetcher_cache_size="2GB" --frameworks_home="" --gc_delay="1weeks" --gc_disk_headroom="0.1"
--hadoop_home="" --help="false" --hostname_lookup="true" --http_command_executor="false" --http_credentials="/tmp/Endpoint_SlaveEndpointTest_UnauthorizedRequest_2_ubTU7t/http_credentials"
--http_heartbeat_interval="30secs" --initialize_driver_logging="true" --isolation="posix/cpu,posix/mem"
--launcher="posix" --launcher_dir="/mesos/build/src" --logbufsecs="0" --logging_level="INFO"
--max_completed_executors_per_framework="150" --oversubscribed_resources_interval="15secs"
--perf_duration="10secs" --perf_interval="1mins" --port="5051" --qos_correction_interval_min="0ns"
--quiet="false" --recover="reconnect" --recovery_timeout="15mins" --registration_backoff_factor="10ms"
--resources="cpus:2;gpus:0;mem:1024;disk:1024;ports:[31000-32000]" --revocable_cpu_low_priority="true"
--runtime_dir="/tmp/Endpoint_SlaveEndpointTest_UnauthorizedRequest_2_ubTU7t" --sandbox_directory="/mnt/mesos/sandbox"
--strict="true" --switch_user="true" --systemd_enable_support="true" --systemd_runtime_directory="/run/systemd/system"
--version="false" --work_dir="/tmp/Endpoint_SlaveEndpointTest_UnauthorizedRequest_2_7JxXa3"
I0427 16:07:40.768858 31704 credentials.hpp:86] Loading credential for authentication from
'/tmp/Endpoint_SlaveEndpointTest_UnauthorizedRequest_2_ubTU7t/credential'
I0427 16:07:40.769059 31704 slave.cpp:258] Agent using credential for: test-principal
I0427 16:07:40.769156 31704 credentials.hpp:37] Loading credentials for authentication from
'/tmp/Endpoint_SlaveEndpointTest_UnauthorizedRequest_2_ubTU7t/http_credentials'
I0427 16:07:40.769528 31704 http.cpp:975] Creating default 'basic' HTTP authenticator for
realm 'mesos-agent-executor'
I0427 16:07:40.769732 31704 http.cpp:996] Creating default 'jwt' HTTP authenticator for realm
'mesos-agent-executor'
I0427 16:07:40.770004 31704 http.cpp:975] Creating default 'basic' HTTP authenticator for
realm 'mesos-agent-readonly'
I0427 16:07:40.770155 31704 http.cpp:996] Creating default 'jwt' HTTP authenticator for realm
'mesos-agent-readonly'
I0427 16:07:40.770438 31704 http.cpp:975] Creating default 'basic' HTTP authenticator for
realm 'mesos-agent-readwrite'
I0427 16:07:40.770611 31704 http.cpp:996] Creating default 'jwt' HTTP authenticator for realm
'mesos-agent-readwrite'
I0427 16:07:40.771895 31704 slave.cpp:525] Agent resources: cpus(*):2; mem(*):1024; disk(*):1024;
ports(*):[31000-32000]
I0427 16:07:40.772714 31704 slave.cpp:533] Agent attributes: [  ]
I0427 16:07:40.773181 31704 slave.cpp:538] Agent hostname: b3f87a15ae7d
I0427 16:07:40.774029 31704 status_update_manager.cpp:177] Pausing sending status updates
I0427 16:07:40.774575 31718 state.cpp:62] Recovering state from '/tmp/Endpoint_SlaveEndpointTest_UnauthorizedRequest_2_7JxXa3/meta'
I0427 16:07:40.775177 31718 status_update_manager.cpp:203] Recovering status update manager
I0427 16:07:40.775260 31718 containerizer.cpp:608] Recovering containerizer
I0427 16:07:40.775822 31713 provisioner.cpp:410] Provisioner recovery complete
I0427 16:07:40.776082 31709 slave.cpp:5963] Finished recovery
I0427 16:07:40.776577 31709 slave.cpp:6145] Querying resource estimator for oversubscribable
resources
I0427 16:07:40.776768 31709 slave.cpp:6159] Received oversubscribable resources {} from the
resource estimator
I0427 16:07:40.782738 31709 process.cpp:3731] Handling HTTP event for process 'slave(743)'
with path: '/slave(743)/containers'
I0427 16:07:40.783393 31713 http.cpp:1115] HTTP GET for /slave(743)/containers from 172.17.0.2:48574
I0427 16:07:40.783448 31713 http.cpp:936] Authorizing principal 'test-principal' to GET the
'/containers' endpoint
I0427 16:07:40.787533 25997 slave.cpp:790] Agent terminating
[       OK ] Endpoint/SlaveEndpointTest.UnauthorizedRequest/2 (85 ms)
[ RUN      ] Endpoint/SlaveEndpointTest.NoAuthorizer/0
I0427 16:07:40.843791 25997 containerizer.cpp:221] Using isolation: posix/cpu,posix/mem,filesystem/posix,network/cni
W0427 16:07:40.844130 25997 backend.cpp:76] Failed to create 'aufs' backend: AufsBackend requires
root privileges
W0427 16:07:40.844169 25997 backend.cpp:76] Failed to create 'bind' backend: BindBackend requires
root privileges
I0427 16:07:40.844184 25997 provisioner.cpp:249] Using default backend 'copy'
I0427 16:07:40.844684 25997 cluster.cpp:448] Creating default 'local' authorizer
I0427 16:07:40.845372 31707 slave.cpp:225] Mesos agent started on (744)@172.17.0.2:46469
I0427 16:07:40.845398 31707 slave.cpp:226] Flags at startup: --acls="" --appc_simple_discovery_uri_prefix="http://"
--appc_store_dir="/tmp/mesos/store/appc" --authenticate_http_executors="true" --authenticate_http_readonly="true"
--authenticate_http_readwrite="true" --authenticatee="crammd5" --authentication_backoff_factor="1secs"
--authorizer="local" --cgroups_cpu_enable_pids_and_tids_count="false" --cgroups_enable_cfs="false"
--cgroups_hierarchy="/sys/fs/cgroup" --cgroups_limit_swap="false" --cgroups_root="mesos" --container_disk_watch_interval="15secs"
--containerizers="mesos" --credential="/tmp/Endpoint_SlaveEndpointTest_NoAuthorizer_0_2zQmEe/credential"
--default_role="*" --disk_watch_interval="1mins" --docker="docker" --docker_kill_orphans="true"
--docker_registry="https://registry-1.docker.io" --docker_remove_delay="6hrs" --docker_socket="/var/run/docker.sock"
--docker_stop_timeout="0ns" --docker_store_dir="/tmp/mesos/store/docker" --docker_volume_checkpoint_dir="/var/run/mesos/isolators/docker/volume"
--enforce_container_disk_quota="false" --executor_registration_timeout="1mins" --executor_secret_key="/tmp/Endpoint_SlaveEndpointTest_NoAuthorizer_0_2zQmEe/executor_secret_key"
--executor_shutdown_grace_period="5secs" --fetcher_cache_dir="/tmp/Endpoint_SlaveEndpointTest_NoAuthorizer_0_2zQmEe/fetch"
--fetcher_cache_size="2GB" --frameworks_home="" --gc_delay="1weeks" --gc_disk_headroom="0.1"
--hadoop_home="" --help="false" --hostname_lookup="true" --http_command_executor="false" --http_credentials="/tmp/Endpoint_SlaveEndpointTest_NoAuthorizer_0_2zQmEe/http_credentials"
--http_heartbeat_interval="30secs" --initialize_driver_logging="true" --isolation="posix/cpu,posix/mem"
--launcher="posix" --launcher_dir="/mesos/build/src" --logbufsecs="0" --logging_level="INFO"
--max_completed_executors_per_framework="150" --oversubscribed_resources_interval="15secs"
--perf_duration="10secs" --perf_interval="1mins" --port="5051" --qos_correction_interval_min="0ns"
--quiet="false" --recover="reconnect" --recovery_timeout="15mins" --registration_backoff_factor="10ms"
--resources="cpus:2;gpus:0;mem:1024;disk:1024;ports:[31000-32000]" --revocable_cpu_low_priority="true"
--runtime_dir="/tmp/Endpoint_SlaveEndpointTest_NoAuthorizer_0_2zQmEe" --sandbox_directory="/mnt/mesos/sandbox"
--strict="true" --switch_user="true" --systemd_enable_support="true" --systemd_runtime_directory="/run/systemd/system"
--version="false" --work_dir="/tmp/Endpoint_SlaveEndpointTest_NoAuthorizer_0_PS1wtN"
I0427 16:07:40.845604 31707 credentials.hpp:86] Loading credential for authentication from
'/tmp/Endpoint_SlaveEndpointTest_NoAuthorizer_0_2zQmEe/credential'
I0427 16:07:40.845703 31707 slave.cpp:258] Agent using credential for: test-principal
I0427 16:07:40.845717 31707 credentials.hpp:37] Loading credentials for authentication from
'/tmp/Endpoint_SlaveEndpointTest_NoAuthorizer_0_2zQmEe/http_credentials'
I0427 16:07:40.845857 31707 http.cpp:975] Creating default 'basic' HTTP authenticator for
realm 'mesos-agent-executor'
I0427 16:07:40.845899 31707 http.cpp:996] Creating default 'jwt' HTTP authenticator for realm
'mesos-agent-executor'
I0427 16:07:40.845952 31707 http.cpp:975] Creating default 'basic' HTTP authenticator for
realm 'mesos-agent-readonly'
I0427 16:07:40.845974 31707 http.cpp:996] Creating default 'jwt' HTTP authenticator for realm
'mesos-agent-readonly'
I0427 16:07:40.846006 31707 http.cpp:975] Creating default 'basic' HTTP authenticator for
realm 'mesos-agent-readwrite'
I0427 16:07:40.846027 31707 http.cpp:996] Creating default 'jwt' HTTP authenticator for realm
'mesos-agent-readwrite'
I0427 16:07:40.846563 31707 slave.cpp:525] Agent resources: cpus(*):2; mem(*):1024; disk(*):1024;
ports(*):[31000-32000]
I0427 16:07:40.846606 31707 slave.cpp:533] Agent attributes: [  ]
I0427 16:07:40.846612 31707 slave.cpp:538] Agent hostname: b3f87a15ae7d
I0427 16:07:40.846792 31703 status_update_manager.cpp:177] Pausing sending status updates
I0427 16:07:40.848227 31707 state.cpp:62] Recovering state from '/tmp/Endpoint_SlaveEndpointTest_NoAuthorizer_0_PS1wtN/meta'
I0427 16:07:40.848378 31707 status_update_manager.cpp:203] Recovering status update manager
I0427 16:07:40.848434 31707 containerizer.cpp:608] Recovering containerizer
I0427 16:07:40.848922 31707 provisioner.cpp:410] Provisioner recovery complete
I0427 16:07:40.849052 31707 slave.cpp:5963] Finished recovery
I0427 16:07:40.849457 31707 slave.cpp:6145] Querying resource estimator for oversubscribable
resources
I0427 16:07:40.849614 31707 slave.cpp:6159] Received oversubscribable resources {} from the
resource estimator
I0427 16:07:40.855490 31718 process.cpp:3731] Handling HTTP event for process 'slave(744)'
with path: '/slave(744)/monitor/statistics'
I0427 16:07:40.856112 31718 http.cpp:1115] HTTP GET for /slave(744)/monitor/statistics from
172.17.0.2:48575
I0427 16:07:40.856168 31718 http.cpp:936] Authorizing principal 'test-principal' to GET the
'/monitor/statistics' endpoint
I0427 16:07:40.865224 25997 slave.cpp:790] Agent terminating
[       OK ] Endpoint/SlaveEndpointTest.NoAuthorizer/0 (31 ms)
[ RUN      ] Endpoint/SlaveEndpointTest.NoAuthorizer/1
I0427 16:07:40.874809 25997 containerizer.cpp:221] Using isolation: posix/cpu,posix/mem,filesystem/posix,network/cni
W0427 16:07:40.875073 25997 backend.cpp:76] Failed to create 'aufs' backend: AufsBackend requires
root privileges
W0427 16:07:40.875113 25997 backend.cpp:76] Failed to create 'bind' backend: BindBackend requires
root privileges
I0427 16:07:40.875131 25997 provisioner.cpp:249] Using default backend 'copy'
I0427 16:07:40.875702 25997 cluster.cpp:448] Creating default 'local' authorizer
I0427 16:07:40.876169 31704 slave.cpp:225] Mesos agent started on (745)@172.17.0.2:46469
I0427 16:07:40.876199 31704 slave.cpp:226] Flags at startup: --acls="" --appc_simple_discovery_uri_prefix="http://"
--appc_store_dir="/tmp/mesos/store/appc" --authenticate_http_executors="true" --authenticate_http_readonly="true"
--authenticate_http_readwrite="true" --authenticatee="crammd5" --authentication_backoff_factor="1secs"
--authorizer="local" --cgroups_cpu_enable_pids_and_tids_count="false" --cgroups_enable_cfs="false"
--cgroups_hierarchy="/sys/fs/cgroup" --cgroups_limit_swap="false" --cgroups_root="mesos" --container_disk_watch_interval="15secs"
--containerizers="mesos" --credential="/tmp/Endpoint_SlaveEndpointTest_NoAuthorizer_1_0nWYBZ/credential"
--default_role="*" --disk_watch_interval="1mins" --docker="docker" --docker_kill_orphans="true"
--docker_registry="https://registry-1.docker.io" --docker_remove_delay="6hrs" --docker_socket="/var/run/docker.sock"
--docker_stop_timeout="0ns" --docker_store_dir="/tmp/mesos/store/docker" --docker_volume_checkpoint_dir="/var/run/mesos/isolators/docker/volume"
--enforce_container_disk_quota="false" --executor_registration_timeout="1mins" --executor_secret_key="/tmp/Endpoint_SlaveEndpointTest_NoAuthorizer_1_0nWYBZ/executor_secret_key"
--executor_shutdown_grace_period="5secs" --fetcher_cache_dir="/tmp/Endpoint_SlaveEndpointTest_NoAuthorizer_1_0nWYBZ/fetch"
--fetcher_cache_size="2GB" --frameworks_home="" --gc_delay="1weeks" --gc_disk_headroom="0.1"
--hadoop_home="" --help="false" --hostname_lookup="true" --http_command_executor="false" --http_credentials="/tmp/Endpoint_SlaveEndpointTest_NoAuthorizer_1_0nWYBZ/http_credentials"
--http_heartbeat_interval="30secs" --initialize_driver_logging="true" --isolation="posix/cpu,posix/mem"
--launcher="posix" --launcher_dir="/mesos/build/src" --logbufsecs="0" --logging_level="INFO"
--max_completed_executors_per_framework="150" --oversubscribed_resources_interval="15secs"
--perf_duration="10secs" --perf_interval="1mins" --port="5051" --qos_correction_interval_min="0ns"
--quiet="false" --recover="reconnect" --recovery_timeout="15mins" --registration_backoff_factor="10ms"
--resources="cpus:2;gpus:0;mem:1024;disk:1024;ports:[31000-32000]" --revocable_cpu_low_priority="true"
--runtime_dir="/tmp/Endpoint_SlaveEndpointTest_NoAuthorizer_1_0nWYBZ" --sandbox_directory="/mnt/mesos/sandbox"
--strict="true" --switch_user="true" --systemd_enable_support="true" --systemd_runtime_directory="/run/systemd/system"
--version="false" --work_dir="/tmp/Endpoint_SlaveEndpointTest_NoAuthorizer_1_Duv3ly"
I0427 16:07:40.876484 31704 credentials.hpp:86] Loading credential for authentication from
'/tmp/Endpoint_SlaveEndpointTest_NoAuthorizer_1_0nWYBZ/credential'
I0427 16:07:40.876595 31704 slave.cpp:258] Agent using credential for: test-principal
I0427 16:07:40.876610 31704 credentials.hpp:37] Loading credentials for authentication from
'/tmp/Endpoint_SlaveEndpointTest_NoAuthorizer_1_0nWYBZ/http_credentials'
I0427 16:07:40.876763 31704 http.cpp:975] Creating default 'basic' HTTP authenticator for
realm 'mesos-agent-executor'
I0427 16:07:40.876804 31704 http.cpp:996] Creating default 'jwt' HTTP authenticator for realm
'mesos-agent-executor'
I0427 16:07:40.876937 31704 http.cpp:975] Creating default 'basic' HTTP authenticator for
realm 'mesos-agent-readonly'
I0427 16:07:40.877001 31704 http.cpp:996] Creating default 'jwt' HTTP authenticator for realm
'mesos-agent-readonly'
I0427 16:07:40.877218 31704 http.cpp:975] Creating default 'basic' HTTP authenticator for
realm 'mesos-agent-readwrite'
I0427 16:07:40.877265 31704 http.cpp:996] Creating default 'jwt' HTTP authenticator for realm
'mesos-agent-readwrite'
I0427 16:07:40.877652 31704 slave.cpp:525] Agent resources: cpus(*):2; mem(*):1024; disk(*):1024;
ports(*):[31000-32000]
I0427 16:07:40.877682 31704 slave.cpp:533] Agent attributes: [  ]
I0427 16:07:40.877687 31704 slave.cpp:538] Agent hostname: b3f87a15ae7d
I0427 16:07:40.877758 31716 status_update_manager.cpp:177] Pausing sending status updates
I0427 16:07:40.878165 31717 state.cpp:62] Recovering state from '/tmp/Endpoint_SlaveEndpointTest_NoAuthorizer_1_Duv3ly/meta'
I0427 16:07:40.878525 31706 status_update_manager.cpp:203] Recovering status update manager
I0427 16:07:40.878617 31703 containerizer.cpp:608] Recovering containerizer
I0427 16:07:40.879179 31717 provisioner.cpp:410] Provisioner recovery complete
I0427 16:07:40.879436 31717 slave.cpp:5963] Finished recovery
I0427 16:07:40.879843 31717 slave.cpp:6145] Querying resource estimator for oversubscribable
resources
I0427 16:07:40.879956 31711 slave.cpp:6159] Received oversubscribable resources {} from the
resource estimator
I0427 16:07:40.880859 31715 process.cpp:3731] Handling HTTP event for process 'slave(745)'
with path: '/slave(745)/monitor/statistics.json'
I0427 16:07:40.881415 31709 http.cpp:1115] HTTP GET for /slave(745)/monitor/statistics.json
from 172.17.0.2:48576
I0427 16:07:40.881451 31709 http.cpp:936] Authorizing principal 'test-principal' to GET the
'/monitor/statistics.json' endpoint
I0427 16:07:40.882967 31716 slave.cpp:790] Agent terminating
[       OK ] Endpoint/SlaveEndpointTest.NoAuthorizer/1 (13 ms)
[ RUN      ] Endpoint/SlaveEndpointTest.NoAuthorizer/2
I0427 16:07:40.900267 25997 containerizer.cpp:221] Using isolation: posix/cpu,posix/mem,filesystem/posix,network/cni
W0427 16:07:40.900671 25997 backend.cpp:76] Failed to create 'aufs' backend: AufsBackend requires
root privileges
W0427 16:07:40.900804 25997 backend.cpp:76] Failed to create 'bind' backend: BindBackend requires
root privileges
I0427 16:07:40.900825 25997 provisioner.cpp:249] Using default backend 'copy'
I0427 16:07:40.902253 25997 cluster.cpp:448] Creating default 'local' authorizer
I0427 16:07:40.907462 31715 slave.cpp:225] Mesos agent started on (746)@172.17.0.2:46469
I0427 16:07:40.907506 31715 slave.cpp:226] Flags at startup: --acls="" --appc_simple_discovery_uri_prefix="http://"
--appc_store_dir="/tmp/mesos/store/appc" --authenticate_http_executors="true" --authenticate_http_readonly="true"
--authenticate_http_readwrite="true" --authenticatee="crammd5" --authentication_backoff_factor="1secs"
--authorizer="local" --cgroups_cpu_enable_pids_and_tids_count="false" --cgroups_enable_cfs="false"
--cgroups_hierarchy="/sys/fs/cgroup" --cgroups_limit_swap="false" --cgroups_root="mesos" --container_disk_watch_interval="15secs"
--containerizers="mesos" --credential="/tmp/Endpoint_SlaveEndpointTest_NoAuthorizer_2_gw7dQK/credential"
--default_role="*" --disk_watch_interval="1mins" --docker="docker" --docker_kill_orphans="true"
--docker_registry="https://registry-1.docker.io" --docker_remove_delay="6hrs" --docker_socket="/var/run/docker.sock"
--docker_stop_timeout="0ns" --docker_store_dir="/tmp/mesos/store/docker" --docker_volume_checkpoint_dir="/var/run/mesos/isolators/docker/volume"
--enforce_container_disk_quota="false" --executor_registration_timeout="1mins" --executor_secret_key="/tmp/Endpoint_SlaveEndpointTest_NoAuthorizer_2_gw7dQK/executor_secret_key"
--executor_shutdown_grace_period="5secs" --fetcher_cache_dir="/tmp/Endpoint_SlaveEndpointTest_NoAuthorizer_2_gw7dQK/fetch"
--fetcher_cache_size="2GB" --frameworks_home="" --gc_delay="1weeks" --gc_disk_headroom="0.1"
--hadoop_home="" --help="false" --hostname_lookup="true" --http_command_executor="false" --http_credentials="/tmp/Endpoint_SlaveEndpointTest_NoAuthorizer_2_gw7dQK/http_credentials"
--http_heartbeat_interval="30secs" --initialize_driver_logging="true" --isolation="posix/cpu,posix/mem"
--launcher="posix" --launcher_dir="/mesos/build/src" --logbufsecs="0" --logging_level="INFO"
--max_completed_executors_per_framework="150" --oversubscribed_resources_interval="15secs"
--perf_duration="10secs" --perf_interval="1mins" --port="5051" --qos_correction_interval_min="0ns"
--quiet="false" --recover="reconnect" --recovery_timeout="15mins" --registration_backoff_factor="10ms"
--resources="cpus:2;gpus:0;mem:1024;disk:1024;ports:[31000-32000]" --revocable_cpu_low_priority="true"
--runtime_dir="/tmp/Endpoint_SlaveEndpointTest_NoAuthorizer_2_gw7dQK" --sandbox_directory="/mnt/mesos/sandbox"
--strict="true" --switch_user="true" --systemd_enable_support="true" --systemd_runtime_directory="/run/systemd/system"
--version="false" --work_dir="/tmp/Endpoint_SlaveEndpointTest_NoAuthorizer_2_rUhnwj"
I0427 16:07:40.907793 31715 credentials.hpp:86] Loading credential for authentication from
'/tmp/Endpoint_SlaveEndpointTest_NoAuthorizer_2_gw7dQK/credential'
I0427 16:07:40.907943 31715 slave.cpp:258] Agent using credential for: test-principal
I0427 16:07:40.907959 31715 credentials.hpp:37] Loading credentials for authentication from
'/tmp/Endpoint_SlaveEndpointTest_NoAuthorizer_2_gw7dQK/http_credentials'
I0427 16:07:40.908133 31715 http.cpp:975] Creating default 'basic' HTTP authenticator for
realm 'mesos-agent-executor'
I0427 16:07:40.908179 31715 http.cpp:996] Creating default 'jwt' HTTP authenticator for realm
'mesos-agent-executor'
I0427 16:07:40.908233 31715 http.cpp:975] Creating default 'basic' HTTP authenticator for
realm 'mesos-agent-readonly'
I0427 16:07:40.908264 31715 http.cpp:996] Creating default 'jwt' HTTP authenticator for realm
'mesos-agent-readonly'
I0427 16:07:40.908305 31715 http.cpp:975] Creating default 'basic' HTTP authenticator for
realm 'mesos-agent-readwrite'
I0427 16:07:40.908330 31715 http.cpp:996] Creating default 'jwt' HTTP authenticator for realm
'mesos-agent-readwrite'
I0427 16:07:40.908823 31715 slave.cpp:525] Agent resources: cpus(*):2; mem(*):1024; disk(*):1024;
ports(*):[31000-32000]
I0427 16:07:40.908872 31715 slave.cpp:533] Agent attributes: [  ]
I0427 16:07:40.908885 31715 slave.cpp:538] Agent hostname: b3f87a15ae7d
I0427 16:07:40.909365 31715 status_update_manager.cpp:177] Pausing sending status updates
I0427 16:07:40.909699 31715 state.cpp:62] Recovering state from '/tmp/Endpoint_SlaveEndpointTest_NoAuthorizer_2_rUhnwj/meta'
I0427 16:07:40.909868 31715 status_update_manager.cpp:203] Recovering status update manager
I0427 16:07:40.909937 31715 containerizer.cpp:608] Recovering containerizer
I0427 16:07:40.910528 31715 provisioner.cpp:410] Provisioner recovery complete
I0427 16:07:40.910689 31715 slave.cpp:5963] Finished recovery
I0427 16:07:40.911141 31715 slave.cpp:6145] Querying resource estimator for oversubscribable
resources
I0427 16:07:40.911250 31715 slave.cpp:6159] Received oversubscribable resources {} from the
resource estimator
I0427 16:07:40.942358 31713 process.cpp:3731] Handling HTTP event for process 'slave(746)'
with path: '/slave(746)/containers'
I0427 16:07:40.943006 31713 http.cpp:1115] HTTP GET for /slave(746)/containers from 172.17.0.2:48577
I0427 16:07:40.943063 31713 http.cpp:936] Authorizing principal 'test-principal' to GET the
'/containers' endpoint
I0427 16:07:40.948462 25997 slave.cpp:790] Agent terminating
[       OK ] Endpoint/SlaveEndpointTest.NoAuthorizer/2 (72 ms)
[----------] 9 tests from Endpoint/SlaveEndpointTest (348 ms total)

[----------] Global test environment tear-down
[==========] 1520 tests from 169 test cases ran. (392094 ms total)
[  PASSED  ] 1518 tests.
[  FAILED  ] 2 tests, listed below:
[  FAILED  ] HierarchicalAllocatorTest.NestedRoleQuota
[  FAILED  ] SlaveTest.RestartSlaveRequireExecutorAuthentication

 2 FAILED TESTS
  YOU HAVE 19 DISABLED TESTS

E0427 16:07:41.034041 31719 process.cpp:951] Failed to accept socket: future discarded
make[3]: Leaving directory `/mesos/build'
make[3]: *** [CMakeFiles/check] Error 1
make[2]: Leaving directory `/mesos/build'
make[2]: *** [CMakeFiles/check.dir/all] Error 2
make[1]: *** [CMakeFiles/check.dir/rule] Error 2
make[1]: Leaving directory `/mesos/build'
make: *** [check] Error 2
+ docker rmi mesos-1493306413-14237
Untagged: mesos-1493306413-14237:latest
Deleted: sha256:f31267db58e54391a743a5f6c25d9c54bb8817751c48228b2a5d9b3ec577a3ab
Deleted: sha256:3e50665768d6656377c7c974591f807c6714c7f8fbf387896aa9e5d93ce1518f
Deleted: sha256:5e0981212d274886131fc5590dc1423da849c4bd079305921f6e966076b4d9dd
Deleted: sha256:8a8c67bc11949f0d6fce8b0faf16487ac663b594db8cdeb057f0b9836f649bf8
Deleted: sha256:8908037904796cc9c4b97c4ee4fd275d2a804e03dabe2b72843cc5c6e913640c
Deleted: sha256:5ee8b7fcbcbfacc8fc73a20c9a30fb393f4dfe697ae7f47b7a6bb6c7579e64b3
Deleted: sha256:eec0f0e63041954b122d8a6540f2aa21dc6fce5f15d7df7ff07c8409f149801d
Deleted: sha256:8b2fea807f9a9f5b61d33eaa7639ce287a6f07ab87138a0c85e6eb7758ced0de
Deleted: sha256:d592f4cda2a8c1430639636ea1d61dc9e3dd17cc077068499eddf9f28c8b270a
Deleted: sha256:437f34e9446c07b8159b77fcd5d275544c2682e99157e5b4f85c58ed4938f97c
Deleted: sha256:f33023c74f863564df2919acb2385d0199c0c556a9b97205ac48b94d7b1f354b
Deleted: sha256:60a6c8a780bcf139b6da9a7f5ed3acc305ffe795dd6c5376e3afd0944f08b625
Deleted: sha256:f325a21595b6af2f6e1fc2da229be4636d81281f503c854077c2bf9c407c81a7
Deleted: sha256:1744b7bee154335e9b102f46e80a6f794344eb50b151c3093d6053085c24712b
Deleted: sha256:d223cfe85999235e3cf522d6875131834e11323c53021373b7b7fa8811ccaf2e
Deleted: sha256:782b635975d24ad30bd346abde8174858d0f76e45e56644af234b89fc2f421f8
Deleted: sha256:fa8ae27f657a26cf1dc47e8315c24e6551a2cf6df28c9b84e240dcb7a69d3d17
Deleted: sha256:69cb72622deb2d58bcabe9f0429bd667e2ec39f59d3c8d1c2a75ddeabfcc0a7a
Deleted: sha256:60f4f8e90d0ce4135487685d0c9c9836e9cb367ec74b8c960dd441a0627c1f96
Deleted: sha256:395ca99e7d74ba081e2e04be6f30c51cac71b081a71a411faaee8b2b583fa594
Deleted: sha256:4925b616a2f055442b55bb12137fc54b1eda596dbd3748f9518da781ef32b688
Deleted: sha256:aa1a762c6669a7ac2a757eef767e8c5e2defcef56c9444ea706e25dd40096018
Deleted: sha256:24563b2a05ed5f7f563de447f3fdbe26f4371b9dea6f1cfd97ed4eb7624b11d2
Deleted: sha256:3c1b9b834b64b7e8aa43be5b0d43abf0fa07bef9717baeb539cb1d1fa18bf054
Build step 'Execute shell' marked build as failure

Mime
View raw message