mesos-builds mailing list archives

Site index · List index
Message view « Date » · « Thread »
Top « Date » · « Thread »
From Apache Jenkins Server <jenk...@builds.apache.org>
Subject Build failed in Jenkins: Mesos-Reviewbot #17888
Date Fri, 28 Apr 2017 17:36:01 GMT
See <https://builds.apache.org/job/Mesos-Reviewbot/17888/display/redirect>

------------------------------------------
[...truncated 26.73 MB...]
I0428 17:35:17.707671 30670 slave.cpp:790] Agent terminating
[       OK ] Endpoint/SlaveEndpointTest.AuthorizedRequest/1 (35 ms)
[ RUN      ] Endpoint/SlaveEndpointTest.AuthorizedRequest/2
I0428 17:35:17.717357 30649 containerizer.cpp:221] Using isolation: posix/cpu,posix/mem,filesystem/posix,network/cni
W0428 17:35:17.717910 30649 backend.cpp:76] Failed to create 'aufs' backend: AufsBackend requires
root privileges
W0428 17:35:17.718022 30649 backend.cpp:76] Failed to create 'bind' backend: BindBackend requires
root privileges
I0428 17:35:17.718067 30649 provisioner.cpp:249] Using default backend 'copy'
I0428 17:35:17.721251 30679 slave.cpp:225] Mesos agent started on (738)@172.17.0.2:51484
I0428 17:35:17.721277 30679 slave.cpp:226] Flags at startup: --acls="" --appc_simple_discovery_uri_prefix="http://"
--appc_store_dir="/tmp/mesos/store/appc" --authenticate_http_readonly="true" --authenticate_http_readwrite="true"
--authenticatee="crammd5" --authentication_backoff_factor="1secs" --authorizer="local" --cgroups_cpu_enable_pids_and_tids_count="false"
--cgroups_enable_cfs="false" --cgroups_hierarchy="/sys/fs/cgroup" --cgroups_limit_swap="false"
--cgroups_root="mesos" --container_disk_watch_interval="15secs" --containerizers="mesos" --credential="/tmp/Endpoint_SlaveEndpointTest_AuthorizedRequest_2_1jTgJd/credential"
--default_role="*" --disk_watch_interval="1mins" --docker="docker" --docker_kill_orphans="true"
--docker_registry="https://registry-1.docker.io" --docker_remove_delay="6hrs" --docker_socket="/var/run/docker.sock"
--docker_stop_timeout="0ns" --docker_store_dir="/tmp/mesos/store/docker" --docker_volume_checkpoint_dir="/var/run/mesos/isolators/docker/volume"
--enforce_container_disk_quota="false" --executor_registration_timeout="1mins" --executor_shutdown_grace_period="5secs"
--fetcher_cache_dir="/tmp/Endpoint_SlaveEndpointTest_AuthorizedRequest_2_1jTgJd/fetch" --fetcher_cache_size="2GB"
--frameworks_home="" --gc_delay="1weeks" --gc_disk_headroom="0.1" --hadoop_home="" --help="false"
--hostname_lookup="true" --http_command_executor="false" --http_credentials="/tmp/Endpoint_SlaveEndpointTest_AuthorizedRequest_2_1jTgJd/http_credentials"
--http_heartbeat_interval="30secs" --initialize_driver_logging="true" --isolation="posix/cpu,posix/mem"
--launcher="posix" --launcher_dir="/mesos/mesos-1.3.0/_build/src" --logbufsecs="0" --logging_level="INFO"
--max_completed_executors_per_framework="150" --oversubscribed_resources_interval="15secs"
--perf_duration="10secs" --perf_interval="1mins" --port="5051" --qos_correction_interval_min="0ns"
--quiet="false" --recover="reconnect" --recovery_timeout="15mins" --registration_backoff_factor="10ms"
--resources="cpus:2;gpus:0;mem:1024;disk:1024;ports:[31000-32000]" --revocable_cpu_low_priority="true"
--runtime_dir="/tmp/Endpoint_SlaveEndpointTest_AuthorizedRequest_2_1jTgJd" --sandbox_directory="/mnt/mesos/sandbox"
--strict="true" --switch_user="true" --systemd_enable_support="true" --systemd_runtime_directory="/run/systemd/system"
--version="false" --work_dir="/tmp/Endpoint_SlaveEndpointTest_AuthorizedRequest_2_k7yfEN"
I0428 17:35:17.721782 30679 credentials.hpp:86] Loading credential for authentication from
'/tmp/Endpoint_SlaveEndpointTest_AuthorizedRequest_2_1jTgJd/credential'
I0428 17:35:17.722026 30679 slave.cpp:258] Agent using credential for: test-principal
I0428 17:35:17.722051 30679 credentials.hpp:37] Loading credentials for authentication from
'/tmp/Endpoint_SlaveEndpointTest_AuthorizedRequest_2_1jTgJd/http_credentials'
I0428 17:35:17.722342 30679 http.cpp:975] Creating default 'basic' HTTP authenticator for
realm 'mesos-agent-readonly'
I0428 17:35:17.722599 30679 http.cpp:975] Creating default 'basic' HTTP authenticator for
realm 'mesos-agent-readwrite'
I0428 17:35:17.724716 30679 slave.cpp:525] Agent resources: cpus(*):2; mem(*):1024; disk(*):1024;
ports(*):[31000-32000]
I0428 17:35:17.724849 30679 slave.cpp:533] Agent attributes: [  ]
I0428 17:35:17.724872 30679 slave.cpp:538] Agent hostname: b61766d1de73
I0428 17:35:17.725028 30671 status_update_manager.cpp:177] Pausing sending status updates
I0428 17:35:17.726943 30670 state.cpp:62] Recovering state from '/tmp/Endpoint_SlaveEndpointTest_AuthorizedRequest_2_k7yfEN/meta'
I0428 17:35:17.727346 30669 status_update_manager.cpp:203] Recovering status update manager
I0428 17:35:17.727565 30676 containerizer.cpp:608] Recovering containerizer
I0428 17:35:17.729154 30670 provisioner.cpp:410] Provisioner recovery complete
I0428 17:35:17.729575 30671 slave.cpp:5963] Finished recovery
I0428 17:35:17.730206 30671 slave.cpp:6145] Querying resource estimator for oversubscribable
resources
I0428 17:35:17.730528 30681 slave.cpp:6159] Received oversubscribable resources {} from the
resource estimator
I0428 17:35:17.733443 30674 process.cpp:3731] Handling HTTP event for process 'slave(738)'
with path: '/slave(738)/containers'
I0428 17:35:17.735097 30673 http.cpp:1115] HTTP GET for /slave(738)/containers from 172.17.0.2:44862
I0428 17:35:17.735172 30673 http.cpp:936] Authorizing principal 'test-principal' to GET the
'/containers' endpoint
I0428 17:35:17.738886 30649 slave.cpp:790] Agent terminating
[       OK ] Endpoint/SlaveEndpointTest.AuthorizedRequest/2 (31 ms)
[ RUN      ] Endpoint/SlaveEndpointTest.UnauthorizedRequest/0
I0428 17:35:17.747783 30649 containerizer.cpp:221] Using isolation: posix/cpu,posix/mem,filesystem/posix,network/cni
W0428 17:35:17.748318 30649 backend.cpp:76] Failed to create 'aufs' backend: AufsBackend requires
root privileges
W0428 17:35:17.748425 30649 backend.cpp:76] Failed to create 'bind' backend: BindBackend requires
root privileges
I0428 17:35:17.748466 30649 provisioner.cpp:249] Using default backend 'copy'
I0428 17:35:17.751471 30682 slave.cpp:225] Mesos agent started on (739)@172.17.0.2:51484
I0428 17:35:17.751505 30682 slave.cpp:226] Flags at startup: --acls="" --appc_simple_discovery_uri_prefix="http://"
--appc_store_dir="/tmp/mesos/store/appc" --authenticate_http_readonly="true" --authenticate_http_readwrite="true"
--authenticatee="crammd5" --authentication_backoff_factor="1secs" --authorizer="local" --cgroups_cpu_enable_pids_and_tids_count="false"
--cgroups_enable_cfs="false" --cgroups_hierarchy="/sys/fs/cgroup" --cgroups_limit_swap="false"
--cgroups_root="mesos" --container_disk_watch_interval="15secs" --containerizers="mesos" --credential="/tmp/Endpoint_SlaveEndpointTest_UnauthorizedRequest_0_f92kkU/credential"
--default_role="*" --disk_watch_interval="1mins" --docker="docker" --docker_kill_orphans="true"
--docker_registry="https://registry-1.docker.io" --docker_remove_delay="6hrs" --docker_socket="/var/run/docker.sock"
--docker_stop_timeout="0ns" --docker_store_dir="/tmp/mesos/store/docker" --docker_volume_checkpoint_dir="/var/run/mesos/isolators/docker/volume"
--enforce_container_disk_quota="false" --executor_registration_timeout="1mins" --executor_shutdown_grace_period="5secs"
--fetcher_cache_dir="/tmp/Endpoint_SlaveEndpointTest_UnauthorizedRequest_0_f92kkU/fetch" --fetcher_cache_size="2GB"
--frameworks_home="" --gc_delay="1weeks" --gc_disk_headroom="0.1" --hadoop_home="" --help="false"
--hostname_lookup="true" --http_command_executor="false" --http_credentials="/tmp/Endpoint_SlaveEndpointTest_UnauthorizedRequest_0_f92kkU/http_credentials"
--http_heartbeat_interval="30secs" --initialize_driver_logging="true" --isolation="posix/cpu,posix/mem"
--launcher="posix" --launcher_dir="/mesos/mesos-1.3.0/_build/src" --logbufsecs="0" --logging_level="INFO"
--max_completed_executors_per_framework="150" --oversubscribed_resources_interval="15secs"
--perf_duration="10secs" --perf_interval="1mins" --port="5051" --qos_correction_interval_min="0ns"
--quiet="false" --recover="reconnect" --recovery_timeout="15mins" --registration_backoff_factor="10ms"
--resources="cpus:2;gpus:0;mem:1024;disk:1024;ports:[31000-32000]" --revocable_cpu_low_priority="true"
--runtime_dir="/tmp/Endpoint_SlaveEndpointTest_UnauthorizedRequest_0_f92kkU" --sandbox_directory="/mnt/mesos/sandbox"
--strict="true" --switch_user="true" --systemd_enable_support="true" --systemd_runtime_directory="/run/systemd/system"
--version="false" --work_dir="/tmp/Endpoint_SlaveEndpointTest_UnauthorizedRequest_0_s8Ulau"
I0428 17:35:17.752043 30682 credentials.hpp:86] Loading credential for authentication from
'/tmp/Endpoint_SlaveEndpointTest_UnauthorizedRequest_0_f92kkU/credential'
I0428 17:35:17.752267 30682 slave.cpp:258] Agent using credential for: test-principal
I0428 17:35:17.752297 30682 credentials.hpp:37] Loading credentials for authentication from
'/tmp/Endpoint_SlaveEndpointTest_UnauthorizedRequest_0_f92kkU/http_credentials'
I0428 17:35:17.752630 30682 http.cpp:975] Creating default 'basic' HTTP authenticator for
realm 'mesos-agent-readonly'
I0428 17:35:17.752831 30682 http.cpp:975] Creating default 'basic' HTTP authenticator for
realm 'mesos-agent-readwrite'
I0428 17:35:17.754860 30682 slave.cpp:525] Agent resources: cpus(*):2; mem(*):1024; disk(*):1024;
ports(*):[31000-32000]
I0428 17:35:17.754983 30682 slave.cpp:533] Agent attributes: [  ]
I0428 17:35:17.755028 30682 slave.cpp:538] Agent hostname: b61766d1de73
I0428 17:35:17.755220 30683 status_update_manager.cpp:177] Pausing sending status updates
I0428 17:35:17.756986 30676 state.cpp:62] Recovering state from '/tmp/Endpoint_SlaveEndpointTest_UnauthorizedRequest_0_s8Ulau/meta'
I0428 17:35:17.762753 30671 status_update_manager.cpp:203] Recovering status update manager
I0428 17:35:17.762998 30671 containerizer.cpp:608] Recovering containerizer
I0428 17:35:17.764647 30681 provisioner.cpp:410] Provisioner recovery complete
I0428 17:35:17.765017 30674 slave.cpp:5963] Finished recovery
I0428 17:35:17.766309 30674 slave.cpp:6145] Querying resource estimator for oversubscribable
resources
I0428 17:35:17.766716 30674 slave.cpp:6159] Received oversubscribable resources {} from the
resource estimator
I0428 17:35:17.771600 30677 process.cpp:3731] Handling HTTP event for process 'slave(739)'
with path: '/slave(739)/monitor/statistics'
I0428 17:35:17.773315 30679 http.cpp:1115] HTTP GET for /slave(739)/monitor/statistics from
172.17.0.2:44865
I0428 17:35:17.773404 30679 http.cpp:936] Authorizing principal 'test-principal' to GET the
'/monitor/statistics' endpoint
I0428 17:35:17.780910 30668 slave.cpp:790] Agent terminating
[       OK ] Endpoint/SlaveEndpointTest.UnauthorizedRequest/0 (48 ms)
[ RUN      ] Endpoint/SlaveEndpointTest.UnauthorizedRequest/1
I0428 17:35:17.799129 30649 containerizer.cpp:221] Using isolation: posix/cpu,posix/mem,filesystem/posix,network/cni
W0428 17:35:17.799965 30649 backend.cpp:76] Failed to create 'aufs' backend: AufsBackend requires
root privileges
W0428 17:35:17.800102 30649 backend.cpp:76] Failed to create 'bind' backend: BindBackend requires
root privileges
I0428 17:35:17.800149 30649 provisioner.cpp:249] Using default backend 'copy'
I0428 17:35:17.804388 30672 slave.cpp:225] Mesos agent started on (740)@172.17.0.2:51484
I0428 17:35:17.804782 30672 slave.cpp:226] Flags at startup: --acls="" --appc_simple_discovery_uri_prefix="http://"
--appc_store_dir="/tmp/mesos/store/appc" --authenticate_http_readonly="true" --authenticate_http_readwrite="true"
--authenticatee="crammd5" --authentication_backoff_factor="1secs" --authorizer="local" --cgroups_cpu_enable_pids_and_tids_count="false"
--cgroups_enable_cfs="false" --cgroups_hierarchy="/sys/fs/cgroup" --cgroups_limit_swap="false"
--cgroups_root="mesos" --container_disk_watch_interval="15secs" --containerizers="mesos" --credential="/tmp/Endpoint_SlaveEndpointTest_UnauthorizedRequest_1_DYCkpB/credential"
--default_role="*" --disk_watch_interval="1mins" --docker="docker" --docker_kill_orphans="true"
--docker_registry="https://registry-1.docker.io" --docker_remove_delay="6hrs" --docker_socket="/var/run/docker.sock"
--docker_stop_timeout="0ns" --docker_store_dir="/tmp/mesos/store/docker" --docker_volume_checkpoint_dir="/var/run/mesos/isolators/docker/volume"
--enforce_container_disk_quota="false" --executor_registration_timeout="1mins" --executor_shutdown_grace_period="5secs"
--fetcher_cache_dir="/tmp/Endpoint_SlaveEndpointTest_UnauthorizedRequest_1_DYCkpB/fetch" --fetcher_cache_size="2GB"
--frameworks_home="" --gc_delay="1weeks" --gc_disk_headroom="0.1" --hadoop_home="" --help="false"
--hostname_lookup="true" --http_command_executor="false" --http_credentials="/tmp/Endpoint_SlaveEndpointTest_UnauthorizedRequest_1_DYCkpB/http_credentials"
--http_heartbeat_interval="30secs" --initialize_driver_logging="true" --isolation="posix/cpu,posix/mem"
--launcher="posix" --launcher_dir="/mesos/mesos-1.3.0/_build/src" --logbufsecs="0" --logging_level="INFO"
--max_completed_executors_per_framework="150" --oversubscribed_resources_interval="15secs"
--perf_duration="10secs" --perf_interval="1mins" --port="5051" --qos_correction_interval_min="0ns"
--quiet="false" --recover="reconnect" --recovery_timeout="15mins" --registration_backoff_factor="10ms"
--resources="cpus:2;gpus:0;mem:1024;disk:1024;ports:[31000-32000]" --revocable_cpu_low_priority="true"
--runtime_dir="/tmp/Endpoint_SlaveEndpointTest_UnauthorizedRequest_1_DYCkpB" --sandbox_directory="/mnt/mesos/sandbox"
--strict="true" --switch_user="true" --systemd_enable_support="true" --systemd_runtime_directory="/run/systemd/system"
--version="false" --work_dir="/tmp/Endpoint_SlaveEndpointTest_UnauthorizedRequest_1_sPce7a"
I0428 17:35:17.805249 30672 credentials.hpp:86] Loading credential for authentication from
'/tmp/Endpoint_SlaveEndpointTest_UnauthorizedRequest_1_DYCkpB/credential'
I0428 17:35:17.805521 30672 slave.cpp:258] Agent using credential for: test-principal
I0428 17:35:17.805546 30672 credentials.hpp:37] Loading credentials for authentication from
'/tmp/Endpoint_SlaveEndpointTest_UnauthorizedRequest_1_DYCkpB/http_credentials'
I0428 17:35:17.805841 30672 http.cpp:975] Creating default 'basic' HTTP authenticator for
realm 'mesos-agent-readonly'
I0428 17:35:17.806046 30672 http.cpp:975] Creating default 'basic' HTTP authenticator for
realm 'mesos-agent-readwrite'
I0428 17:35:17.807389 30672 slave.cpp:525] Agent resources: cpus(*):2; mem(*):1024; disk(*):1024;
ports(*):[31000-32000]
I0428 17:35:17.807477 30672 slave.cpp:533] Agent attributes: [  ]
I0428 17:35:17.807545 30672 slave.cpp:538] Agent hostname: b61766d1de73
I0428 17:35:17.809180 30672 status_update_manager.cpp:177] Pausing sending status updates
I0428 17:35:17.809356 30672 state.cpp:62] Recovering state from '/tmp/Endpoint_SlaveEndpointTest_UnauthorizedRequest_1_sPce7a/meta'
I0428 17:35:17.809815 30676 status_update_manager.cpp:203] Recovering status update manager
I0428 17:35:17.810030 30683 containerizer.cpp:608] Recovering containerizer
I0428 17:35:17.811964 30682 provisioner.cpp:410] Provisioner recovery complete
I0428 17:35:17.812338 30676 slave.cpp:5963] Finished recovery
I0428 17:35:17.812901 30676 slave.cpp:6145] Querying resource estimator for oversubscribable
resources
I0428 17:35:17.813195 30679 slave.cpp:6159] Received oversubscribable resources {} from the
resource estimator
I0428 17:35:17.816762 30676 process.cpp:3731] Handling HTTP event for process 'slave(740)'
with path: '/slave(740)/monitor/statistics.json'
I0428 17:35:17.818114 30669 http.cpp:1115] HTTP GET for /slave(740)/monitor/statistics.json
from 172.17.0.2:44867
I0428 17:35:17.818217 30669 http.cpp:936] Authorizing principal 'test-principal' to GET the
'/monitor/statistics.json' endpoint
I0428 17:35:17.821755 30649 slave.cpp:790] Agent terminating
[       OK ] Endpoint/SlaveEndpointTest.UnauthorizedRequest/1 (34 ms)
[ RUN      ] Endpoint/SlaveEndpointTest.UnauthorizedRequest/2
I0428 17:35:17.834357 30649 containerizer.cpp:221] Using isolation: posix/cpu,posix/mem,filesystem/posix,network/cni
W0428 17:35:17.835098 30649 backend.cpp:76] Failed to create 'aufs' backend: AufsBackend requires
root privileges
W0428 17:35:17.835228 30649 backend.cpp:76] Failed to create 'bind' backend: BindBackend requires
root privileges
I0428 17:35:17.835304 30649 provisioner.cpp:249] Using default backend 'copy'
I0428 17:35:17.839653 30676 slave.cpp:225] Mesos agent started on (741)@172.17.0.2:51484
I0428 17:35:17.839681 30676 slave.cpp:226] Flags at startup: --acls="" --appc_simple_discovery_uri_prefix="http://"
--appc_store_dir="/tmp/mesos/store/appc" --authenticate_http_readonly="true" --authenticate_http_readwrite="true"
--authenticatee="crammd5" --authentication_backoff_factor="1secs" --authorizer="local" --cgroups_cpu_enable_pids_and_tids_count="false"
--cgroups_enable_cfs="false" --cgroups_hierarchy="/sys/fs/cgroup" --cgroups_limit_swap="false"
--cgroups_root="mesos" --container_disk_watch_interval="15secs" --containerizers="mesos" --credential="/tmp/Endpoint_SlaveEndpointTest_UnauthorizedRequest_2_pcU7Si/credential"
--default_role="*" --disk_watch_interval="1mins" --docker="docker" --docker_kill_orphans="true"
--docker_registry="https://registry-1.docker.io" --docker_remove_delay="6hrs" --docker_socket="/var/run/docker.sock"
--docker_stop_timeout="0ns" --docker_store_dir="/tmp/mesos/store/docker" --docker_volume_checkpoint_dir="/var/run/mesos/isolators/docker/volume"
--enforce_container_disk_quota="false" --executor_registration_timeout="1mins" --executor_shutdown_grace_period="5secs"
--fetcher_cache_dir="/tmp/Endpoint_SlaveEndpointTest_UnauthorizedRequest_2_pcU7Si/fetch" --fetcher_cache_size="2GB"
--frameworks_home="" --gc_delay="1weeks" --gc_disk_headroom="0.1" --hadoop_home="" --help="false"
--hostname_lookup="true" --http_command_executor="false" --http_credentials="/tmp/Endpoint_SlaveEndpointTest_UnauthorizedRequest_2_pcU7Si/http_credentials"
--http_heartbeat_interval="30secs" --initialize_driver_logging="true" --isolation="posix/cpu,posix/mem"
--launcher="posix" --launcher_dir="/mesos/mesos-1.3.0/_build/src" --logbufsecs="0" --logging_level="INFO"
--max_completed_executors_per_framework="150" --oversubscribed_resources_interval="15secs"
--perf_duration="10secs" --perf_interval="1mins" --port="5051" --qos_correction_interval_min="0ns"
--quiet="false" --recover="reconnect" --recovery_timeout="15mins" --registration_backoff_factor="10ms"
--resources="cpus:2;gpus:0;mem:1024;disk:1024;ports:[31000-32000]" --revocable_cpu_low_priority="true"
--runtime_dir="/tmp/Endpoint_SlaveEndpointTest_UnauthorizedRequest_2_pcU7Si" --sandbox_directory="/mnt/mesos/sandbox"
--strict="true" --switch_user="true" --systemd_enable_support="true" --systemd_runtime_directory="/run/systemd/system"
--version="false" --work_dir="/tmp/Endpoint_SlaveEndpointTest_UnauthorizedRequest_2_WDAjvS"
I0428 17:35:17.840112 30676 credentials.hpp:86] Loading credential for authentication from
'/tmp/Endpoint_SlaveEndpointTest_UnauthorizedRequest_2_pcU7Si/credential'
I0428 17:35:17.840338 30676 slave.cpp:258] Agent using credential for: test-principal
I0428 17:35:17.840363 30676 credentials.hpp:37] Loading credentials for authentication from
'/tmp/Endpoint_SlaveEndpointTest_UnauthorizedRequest_2_pcU7Si/http_credentials'
I0428 17:35:17.840636 30676 http.cpp:975] Creating default 'basic' HTTP authenticator for
realm 'mesos-agent-readonly'
I0428 17:35:17.840816 30676 http.cpp:975] Creating default 'basic' HTTP authenticator for
realm 'mesos-agent-readwrite'
I0428 17:35:17.842078 30676 slave.cpp:525] Agent resources: cpus(*):2; mem(*):1024; disk(*):1024;
ports(*):[31000-32000]
I0428 17:35:17.842186 30676 slave.cpp:533] Agent attributes: [  ]
I0428 17:35:17.842206 30676 slave.cpp:538] Agent hostname: b61766d1de73
I0428 17:35:17.842372 30671 status_update_manager.cpp:177] Pausing sending status updates
I0428 17:35:17.843996 30679 state.cpp:62] Recovering state from '/tmp/Endpoint_SlaveEndpointTest_UnauthorizedRequest_2_WDAjvS/meta'
I0428 17:35:17.844354 30681 status_update_manager.cpp:203] Recovering status update manager
I0428 17:35:17.844558 30669 containerizer.cpp:608] Recovering containerizer
I0428 17:35:17.846112 30679 provisioner.cpp:410] Provisioner recovery complete
I0428 17:35:17.846540 30682 slave.cpp:5963] Finished recovery
I0428 17:35:17.847136 30682 slave.cpp:6145] Querying resource estimator for oversubscribable
resources
I0428 17:35:17.847445 30678 slave.cpp:6159] Received oversubscribable resources {} from the
resource estimator
I0428 17:35:17.853612 30679 process.cpp:3731] Handling HTTP event for process 'slave(741)'
with path: '/slave(741)/containers'
I0428 17:35:17.855037 30674 http.cpp:1115] HTTP GET for /slave(741)/containers from 172.17.0.2:44868
I0428 17:35:17.855114 30674 http.cpp:936] Authorizing principal 'test-principal' to GET the
'/containers' endpoint
I0428 17:35:17.857393 30671 slave.cpp:790] Agent terminating
[       OK ] Endpoint/SlaveEndpointTest.UnauthorizedRequest/2 (36 ms)
[ RUN      ] Endpoint/SlaveEndpointTest.NoAuthorizer/0
I0428 17:35:17.868090 30649 containerizer.cpp:221] Using isolation: posix/cpu,posix/mem,filesystem/posix,network/cni
W0428 17:35:17.868609 30649 backend.cpp:76] Failed to create 'aufs' backend: AufsBackend requires
root privileges
W0428 17:35:17.868721 30649 backend.cpp:76] Failed to create 'bind' backend: BindBackend requires
root privileges
I0428 17:35:17.868764 30649 provisioner.cpp:249] Using default backend 'copy'
I0428 17:35:17.870306 30649 cluster.cpp:448] Creating default 'local' authorizer
I0428 17:35:17.871847 30683 slave.cpp:225] Mesos agent started on (742)@172.17.0.2:51484
I0428 17:35:17.871870 30683 slave.cpp:226] Flags at startup: --acls="" --appc_simple_discovery_uri_prefix="http://"
--appc_store_dir="/tmp/mesos/store/appc" --authenticate_http_readonly="true" --authenticate_http_readwrite="true"
--authenticatee="crammd5" --authentication_backoff_factor="1secs" --authorizer="local" --cgroups_cpu_enable_pids_and_tids_count="false"
--cgroups_enable_cfs="false" --cgroups_hierarchy="/sys/fs/cgroup" --cgroups_limit_swap="false"
--cgroups_root="mesos" --container_disk_watch_interval="15secs" --containerizers="mesos" --credential="/tmp/Endpoint_SlaveEndpointTest_NoAuthorizer_0_RmmCJ0/credential"
--default_role="*" --disk_watch_interval="1mins" --docker="docker" --docker_kill_orphans="true"
--docker_registry="https://registry-1.docker.io" --docker_remove_delay="6hrs" --docker_socket="/var/run/docker.sock"
--docker_stop_timeout="0ns" --docker_store_dir="/tmp/mesos/store/docker" --docker_volume_checkpoint_dir="/var/run/mesos/isolators/docker/volume"
--enforce_container_disk_quota="false" --executor_registration_timeout="1mins" --executor_shutdown_grace_period="5secs"
--fetcher_cache_dir="/tmp/Endpoint_SlaveEndpointTest_NoAuthorizer_0_RmmCJ0/fetch" --fetcher_cache_size="2GB"
--frameworks_home="" --gc_delay="1weeks" --gc_disk_headroom="0.1" --hadoop_home="" --help="false"
--hostname_lookup="true" --http_command_executor="false" --http_credentials="/tmp/Endpoint_SlaveEndpointTest_NoAuthorizer_0_RmmCJ0/http_credentials"
--http_heartbeat_interval="30secs" --initialize_driver_logging="true" --isolation="posix/cpu,posix/mem"
--launcher="posix" --launcher_dir="/mesos/mesos-1.3.0/_build/src" --logbufsecs="0" --logging_level="INFO"
--max_completed_executors_per_framework="150" --oversubscribed_resources_interval="15secs"
--perf_duration="10secs" --perf_interval="1mins" --port="5051" --qos_correction_interval_min="0ns"
--quiet="false" --recover="reconnect" --recovery_timeout="15mins" --registration_backoff_factor="10ms"
--resources="cpus:2;gpus:0;mem:1024;disk:1024;ports:[31000-32000]" --revocable_cpu_low_priority="true"
--runtime_dir="/tmp/Endpoint_SlaveEndpointTest_NoAuthorizer_0_RmmCJ0" --sandbox_directory="/mnt/mesos/sandbox"
--strict="true" --switch_user="true" --systemd_enable_support="true" --systemd_runtime_directory="/run/systemd/system"
--version="false" --work_dir="/tmp/Endpoint_SlaveEndpointTest_NoAuthorizer_0_u7q9fA"
I0428 17:35:17.872292 30683 credentials.hpp:86] Loading credential for authentication from
'/tmp/Endpoint_SlaveEndpointTest_NoAuthorizer_0_RmmCJ0/credential'
I0428 17:35:17.872517 30683 slave.cpp:258] Agent using credential for: test-principal
I0428 17:35:17.872540 30683 credentials.hpp:37] Loading credentials for authentication from
'/tmp/Endpoint_SlaveEndpointTest_NoAuthorizer_0_RmmCJ0/http_credentials'
I0428 17:35:17.872803 30683 http.cpp:975] Creating default 'basic' HTTP authenticator for
realm 'mesos-agent-readonly'
I0428 17:35:17.872992 30683 http.cpp:975] Creating default 'basic' HTTP authenticator for
realm 'mesos-agent-readwrite'
I0428 17:35:17.874274 30683 slave.cpp:525] Agent resources: cpus(*):2; mem(*):1024; disk(*):1024;
ports(*):[31000-32000]
I0428 17:35:17.874357 30683 slave.cpp:533] Agent attributes: [  ]
I0428 17:35:17.874378 30683 slave.cpp:538] Agent hostname: b61766d1de73
I0428 17:35:17.874541 30680 status_update_manager.cpp:177] Pausing sending status updates
I0428 17:35:17.875932 30672 state.cpp:62] Recovering state from '/tmp/Endpoint_SlaveEndpointTest_NoAuthorizer_0_u7q9fA/meta'
I0428 17:35:17.876369 30677 status_update_manager.cpp:203] Recovering status update manager
I0428 17:35:17.876611 30673 containerizer.cpp:608] Recovering containerizer
I0428 17:35:17.878196 30672 provisioner.cpp:410] Provisioner recovery complete
I0428 17:35:17.878662 30681 slave.cpp:5963] Finished recovery
I0428 17:35:17.879174 30681 slave.cpp:6145] Querying resource estimator for oversubscribable
resources
I0428 17:35:17.879526 30674 slave.cpp:6159] Received oversubscribable resources {} from the
resource estimator
I0428 17:35:17.882974 30680 process.cpp:3731] Handling HTTP event for process 'slave(742)'
with path: '/slave(742)/monitor/statistics'
I0428 17:35:17.884563 30668 http.cpp:1115] HTTP GET for /slave(742)/monitor/statistics from
172.17.0.2:44870
I0428 17:35:17.884647 30668 http.cpp:936] Authorizing principal 'test-principal' to GET the
'/monitor/statistics' endpoint
I0428 17:35:17.888909 30649 slave.cpp:790] Agent terminating
[       OK ] Endpoint/SlaveEndpointTest.NoAuthorizer/0 (31 ms)
[ RUN      ] Endpoint/SlaveEndpointTest.NoAuthorizer/1
I0428 17:35:17.900239 30649 containerizer.cpp:221] Using isolation: posix/cpu,posix/mem,filesystem/posix,network/cni
W0428 17:35:17.900765 30649 backend.cpp:76] Failed to create 'aufs' backend: AufsBackend requires
root privileges
W0428 17:35:17.900883 30649 backend.cpp:76] Failed to create 'bind' backend: BindBackend requires
root privileges
I0428 17:35:17.900951 30649 provisioner.cpp:249] Using default backend 'copy'
I0428 17:35:17.902506 30649 cluster.cpp:448] Creating default 'local' authorizer
I0428 17:35:17.904072 30673 slave.cpp:225] Mesos agent started on (743)@172.17.0.2:51484
I0428 17:35:17.904100 30673 slave.cpp:226] Flags at startup: --acls="" --appc_simple_discovery_uri_prefix="http://"
--appc_store_dir="/tmp/mesos/store/appc" --authenticate_http_readonly="true" --authenticate_http_readwrite="true"
--authenticatee="crammd5" --authentication_backoff_factor="1secs" --authorizer="local" --cgroups_cpu_enable_pids_and_tids_count="false"
--cgroups_enable_cfs="false" --cgroups_hierarchy="/sys/fs/cgroup" --cgroups_limit_swap="false"
--cgroups_root="mesos" --container_disk_watch_interval="15secs" --containerizers="mesos" --credential="/tmp/Endpoint_SlaveEndpointTest_NoAuthorizer_1_PypTUI/credential"
--default_role="*" --disk_watch_interval="1mins" --docker="docker" --docker_kill_orphans="true"
--docker_registry="https://registry-1.docker.io" --docker_remove_delay="6hrs" --docker_socket="/var/run/docker.sock"
--docker_stop_timeout="0ns" --docker_store_dir="/tmp/mesos/store/docker" --docker_volume_checkpoint_dir="/var/run/mesos/isolators/docker/volume"
--enforce_container_disk_quota="false" --executor_registration_timeout="1mins" --executor_shutdown_grace_period="5secs"
--fetcher_cache_dir="/tmp/Endpoint_SlaveEndpointTest_NoAuthorizer_1_PypTUI/fetch" --fetcher_cache_size="2GB"
--frameworks_home="" --gc_delay="1weeks" --gc_disk_headroom="0.1" --hadoop_home="" --help="false"
--hostname_lookup="true" --http_command_executor="false" --http_credentials="/tmp/Endpoint_SlaveEndpointTest_NoAuthorizer_1_PypTUI/http_credentials"
--http_heartbeat_interval="30secs" --initialize_driver_logging="true" --isolation="posix/cpu,posix/mem"
--launcher="posix" --launcher_dir="/mesos/mesos-1.3.0/_build/src" --logbufsecs="0" --logging_level="INFO"
--max_completed_executors_per_framework="150" --oversubscribed_resources_interval="15secs"
--perf_duration="10secs" --perf_interval="1mins" --port="5051" --qos_correction_interval_min="0ns"
--quiet="false" --recover="reconnect" --recovery_timeout="15mins" --registration_backoff_factor="10ms"
--resources="cpus:2;gpus:0;mem:1024;disk:1024;ports:[31000-32000]" --revocable_cpu_low_priority="true"
--runtime_dir="/tmp/Endpoint_SlaveEndpointTest_NoAuthorizer_1_PypTUI" --sandbox_directory="/mnt/mesos/sandbox"
--strict="true" --switch_user="true" --systemd_enable_support="true" --systemd_runtime_directory="/run/systemd/system"
--version="false" --work_dir="/tmp/Endpoint_SlaveEndpointTest_NoAuthorizer_1_ohremi"
I0428 17:35:17.904593 30673 credentials.hpp:86] Loading credential for authentication from
'/tmp/Endpoint_SlaveEndpointTest_NoAuthorizer_1_PypTUI/credential'
I0428 17:35:17.904825 30673 slave.cpp:258] Agent using credential for: test-principal
I0428 17:35:17.904852 30673 credentials.hpp:37] Loading credentials for authentication from
'/tmp/Endpoint_SlaveEndpointTest_NoAuthorizer_1_PypTUI/http_credentials'
I0428 17:35:17.905154 30673 http.cpp:975] Creating default 'basic' HTTP authenticator for
realm 'mesos-agent-readonly'
I0428 17:35:17.905361 30673 http.cpp:975] Creating default 'basic' HTTP authenticator for
realm 'mesos-agent-readwrite'
I0428 17:35:17.906711 30673 slave.cpp:525] Agent resources: cpus(*):2; mem(*):1024; disk(*):1024;
ports(*):[31000-32000]
I0428 17:35:17.906791 30673 slave.cpp:533] Agent attributes: [  ]
I0428 17:35:17.906805 30673 slave.cpp:538] Agent hostname: b61766d1de73
I0428 17:35:17.906931 30677 status_update_manager.cpp:177] Pausing sending status updates
I0428 17:35:17.908366 30671 state.cpp:62] Recovering state from '/tmp/Endpoint_SlaveEndpointTest_NoAuthorizer_1_ohremi/meta'
I0428 17:35:17.916715 30676 status_update_manager.cpp:203] Recovering status update manager
I0428 17:35:17.916952 30673 containerizer.cpp:608] Recovering containerizer
I0428 17:35:17.918450 30668 provisioner.cpp:410] Provisioner recovery complete
I0428 17:35:17.918876 30680 slave.cpp:5963] Finished recovery
I0428 17:35:17.919435 30680 slave.cpp:6145] Querying resource estimator for oversubscribable
resources
I0428 17:35:17.919714 30677 slave.cpp:6159] Received oversubscribable resources {} from the
resource estimator
I0428 17:35:17.924451 30679 process.cpp:3731] Handling HTTP event for process 'slave(743)'
with path: '/slave(743)/monitor/statistics.json'
I0428 17:35:17.927059 30669 http.cpp:1115] HTTP GET for /slave(743)/monitor/statistics.json
from 172.17.0.2:44871
I0428 17:35:17.927144 30669 http.cpp:936] Authorizing principal 'test-principal' to GET the
'/monitor/statistics.json' endpoint
I0428 17:35:17.931071 30649 slave.cpp:790] Agent terminating
[       OK ] Endpoint/SlaveEndpointTest.NoAuthorizer/1 (40 ms)
[ RUN      ] Endpoint/SlaveEndpointTest.NoAuthorizer/2
I0428 17:35:17.940397 30649 containerizer.cpp:221] Using isolation: posix/cpu,posix/mem,filesystem/posix,network/cni
W0428 17:35:17.940896 30649 backend.cpp:76] Failed to create 'aufs' backend: AufsBackend requires
root privileges
W0428 17:35:17.941011 30649 backend.cpp:76] Failed to create 'bind' backend: BindBackend requires
root privileges
I0428 17:35:17.941057 30649 provisioner.cpp:249] Using default backend 'copy'
I0428 17:35:17.942613 30649 cluster.cpp:448] Creating default 'local' authorizer
I0428 17:35:17.944104 30679 slave.cpp:225] Mesos agent started on (744)@172.17.0.2:51484
I0428 17:35:17.944149 30679 slave.cpp:226] Flags at startup: --acls="" --appc_simple_discovery_uri_prefix="http://"
--appc_store_dir="/tmp/mesos/store/appc" --authenticate_http_readonly="true" --authenticate_http_readwrite="true"
--authenticatee="crammd5" --authentication_backoff_factor="1secs" --authorizer="local" --cgroups_cpu_enable_pids_and_tids_count="false"
--cgroups_enable_cfs="false" --cgroups_hierarchy="/sys/fs/cgroup" --cgroups_limit_swap="false"
--cgroups_root="mesos" --container_disk_watch_interval="15secs" --containerizers="mesos" --credential="/tmp/Endpoint_SlaveEndpointTest_NoAuthorizer_2_XBVpwr/credential"
--default_role="*" --disk_watch_interval="1mins" --docker="docker" --docker_kill_orphans="true"
--docker_registry="https://registry-1.docker.io" --docker_remove_delay="6hrs" --docker_socket="/var/run/docker.sock"
--docker_stop_timeout="0ns" --docker_store_dir="/tmp/mesos/store/docker" --docker_volume_checkpoint_dir="/var/run/mesos/isolators/docker/volume"
--enforce_container_disk_quota="false" --executor_registration_timeout="1mins" --executor_shutdown_grace_period="5secs"
--fetcher_cache_dir="/tmp/Endpoint_SlaveEndpointTest_NoAuthorizer_2_XBVpwr/fetch" --fetcher_cache_size="2GB"
--frameworks_home="" --gc_delay="1weeks" --gc_disk_headroom="0.1" --hadoop_home="" --help="false"
--hostname_lookup="true" --http_command_executor="false" --http_credentials="/tmp/Endpoint_SlaveEndpointTest_NoAuthorizer_2_XBVpwr/http_credentials"
--http_heartbeat_interval="30secs" --initialize_driver_logging="true" --isolation="posix/cpu,posix/mem"
--launcher="posix" --launcher_dir="/mesos/mesos-1.3.0/_build/src" --logbufsecs="0" --logging_level="INFO"
--max_completed_executors_per_framework="150" --oversubscribed_resources_interval="15secs"
--perf_duration="10secs" --perf_interval="1mins" --port="5051" --qos_correction_interval_min="0ns"
--quiet="false" --recover="reconnect" --recovery_timeout="15mins" --registration_backoff_factor="10ms"
--resources="cpus:2;gpus:0;mem:1024;disk:1024;ports:[31000-32000]" --revocable_cpu_low_priority="true"
--runtime_dir="/tmp/Endpoint_SlaveEndpointTest_NoAuthorizer_2_XBVpwr" --sandbox_directory="/mnt/mesos/sandbox"
--strict="true" --switch_user="true" --systemd_enable_support="true" --systemd_runtime_directory="/run/systemd/system"
--version="false" --work_dir="/tmp/Endpoint_SlaveEndpointTest_NoAuthorizer_2_Ta1bR0"
I0428 17:35:17.944605 30679 credentials.hpp:86] Loading credential for authentication from
'/tmp/Endpoint_SlaveEndpointTest_NoAuthorizer_2_XBVpwr/credential'
I0428 17:35:17.944824 30679 slave.cpp:258] Agent using credential for: test-principal
I0428 17:35:17.944849 30679 credentials.hpp:37] Loading credentials for authentication from
'/tmp/Endpoint_SlaveEndpointTest_NoAuthorizer_2_XBVpwr/http_credentials'
I0428 17:35:17.945108 30679 http.cpp:975] Creating default 'basic' HTTP authenticator for
realm 'mesos-agent-readonly'
I0428 17:35:17.945277 30679 http.cpp:975] Creating default 'basic' HTTP authenticator for
realm 'mesos-agent-readwrite'
I0428 17:35:17.946538 30679 slave.cpp:525] Agent resources: cpus(*):2; mem(*):1024; disk(*):1024;
ports(*):[31000-32000]
I0428 17:35:17.946619 30679 slave.cpp:533] Agent attributes: [  ]
I0428 17:35:17.946637 30679 slave.cpp:538] Agent hostname: b61766d1de73
I0428 17:35:17.946772 30681 status_update_manager.cpp:177] Pausing sending status updates
I0428 17:35:17.948076 30676 state.cpp:62] Recovering state from '/tmp/Endpoint_SlaveEndpointTest_NoAuthorizer_2_Ta1bR0/meta'
I0428 17:35:17.948493 30675 status_update_manager.cpp:203] Recovering status update manager
I0428 17:35:17.948777 30681 containerizer.cpp:608] Recovering containerizer
I0428 17:35:17.951045 30669 provisioner.cpp:410] Provisioner recovery complete
I0428 17:35:17.951479 30680 slave.cpp:5963] Finished recovery
I0428 17:35:17.952044 30680 slave.cpp:6145] Querying resource estimator for oversubscribable
resources
I0428 17:35:17.952286 30680 slave.cpp:6159] Received oversubscribable resources {} from the
resource estimator
I0428 17:35:17.955523 30671 process.cpp:3731] Handling HTTP event for process 'slave(744)'
with path: '/slave(744)/containers'
I0428 17:35:17.956892 30671 http.cpp:1115] HTTP GET for /slave(744)/containers from 172.17.0.2:44872
I0428 17:35:17.956967 30671 http.cpp:936] Authorizing principal 'test-principal' to GET the
'/containers' endpoint
I0428 17:35:17.960662 30681 slave.cpp:790] Agent terminating
[       OK ] Endpoint/SlaveEndpointTest.NoAuthorizer/2 (29 ms)
[----------] 9 tests from Endpoint/SlaveEndpointTest (320 ms total)

[----------] Global test environment tear-down
[==========] 1563 tests from 175 test cases ran. (512145 ms total)
[  PASSED  ] 1562 tests.
[  FAILED  ] 1 test, listed below:
[  FAILED  ] HierarchicalAllocatorTest.NestedRoleQuota

 1 FAILED TEST
  YOU HAVE 19 DISABLED TESTS

E0428 17:35:18.026296 30684 process.cpp:951] Failed to accept socket: future discarded
make[4]: *** [check-local] Error 1
make[4]: Leaving directory `/mesos/mesos-1.3.0/_build/src'
make[3]: *** [check-am] Error 2
make[3]: Leaving directory `/mesos/mesos-1.3.0/_build/src'
make[2]: *** [check] Error 2
make[2]: Leaving directory `/mesos/mesos-1.3.0/_build/src'
make[1]: *** [check-recursive] Error 1
make[1]: Leaving directory `/mesos/mesos-1.3.0/_build'
make: *** [distcheck] Error 1
+ docker rmi mesos-1493397677-12387
Untagged: mesos-1493397677-12387:latest
Deleted: sha256:630afeb56c4d69ef5e4bda691e16b29b00d7d1ed848a540dc60e1b8f1373d1fc
Deleted: sha256:75da46f906acf06a8e74555babfa8a368902b8153f46dcbdc37512f27d6d480e
Deleted: sha256:addd8dd82bf4112cd79499f39c54ab083e9312160e7a9eab4a84a3a226b047bb
Deleted: sha256:48d5f900a67ed075fb710bde41a873a501ff99e519b283f6bc98f395c30a6722
Deleted: sha256:f64ba5780fb161699f3ac35ab5b5d619c8747a60f6545923e514f36c09022bf7
Deleted: sha256:01e9b045e23a1f49aa421c49b5f6553cbc52dd86272f269b312a69b1cfccf844
Deleted: sha256:a5a82d62012468476ec6cd950ae5997273a6025bbe7b63e29fbc17a3167b92ea
Deleted: sha256:8a5659509422c8c8d2a9bf3f613a2886f973f1997403f047477a73e722e97b21
Deleted: sha256:85e16ff584a2b62b9d6513a6da542a8b2f6d75065409e2149459c3241a1a222c
Deleted: sha256:8416714696fe8af3b41f1b9223340645575b51294a5aac4a5d3789d3fbd7effe
Deleted: sha256:e63ef61bf4553baf8e7ee0d47918d38a452824f0ab075486e26b69f199afdcea
Deleted: sha256:ebd5bf55b3cbb93326046c28ddde4dfe9a3984d468aefac6f14845db99d21415
Deleted: sha256:126f7a975f06441ad1f7760af53bb7d6776887ad2a0db91c74a1c4fe1482eba8
Deleted: sha256:a4bc75a45d6b47b0745caa2d4dcdcbe48bc439b9093709d75856cadc629ebefb
Deleted: sha256:9bcc71b2e5e1df23dfe018ac74124027046b1d521a7c2016e5a27083b5a31a97
Deleted: sha256:79152bae5bfe0c0d786eadd43aed1a3d03a7380e7d85a28bacce2f28bb2efb4c
Deleted: sha256:9866aabb12ac253f0f9161a3499bf5d71fc55ca56f8723d8fc1dd07c7bfdaf8a
Deleted: sha256:2b1bdf85203c8ad737da3b8b3c0699fec7daa21245c066d7565866e2809ffd13
Deleted: sha256:6d34cd2e9c417153cd1de70a5c6f96afb1dbac4c7f79fb3c0756607ac0c86814
Deleted: sha256:2a46a341daa4f04baae8a2f5d8bb8daf23e26f25754339a3bb686e41927574b2
Deleted: sha256:dd773aabe091c73b17d86acf4891098a75cc0c3b295511dcaad5f83b04414667
Deleted: sha256:27255b6a5596a5feddad521a7b59a4b356e76172b5c1be2447f67b169541f560
Deleted: sha256:4b0fc02d954ecadead9feb8067a974f5acb658fd97bdf97acf377506fe854434
Deleted: sha256:4890d47057c4a9636b8f3d0d33aef3181b1002cafbd00d4c373fd3ede44eecbd
Build step 'Execute shell' marked build as failure

Mime
View raw message