mesos-builds mailing list archives

Site index · List index
Message view « Date » · « Thread »
Top « Date » · « Thread »
From Apache Jenkins Server <jenk...@builds.apache.org>
Subject Build failed in Jenkins: Mesos-Buildbot » cmake,gcc,--verbose --enable-libevent --enable-ssl,GLOG_v=1 MESOS_VERBOSE=1,ubuntu:14.04,(docker||Hadoop)&&(!ubuntu-us1)&&(!ubuntu-eu2) #3581
Date Sat, 29 Apr 2017 04:05:17 GMT
See <https://builds.apache.org/job/Mesos-Buildbot/BUILDTOOL=cmake,COMPILER=gcc,CONFIGURATION=--verbose%20--enable-libevent%20--enable-ssl,ENVIRONMENT=GLOG_v=1%20MESOS_VERBOSE=1,OS=ubuntu%3A14.04,label_exp=(docker%7C%7CHadoop)&&(!ubuntu-us1)&&(!ubuntu-eu2)/3581/display/redirect?page=changes>

Changes:

[xujyan] Added and implemented RegisterAgent ACL.

[xujyan] Applied RegisterAgent ACL to the master.

[xujyan] Added `register_agents` to authorization.md.

[xujyan] Fixed example tests which broke due to the new `register_agents` ACL.

[xujyan] Fixed a test in MasterAuthorizationTest.

[xujyan] Logged when an agent (re-)registration request is received.

[xujyan] Avoid a corruption while rescinding offers.

[kapil] Added secret to Volume protobuf.

[xujyan] Fix perf-stat parsing for recent perf releases.

[bmahler] Fixed the implementation of per-role Suppress / Revive calls.

[bmahler] Updated Suppress / Revive calls to take multiple roles.

[xujyan] Remove unnecessary perf version checks.

------------------------------------------
[...truncated 26.42 MB...]
I0429 04:04:55.603924   993 slave.cpp:6145] Querying resource estimator for oversubscribable
resources
I0429 04:04:55.604064   993 slave.cpp:6159] Received oversubscribable resources {} from the
resource estimator
I0429 04:04:55.605118   992 process.cpp:3731] Handling HTTP event for process 'slave(746)'
with path: '/slave(746)/containers'
I0429 04:04:55.605942   981 http.cpp:1115] HTTP GET for /slave(746)/containers from 172.17.0.2:60610
I0429 04:04:55.606050   981 http.cpp:936] Authorizing principal 'test-principal' to GET the
'/containers' endpoint
I0429 04:04:55.608472   994 slave.cpp:790] Agent terminating
[       OK ] Endpoint/SlaveEndpointTest.AuthorizedRequest/2 (15 ms)
[ RUN      ] Endpoint/SlaveEndpointTest.UnauthorizedRequest/0
I0429 04:04:55.628482 27765 containerizer.cpp:221] Using isolation: posix/cpu,posix/mem,filesystem/posix,network/cni
W0429 04:04:55.628796 27765 backend.cpp:76] Failed to create 'aufs' backend: AufsBackend requires
root privileges
W0429 04:04:55.628841 27765 backend.cpp:76] Failed to create 'bind' backend: BindBackend requires
root privileges
I0429 04:04:55.628901 27765 provisioner.cpp:249] Using default backend 'copy'
I0429 04:04:55.630206   988 slave.cpp:225] Mesos agent started on (747)@172.17.0.2:51535
I0429 04:04:55.630234   988 slave.cpp:226] Flags at startup: --acls="" --appc_simple_discovery_uri_prefix="http://"
--appc_store_dir="/tmp/mesos/store/appc" --authenticate_http_executors="true" --authenticate_http_readonly="true"
--authenticate_http_readwrite="true" --authenticatee="crammd5" --authentication_backoff_factor="1secs"
--authorizer="local" --cgroups_cpu_enable_pids_and_tids_count="false" --cgroups_enable_cfs="false"
--cgroups_hierarchy="/sys/fs/cgroup" --cgroups_limit_swap="false" --cgroups_root="mesos" --container_disk_watch_interval="15secs"
--containerizers="mesos" --credential="/tmp/Endpoint_SlaveEndpointTest_UnauthorizedRequest_0_6BNLvm/credential"
--default_role="*" --disk_watch_interval="1mins" --docker="docker" --docker_kill_orphans="true"
--docker_registry="https://registry-1.docker.io" --docker_remove_delay="6hrs" --docker_socket="/var/run/docker.sock"
--docker_stop_timeout="0ns" --docker_store_dir="/tmp/mesos/store/docker" --docker_volume_checkpoint_dir="/var/run/mesos/isolators/docker/volume"
--enforce_container_disk_quota="false" --executor_registration_timeout="1mins" --executor_secret_key="/tmp/Endpoint_SlaveEndpointTest_UnauthorizedRequest_0_6BNLvm/executor_secret_key"
--executor_shutdown_grace_period="5secs" --fetcher_cache_dir="/tmp/Endpoint_SlaveEndpointTest_UnauthorizedRequest_0_6BNLvm/fetch"
--fetcher_cache_size="2GB" --frameworks_home="" --gc_delay="1weeks" --gc_disk_headroom="0.1"
--hadoop_home="" --help="false" --hostname_lookup="true" --http_command_executor="false" --http_credentials="/tmp/Endpoint_SlaveEndpointTest_UnauthorizedRequest_0_6BNLvm/http_credentials"
--http_heartbeat_interval="30secs" --initialize_driver_logging="true" --isolation="posix/cpu,posix/mem"
--launcher="posix" --launcher_dir="/mesos/build/src" --logbufsecs="0" --logging_level="INFO"
--max_completed_executors_per_framework="150" --oversubscribed_resources_interval="15secs"
--perf_duration="10secs" --perf_interval="1mins" --port="5051" --qos_correction_interval_min="0ns"
--quiet="false" --recover="reconnect" --recovery_timeout="15mins" --registration_backoff_factor="10ms"
--resources="cpus:2;gpus:0;mem:1024;disk:1024;ports:[31000-32000]" --revocable_cpu_low_priority="true"
--runtime_dir="/tmp/Endpoint_SlaveEndpointTest_UnauthorizedRequest_0_6BNLvm" --sandbox_directory="/mnt/mesos/sandbox"
--strict="true" --switch_user="true" --systemd_enable_support="true" --systemd_runtime_directory="/run/systemd/system"
--version="false" --work_dir="/tmp/Endpoint_SlaveEndpointTest_UnauthorizedRequest_0_NfWrFI"
I0429 04:04:55.630473   988 credentials.hpp:86] Loading credential for authentication from
'/tmp/Endpoint_SlaveEndpointTest_UnauthorizedRequest_0_6BNLvm/credential'
I0429 04:04:55.630605   988 slave.cpp:258] Agent using credential for: test-principal
I0429 04:04:55.630619   988 credentials.hpp:37] Loading credentials for authentication from
'/tmp/Endpoint_SlaveEndpointTest_UnauthorizedRequest_0_6BNLvm/http_credentials'
I0429 04:04:55.630765   988 http.cpp:975] Creating default 'basic' HTTP authenticator for
realm 'mesos-agent-executor'
I0429 04:04:55.630820   988 http.cpp:996] Creating default 'jwt' HTTP authenticator for realm
'mesos-agent-executor'
I0429 04:04:55.630897   988 http.cpp:975] Creating default 'basic' HTTP authenticator for
realm 'mesos-agent-readonly'
I0429 04:04:55.630923   988 http.cpp:996] Creating default 'jwt' HTTP authenticator for realm
'mesos-agent-readonly'
I0429 04:04:55.630964   988 http.cpp:975] Creating default 'basic' HTTP authenticator for
realm 'mesos-agent-readwrite'
I0429 04:04:55.630985   988 http.cpp:996] Creating default 'jwt' HTTP authenticator for realm
'mesos-agent-readwrite'
I0429 04:04:55.631428   988 slave.cpp:525] Agent resources: cpus(*):2; mem(*):1024; disk(*):1024;
ports(*):[31000-32000]
I0429 04:04:55.631466   988 slave.cpp:533] Agent attributes: [  ]
I0429 04:04:55.631472   988 slave.cpp:538] Agent hostname: 89e232596a23
I0429 04:04:55.631551   985 status_update_manager.cpp:177] Pausing sending status updates
I0429 04:04:55.631925   990 state.cpp:62] Recovering state from '/tmp/Endpoint_SlaveEndpointTest_UnauthorizedRequest_0_NfWrFI/meta'
I0429 04:04:55.632097   990 status_update_manager.cpp:203] Recovering status update manager
I0429 04:04:55.632163   990 containerizer.cpp:608] Recovering containerizer
I0429 04:04:55.632563   990 provisioner.cpp:410] Provisioner recovery complete
I0429 04:04:55.632699   990 slave.cpp:5963] Finished recovery
I0429 04:04:55.633078   990 slave.cpp:6145] Querying resource estimator for oversubscribable
resources
I0429 04:04:55.633227   990 slave.cpp:6159] Received oversubscribable resources {} from the
resource estimator
I0429 04:04:55.634019   983 process.cpp:3731] Handling HTTP event for process 'slave(747)'
with path: '/slave(747)/monitor/statistics'
I0429 04:04:55.634712   994 http.cpp:1115] HTTP GET for /slave(747)/monitor/statistics from
172.17.0.2:60613
I0429 04:04:55.634795   994 http.cpp:936] Authorizing principal 'test-principal' to GET the
'/monitor/statistics' endpoint
I0429 04:04:55.636323   994 slave.cpp:790] Agent terminating
[       OK ] Endpoint/SlaveEndpointTest.UnauthorizedRequest/0 (12 ms)
[ RUN      ] Endpoint/SlaveEndpointTest.UnauthorizedRequest/1
I0429 04:04:55.658042 27765 containerizer.cpp:221] Using isolation: posix/cpu,posix/mem,filesystem/posix,network/cni
W0429 04:04:55.658360 27765 backend.cpp:76] Failed to create 'aufs' backend: AufsBackend requires
root privileges
W0429 04:04:55.658401 27765 backend.cpp:76] Failed to create 'bind' backend: BindBackend requires
root privileges
I0429 04:04:55.658419 27765 provisioner.cpp:249] Using default backend 'copy'
I0429 04:04:55.659826   986 slave.cpp:225] Mesos agent started on (748)@172.17.0.2:51535
I0429 04:04:55.659855   986 slave.cpp:226] Flags at startup: --acls="" --appc_simple_discovery_uri_prefix="http://"
--appc_store_dir="/tmp/mesos/store/appc" --authenticate_http_executors="true" --authenticate_http_readonly="true"
--authenticate_http_readwrite="true" --authenticatee="crammd5" --authentication_backoff_factor="1secs"
--authorizer="local" --cgroups_cpu_enable_pids_and_tids_count="false" --cgroups_enable_cfs="false"
--cgroups_hierarchy="/sys/fs/cgroup" --cgroups_limit_swap="false" --cgroups_root="mesos" --container_disk_watch_interval="15secs"
--containerizers="mesos" --credential="/tmp/Endpoint_SlaveEndpointTest_UnauthorizedRequest_1_YSsa8V/credential"
--default_role="*" --disk_watch_interval="1mins" --docker="docker" --docker_kill_orphans="true"
--docker_registry="https://registry-1.docker.io" --docker_remove_delay="6hrs" --docker_socket="/var/run/docker.sock"
--docker_stop_timeout="0ns" --docker_store_dir="/tmp/mesos/store/docker" --docker_volume_checkpoint_dir="/var/run/mesos/isolators/docker/volume"
--enforce_container_disk_quota="false" --executor_registration_timeout="1mins" --executor_secret_key="/tmp/Endpoint_SlaveEndpointTest_UnauthorizedRequest_1_YSsa8V/executor_secret_key"
--executor_shutdown_grace_period="5secs" --fetcher_cache_dir="/tmp/Endpoint_SlaveEndpointTest_UnauthorizedRequest_1_YSsa8V/fetch"
--fetcher_cache_size="2GB" --frameworks_home="" --gc_delay="1weeks" --gc_disk_headroom="0.1"
--hadoop_home="" --help="false" --hostname_lookup="true" --http_command_executor="false" --http_credentials="/tmp/Endpoint_SlaveEndpointTest_UnauthorizedRequest_1_YSsa8V/http_credentials"
--http_heartbeat_interval="30secs" --initialize_driver_logging="true" --isolation="posix/cpu,posix/mem"
--launcher="posix" --launcher_dir="/mesos/build/src" --logbufsecs="0" --logging_level="INFO"
--max_completed_executors_per_framework="150" --oversubscribed_resources_interval="15secs"
--perf_duration="10secs" --perf_interval="1mins" --port="5051" --qos_correction_interval_min="0ns"
--quiet="false" --recover="reconnect" --recovery_timeout="15mins" --registration_backoff_factor="10ms"
--resources="cpus:2;gpus:0;mem:1024;disk:1024;ports:[31000-32000]" --revocable_cpu_low_priority="true"
--runtime_dir="/tmp/Endpoint_SlaveEndpointTest_UnauthorizedRequest_1_YSsa8V" --sandbox_directory="/mnt/mesos/sandbox"
--strict="true" --switch_user="true" --systemd_enable_support="true" --systemd_runtime_directory="/run/systemd/system"
--version="false" --work_dir="/tmp/Endpoint_SlaveEndpointTest_UnauthorizedRequest_1_beM3ci"
I0429 04:04:55.660137   986 credentials.hpp:86] Loading credential for authentication from
'/tmp/Endpoint_SlaveEndpointTest_UnauthorizedRequest_1_YSsa8V/credential'
I0429 04:04:55.660265   986 slave.cpp:258] Agent using credential for: test-principal
I0429 04:04:55.660280   986 credentials.hpp:37] Loading credentials for authentication from
'/tmp/Endpoint_SlaveEndpointTest_UnauthorizedRequest_1_YSsa8V/http_credentials'
I0429 04:04:55.660477   986 http.cpp:975] Creating default 'basic' HTTP authenticator for
realm 'mesos-agent-executor'
I0429 04:04:55.660545   986 http.cpp:996] Creating default 'jwt' HTTP authenticator for realm
'mesos-agent-executor'
I0429 04:04:55.660627   986 http.cpp:975] Creating default 'basic' HTTP authenticator for
realm 'mesos-agent-readonly'
I0429 04:04:55.660683   986 http.cpp:996] Creating default 'jwt' HTTP authenticator for realm
'mesos-agent-readonly'
I0429 04:04:55.660830   986 http.cpp:975] Creating default 'basic' HTTP authenticator for
realm 'mesos-agent-readwrite'
I0429 04:04:55.660882   986 http.cpp:996] Creating default 'jwt' HTTP authenticator for realm
'mesos-agent-readwrite'
I0429 04:04:55.661371   986 slave.cpp:525] Agent resources: cpus(*):2; mem(*):1024; disk(*):1024;
ports(*):[31000-32000]
I0429 04:04:55.661412   986 slave.cpp:533] Agent attributes: [  ]
I0429 04:04:55.661420   986 slave.cpp:538] Agent hostname: 89e232596a23
I0429 04:04:55.661496   991 status_update_manager.cpp:177] Pausing sending status updates
I0429 04:04:55.661798   988 state.cpp:62] Recovering state from '/tmp/Endpoint_SlaveEndpointTest_UnauthorizedRequest_1_beM3ci/meta'
I0429 04:04:55.661941   985 status_update_manager.cpp:203] Recovering status update manager
I0429 04:04:55.662067   992 containerizer.cpp:608] Recovering containerizer
I0429 04:04:55.662616   987 provisioner.cpp:410] Provisioner recovery complete
I0429 04:04:55.662817   980 slave.cpp:5963] Finished recovery
I0429 04:04:55.663282   980 slave.cpp:6145] Querying resource estimator for oversubscribable
resources
I0429 04:04:55.663405   980 slave.cpp:6159] Received oversubscribable resources {} from the
resource estimator
I0429 04:04:55.664144   989 process.cpp:3731] Handling HTTP event for process 'slave(748)'
with path: '/slave(748)/monitor/statistics.json'
I0429 04:04:55.664707   986 http.cpp:1115] HTTP GET for /slave(748)/monitor/statistics.json
from 172.17.0.2:60617
I0429 04:04:55.664746   986 http.cpp:936] Authorizing principal 'test-principal' to GET the
'/monitor/statistics.json' endpoint
I0429 04:04:55.665912   990 slave.cpp:790] Agent terminating
[       OK ] Endpoint/SlaveEndpointTest.UnauthorizedRequest/1 (12 ms)
[ RUN      ] Endpoint/SlaveEndpointTest.UnauthorizedRequest/2
I0429 04:04:55.722803 27765 containerizer.cpp:221] Using isolation: posix/cpu,posix/mem,filesystem/posix,network/cni
W0429 04:04:55.723081 27765 backend.cpp:76] Failed to create 'aufs' backend: AufsBackend requires
root privileges
W0429 04:04:55.723129 27765 backend.cpp:76] Failed to create 'bind' backend: BindBackend requires
root privileges
I0429 04:04:55.723148 27765 provisioner.cpp:249] Using default backend 'copy'
I0429 04:04:55.724191   982 slave.cpp:225] Mesos agent started on (749)@172.17.0.2:51535
I0429 04:04:55.724215   982 slave.cpp:226] Flags at startup: --acls="" --appc_simple_discovery_uri_prefix="http://"
--appc_store_dir="/tmp/mesos/store/appc" --authenticate_http_executors="true" --authenticate_http_readonly="true"
--authenticate_http_readwrite="true" --authenticatee="crammd5" --authentication_backoff_factor="1secs"
--authorizer="local" --cgroups_cpu_enable_pids_and_tids_count="false" --cgroups_enable_cfs="false"
--cgroups_hierarchy="/sys/fs/cgroup" --cgroups_limit_swap="false" --cgroups_root="mesos" --container_disk_watch_interval="15secs"
--containerizers="mesos" --credential="/tmp/Endpoint_SlaveEndpointTest_UnauthorizedRequest_2_oj83kw/credential"
--default_role="*" --disk_watch_interval="1mins" --docker="docker" --docker_kill_orphans="true"
--docker_registry="https://registry-1.docker.io" --docker_remove_delay="6hrs" --docker_socket="/var/run/docker.sock"
--docker_stop_timeout="0ns" --docker_store_dir="/tmp/mesos/store/docker" --docker_volume_checkpoint_dir="/var/run/mesos/isolators/docker/volume"
--enforce_container_disk_quota="false" --executor_registration_timeout="1mins" --executor_secret_key="/tmp/Endpoint_SlaveEndpointTest_UnauthorizedRequest_2_oj83kw/executor_secret_key"
--executor_shutdown_grace_period="5secs" --fetcher_cache_dir="/tmp/Endpoint_SlaveEndpointTest_UnauthorizedRequest_2_oj83kw/fetch"
--fetcher_cache_size="2GB" --frameworks_home="" --gc_delay="1weeks" --gc_disk_headroom="0.1"
--hadoop_home="" --help="false" --hostname_lookup="true" --http_command_executor="false" --http_credentials="/tmp/Endpoint_SlaveEndpointTest_UnauthorizedRequest_2_oj83kw/http_credentials"
--http_heartbeat_interval="30secs" --initialize_driver_logging="true" --isolation="posix/cpu,posix/mem"
--launcher="posix" --launcher_dir="/mesos/build/src" --logbufsecs="0" --logging_level="INFO"
--max_completed_executors_per_framework="150" --oversubscribed_resources_interval="15secs"
--perf_duration="10secs" --perf_interval="1mins" --port="5051" --qos_correction_interval_min="0ns"
--quiet="false" --recover="reconnect" --recovery_timeout="15mins" --registration_backoff_factor="10ms"
--resources="cpus:2;gpus:0;mem:1024;disk:1024;ports:[31000-32000]" --revocable_cpu_low_priority="true"
--runtime_dir="/tmp/Endpoint_SlaveEndpointTest_UnauthorizedRequest_2_oj83kw" --sandbox_directory="/mnt/mesos/sandbox"
--strict="true" --switch_user="true" --systemd_enable_support="true" --systemd_runtime_directory="/run/systemd/system"
--version="false" --work_dir="/tmp/Endpoint_SlaveEndpointTest_UnauthorizedRequest_2_3QbqfS"
I0429 04:04:55.724480   982 credentials.hpp:86] Loading credential for authentication from
'/tmp/Endpoint_SlaveEndpointTest_UnauthorizedRequest_2_oj83kw/credential'
I0429 04:04:55.724591   982 slave.cpp:258] Agent using credential for: test-principal
I0429 04:04:55.724601   982 credentials.hpp:37] Loading credentials for authentication from
'/tmp/Endpoint_SlaveEndpointTest_UnauthorizedRequest_2_oj83kw/http_credentials'
I0429 04:04:55.724743   982 http.cpp:975] Creating default 'basic' HTTP authenticator for
realm 'mesos-agent-executor'
I0429 04:04:55.724789   982 http.cpp:996] Creating default 'jwt' HTTP authenticator for realm
'mesos-agent-executor'
I0429 04:04:55.724921   982 http.cpp:975] Creating default 'basic' HTTP authenticator for
realm 'mesos-agent-readonly'
I0429 04:04:55.724959   982 http.cpp:996] Creating default 'jwt' HTTP authenticator for realm
'mesos-agent-readonly'
I0429 04:04:55.725051   982 http.cpp:975] Creating default 'basic' HTTP authenticator for
realm 'mesos-agent-readwrite'
I0429 04:04:55.725085   982 http.cpp:996] Creating default 'jwt' HTTP authenticator for realm
'mesos-agent-readwrite'
I0429 04:04:55.725507   982 slave.cpp:525] Agent resources: cpus(*):2; mem(*):1024; disk(*):1024;
ports(*):[31000-32000]
I0429 04:04:55.725543   982 slave.cpp:533] Agent attributes: [  ]
I0429 04:04:55.725548   982 slave.cpp:538] Agent hostname: 89e232596a23
I0429 04:04:55.725636   986 status_update_manager.cpp:177] Pausing sending status updates
I0429 04:04:55.725916   994 state.cpp:62] Recovering state from '/tmp/Endpoint_SlaveEndpointTest_UnauthorizedRequest_2_3QbqfS/meta'
I0429 04:04:55.726045   986 status_update_manager.cpp:203] Recovering status update manager
I0429 04:04:55.726207   988 containerizer.cpp:608] Recovering containerizer
I0429 04:04:55.726692   992 provisioner.cpp:410] Provisioner recovery complete
I0429 04:04:55.726866   993 slave.cpp:5963] Finished recovery
I0429 04:04:55.727233   993 slave.cpp:6145] Querying resource estimator for oversubscribable
resources
I0429 04:04:55.727346   981 slave.cpp:6159] Received oversubscribable resources {} from the
resource estimator
I0429 04:04:55.728097   990 process.cpp:3731] Handling HTTP event for process 'slave(749)'
with path: '/slave(749)/containers'
I0429 04:04:55.728634   986 http.cpp:1115] HTTP GET for /slave(749)/containers from 172.17.0.2:60621
I0429 04:04:55.728674   986 http.cpp:936] Authorizing principal 'test-principal' to GET the
'/containers' endpoint
I0429 04:04:55.729890   982 slave.cpp:790] Agent terminating
[       OK ] Endpoint/SlaveEndpointTest.UnauthorizedRequest/2 (12 ms)
[ RUN      ] Endpoint/SlaveEndpointTest.NoAuthorizer/0
I0429 04:04:55.745478 27765 containerizer.cpp:221] Using isolation: posix/cpu,posix/mem,filesystem/posix,network/cni
W0429 04:04:55.745781 27765 backend.cpp:76] Failed to create 'aufs' backend: AufsBackend requires
root privileges
W0429 04:04:55.745816 27765 backend.cpp:76] Failed to create 'bind' backend: BindBackend requires
root privileges
I0429 04:04:55.745827 27765 provisioner.cpp:249] Using default backend 'copy'
I0429 04:04:55.746474 27765 cluster.cpp:448] Creating default 'local' authorizer
I0429 04:04:55.746964   980 slave.cpp:225] Mesos agent started on (750)@172.17.0.2:51535
I0429 04:04:55.746978   980 slave.cpp:226] Flags at startup: --acls="" --appc_simple_discovery_uri_prefix="http://"
--appc_store_dir="/tmp/mesos/store/appc" --authenticate_http_executors="true" --authenticate_http_readonly="true"
--authenticate_http_readwrite="true" --authenticatee="crammd5" --authentication_backoff_factor="1secs"
--authorizer="local" --cgroups_cpu_enable_pids_and_tids_count="false" --cgroups_enable_cfs="false"
--cgroups_hierarchy="/sys/fs/cgroup" --cgroups_limit_swap="false" --cgroups_root="mesos" --container_disk_watch_interval="15secs"
--containerizers="mesos" --credential="/tmp/Endpoint_SlaveEndpointTest_NoAuthorizer_0_uYO9S6/credential"
--default_role="*" --disk_watch_interval="1mins" --docker="docker" --docker_kill_orphans="true"
--docker_registry="https://registry-1.docker.io" --docker_remove_delay="6hrs" --docker_socket="/var/run/docker.sock"
--docker_stop_timeout="0ns" --docker_store_dir="/tmp/mesos/store/docker" --docker_volume_checkpoint_dir="/var/run/mesos/isolators/docker/volume"
--enforce_container_disk_quota="false" --executor_registration_timeout="1mins" --executor_secret_key="/tmp/Endpoint_SlaveEndpointTest_NoAuthorizer_0_uYO9S6/executor_secret_key"
--executor_shutdown_grace_period="5secs" --fetcher_cache_dir="/tmp/Endpoint_SlaveEndpointTest_NoAuthorizer_0_uYO9S6/fetch"
--fetcher_cache_size="2GB" --frameworks_home="" --gc_delay="1weeks" --gc_disk_headroom="0.1"
--hadoop_home="" --help="false" --hostname_lookup="true" --http_command_executor="false" --http_credentials="/tmp/Endpoint_SlaveEndpointTest_NoAuthorizer_0_uYO9S6/http_credentials"
--http_heartbeat_interval="30secs" --initialize_driver_logging="true" --isolation="posix/cpu,posix/mem"
--launcher="posix" --launcher_dir="/mesos/build/src" --logbufsecs="0" --logging_level="INFO"
--max_completed_executors_per_framework="150" --oversubscribed_resources_interval="15secs"
--perf_duration="10secs" --perf_interval="1mins" --port="5051" --qos_correction_interval_min="0ns"
--quiet="false" --recover="reconnect" --recovery_timeout="15mins" --registration_backoff_factor="10ms"
--resources="cpus:2;gpus:0;mem:1024;disk:1024;ports:[31000-32000]" --revocable_cpu_low_priority="true"
--runtime_dir="/tmp/Endpoint_SlaveEndpointTest_NoAuthorizer_0_uYO9S6" --sandbox_directory="/mnt/mesos/sandbox"
--strict="true" --switch_user="true" --systemd_enable_support="true" --systemd_runtime_directory="/run/systemd/system"
--version="false" --work_dir="/tmp/Endpoint_SlaveEndpointTest_NoAuthorizer_0_nsVUJs"
I0429 04:04:55.747193   980 credentials.hpp:86] Loading credential for authentication from
'/tmp/Endpoint_SlaveEndpointTest_NoAuthorizer_0_uYO9S6/credential'
I0429 04:04:55.747278   980 slave.cpp:258] Agent using credential for: test-principal
I0429 04:04:55.747290   980 credentials.hpp:37] Loading credentials for authentication from
'/tmp/Endpoint_SlaveEndpointTest_NoAuthorizer_0_uYO9S6/http_credentials'
I0429 04:04:55.747431   980 http.cpp:975] Creating default 'basic' HTTP authenticator for
realm 'mesos-agent-executor'
I0429 04:04:55.747483   980 http.cpp:996] Creating default 'jwt' HTTP authenticator for realm
'mesos-agent-executor'
I0429 04:04:55.747699   980 http.cpp:975] Creating default 'basic' HTTP authenticator for
realm 'mesos-agent-readonly'
I0429 04:04:55.747740   980 http.cpp:996] Creating default 'jwt' HTTP authenticator for realm
'mesos-agent-readonly'
I0429 04:04:55.747838   980 http.cpp:975] Creating default 'basic' HTTP authenticator for
realm 'mesos-agent-readwrite'
I0429 04:04:55.747877   980 http.cpp:996] Creating default 'jwt' HTTP authenticator for realm
'mesos-agent-readwrite'
I0429 04:04:55.748313   980 slave.cpp:525] Agent resources: cpus(*):2; mem(*):1024; disk(*):1024;
ports(*):[31000-32000]
I0429 04:04:55.748349   980 slave.cpp:533] Agent attributes: [  ]
I0429 04:04:55.748356   980 slave.cpp:538] Agent hostname: 89e232596a23
I0429 04:04:55.748438   995 status_update_manager.cpp:177] Pausing sending status updates
I0429 04:04:55.748883   984 state.cpp:62] Recovering state from '/tmp/Endpoint_SlaveEndpointTest_NoAuthorizer_0_nsVUJs/meta'
I0429 04:04:55.749079   984 status_update_manager.cpp:203] Recovering status update manager
I0429 04:04:55.749204   994 containerizer.cpp:608] Recovering containerizer
I0429 04:04:55.749816   980 provisioner.cpp:410] Provisioner recovery complete
I0429 04:04:55.750010   991 slave.cpp:5963] Finished recovery
I0429 04:04:55.750416   991 slave.cpp:6145] Querying resource estimator for oversubscribable
resources
I0429 04:04:55.750568   988 slave.cpp:6159] Received oversubscribable resources {} from the
resource estimator
I0429 04:04:55.751646   992 process.cpp:3731] Handling HTTP event for process 'slave(750)'
with path: '/slave(750)/monitor/statistics'
I0429 04:04:55.752055   992 http.cpp:1115] HTTP GET for /slave(750)/monitor/statistics from
172.17.0.2:60622
I0429 04:04:55.752091   992 http.cpp:936] Authorizing principal 'test-principal' to GET the
'/monitor/statistics' endpoint
I0429 04:04:55.753408 27765 slave.cpp:790] Agent terminating
[       OK ] Endpoint/SlaveEndpointTest.NoAuthorizer/0 (17 ms)
[ RUN      ] Endpoint/SlaveEndpointTest.NoAuthorizer/1
I0429 04:04:55.798215 27765 containerizer.cpp:221] Using isolation: posix/cpu,posix/mem,filesystem/posix,network/cni
W0429 04:04:55.798480 27765 backend.cpp:76] Failed to create 'aufs' backend: AufsBackend requires
root privileges
W0429 04:04:55.798516 27765 backend.cpp:76] Failed to create 'bind' backend: BindBackend requires
root privileges
I0429 04:04:55.798527 27765 provisioner.cpp:249] Using default backend 'copy'
I0429 04:04:55.799211 27765 cluster.cpp:448] Creating default 'local' authorizer
I0429 04:04:55.799834   985 slave.cpp:225] Mesos agent started on (751)@172.17.0.2:51535
I0429 04:04:55.799851   985 slave.cpp:226] Flags at startup: --acls="" --appc_simple_discovery_uri_prefix="http://"
--appc_store_dir="/tmp/mesos/store/appc" --authenticate_http_executors="true" --authenticate_http_readonly="true"
--authenticate_http_readwrite="true" --authenticatee="crammd5" --authentication_backoff_factor="1secs"
--authorizer="local" --cgroups_cpu_enable_pids_and_tids_count="false" --cgroups_enable_cfs="false"
--cgroups_hierarchy="/sys/fs/cgroup" --cgroups_limit_swap="false" --cgroups_root="mesos" --container_disk_watch_interval="15secs"
--containerizers="mesos" --credential="/tmp/Endpoint_SlaveEndpointTest_NoAuthorizer_1_WP2RUH/credential"
--default_role="*" --disk_watch_interval="1mins" --docker="docker" --docker_kill_orphans="true"
--docker_registry="https://registry-1.docker.io" --docker_remove_delay="6hrs" --docker_socket="/var/run/docker.sock"
--docker_stop_timeout="0ns" --docker_store_dir="/tmp/mesos/store/docker" --docker_volume_checkpoint_dir="/var/run/mesos/isolators/docker/volume"
--enforce_container_disk_quota="false" --executor_registration_timeout="1mins" --executor_secret_key="/tmp/Endpoint_SlaveEndpointTest_NoAuthorizer_1_WP2RUH/executor_secret_key"
--executor_shutdown_grace_period="5secs" --fetcher_cache_dir="/tmp/Endpoint_SlaveEndpointTest_NoAuthorizer_1_WP2RUH/fetch"
--fetcher_cache_size="2GB" --frameworks_home="" --gc_delay="1weeks" --gc_disk_headroom="0.1"
--hadoop_home="" --help="false" --hostname_lookup="true" --http_command_executor="false" --http_credentials="/tmp/Endpoint_SlaveEndpointTest_NoAuthorizer_1_WP2RUH/http_credentials"
--http_heartbeat_interval="30secs" --initialize_driver_logging="true" --isolation="posix/cpu,posix/mem"
--launcher="posix" --launcher_dir="/mesos/build/src" --logbufsecs="0" --logging_level="INFO"
--max_completed_executors_per_framework="150" --oversubscribed_resources_interval="15secs"
--perf_duration="10secs" --perf_interval="1mins" --port="5051" --qos_correction_interval_min="0ns"
--quiet="false" --recover="reconnect" --recovery_timeout="15mins" --registration_backoff_factor="10ms"
--resources="cpus:2;gpus:0;mem:1024;disk:1024;ports:[31000-32000]" --revocable_cpu_low_priority="true"
--runtime_dir="/tmp/Endpoint_SlaveEndpointTest_NoAuthorizer_1_WP2RUH" --sandbox_directory="/mnt/mesos/sandbox"
--strict="true" --switch_user="true" --systemd_enable_support="true" --systemd_runtime_directory="/run/systemd/system"
--version="false" --work_dir="/tmp/Endpoint_SlaveEndpointTest_NoAuthorizer_1_D2u0C3"
I0429 04:04:55.800113   985 credentials.hpp:86] Loading credential for authentication from
'/tmp/Endpoint_SlaveEndpointTest_NoAuthorizer_1_WP2RUH/credential'
I0429 04:04:55.800254   985 slave.cpp:258] Agent using credential for: test-principal
I0429 04:04:55.800272   985 credentials.hpp:37] Loading credentials for authentication from
'/tmp/Endpoint_SlaveEndpointTest_NoAuthorizer_1_WP2RUH/http_credentials'
I0429 04:04:55.800468   985 http.cpp:975] Creating default 'basic' HTTP authenticator for
realm 'mesos-agent-executor'
I0429 04:04:55.800526   985 http.cpp:996] Creating default 'jwt' HTTP authenticator for realm
'mesos-agent-executor'
I0429 04:04:55.800602   985 http.cpp:975] Creating default 'basic' HTTP authenticator for
realm 'mesos-agent-readonly'
I0429 04:04:55.800642   985 http.cpp:996] Creating default 'jwt' HTTP authenticator for realm
'mesos-agent-readonly'
I0429 04:04:55.800734   985 http.cpp:975] Creating default 'basic' HTTP authenticator for
realm 'mesos-agent-readwrite'
I0429 04:04:55.800778   985 http.cpp:996] Creating default 'jwt' HTTP authenticator for realm
'mesos-agent-readwrite'
I0429 04:04:55.801373   985 slave.cpp:525] Agent resources: cpus(*):2; mem(*):1024; disk(*):1024;
ports(*):[31000-32000]
I0429 04:04:55.801425   985 slave.cpp:533] Agent attributes: [  ]
I0429 04:04:55.801436   985 slave.cpp:538] Agent hostname: 89e232596a23
I0429 04:04:55.801551   986 status_update_manager.cpp:177] Pausing sending status updates
I0429 04:04:55.801895   993 state.cpp:62] Recovering state from '/tmp/Endpoint_SlaveEndpointTest_NoAuthorizer_1_D2u0C3/meta'
I0429 04:04:55.802050   987 status_update_manager.cpp:203] Recovering status update manager
I0429 04:04:55.802114   987 containerizer.cpp:608] Recovering containerizer
I0429 04:04:55.802783   991 provisioner.cpp:410] Provisioner recovery complete
I0429 04:04:55.802985   992 slave.cpp:5963] Finished recovery
I0429 04:04:55.803323   992 slave.cpp:6145] Querying resource estimator for oversubscribable
resources
I0429 04:04:55.803437   988 slave.cpp:6159] Received oversubscribable resources {} from the
resource estimator
I0429 04:04:55.804267   985 process.cpp:3731] Handling HTTP event for process 'slave(751)'
with path: '/slave(751)/monitor/statistics.json'
I0429 04:04:55.804886   988 http.cpp:1115] HTTP GET for /slave(751)/monitor/statistics.json
from 172.17.0.2:60624
I0429 04:04:55.804931   988 http.cpp:936] Authorizing principal 'test-principal' to GET the
'/monitor/statistics.json' endpoint
I0429 04:04:55.806062   994 slave.cpp:790] Agent terminating
[       OK ] Endpoint/SlaveEndpointTest.NoAuthorizer/1 (13 ms)
[ RUN      ] Endpoint/SlaveEndpointTest.NoAuthorizer/2
I0429 04:04:55.873760 27765 containerizer.cpp:221] Using isolation: posix/cpu,posix/mem,filesystem/posix,network/cni
W0429 04:04:55.874045 27765 backend.cpp:76] Failed to create 'aufs' backend: AufsBackend requires
root privileges
W0429 04:04:55.874094 27765 backend.cpp:76] Failed to create 'bind' backend: BindBackend requires
root privileges
I0429 04:04:55.874114 27765 provisioner.cpp:249] Using default backend 'copy'
I0429 04:04:55.874933 27765 cluster.cpp:448] Creating default 'local' authorizer
I0429 04:04:55.875684   988 slave.cpp:225] Mesos agent started on (752)@172.17.0.2:51535
I0429 04:04:55.875701   988 slave.cpp:226] Flags at startup: --acls="" --appc_simple_discovery_uri_prefix="http://"
--appc_store_dir="/tmp/mesos/store/appc" --authenticate_http_executors="true" --authenticate_http_readonly="true"
--authenticate_http_readwrite="true" --authenticatee="crammd5" --authentication_backoff_factor="1secs"
--authorizer="local" --cgroups_cpu_enable_pids_and_tids_count="false" --cgroups_enable_cfs="false"
--cgroups_hierarchy="/sys/fs/cgroup" --cgroups_limit_swap="false" --cgroups_root="mesos" --container_disk_watch_interval="15secs"
--containerizers="mesos" --credential="/tmp/Endpoint_SlaveEndpointTest_NoAuthorizer_2_WeB0Fj/credential"
--default_role="*" --disk_watch_interval="1mins" --docker="docker" --docker_kill_orphans="true"
--docker_registry="https://registry-1.docker.io" --docker_remove_delay="6hrs" --docker_socket="/var/run/docker.sock"
--docker_stop_timeout="0ns" --docker_store_dir="/tmp/mesos/store/docker" --docker_volume_checkpoint_dir="/var/run/mesos/isolators/docker/volume"
--enforce_container_disk_quota="false" --executor_registration_timeout="1mins" --executor_secret_key="/tmp/Endpoint_SlaveEndpointTest_NoAuthorizer_2_WeB0Fj/executor_secret_key"
--executor_shutdown_grace_period="5secs" --fetcher_cache_dir="/tmp/Endpoint_SlaveEndpointTest_NoAuthorizer_2_WeB0Fj/fetch"
--fetcher_cache_size="2GB" --frameworks_home="" --gc_delay="1weeks" --gc_disk_headroom="0.1"
--hadoop_home="" --help="false" --hostname_lookup="true" --http_command_executor="false" --http_credentials="/tmp/Endpoint_SlaveEndpointTest_NoAuthorizer_2_WeB0Fj/http_credentials"
--http_heartbeat_interval="30secs" --initialize_driver_logging="true" --isolation="posix/cpu,posix/mem"
--launcher="posix" --launcher_dir="/mesos/build/src" --logbufsecs="0" --logging_level="INFO"
--max_completed_executors_per_framework="150" --oversubscribed_resources_interval="15secs"
--perf_duration="10secs" --perf_interval="1mins" --port="5051" --qos_correction_interval_min="0ns"
--quiet="false" --recover="reconnect" --recovery_timeout="15mins" --registration_backoff_factor="10ms"
--resources="cpus:2;gpus:0;mem:1024;disk:1024;ports:[31000-32000]" --revocable_cpu_low_priority="true"
--runtime_dir="/tmp/Endpoint_SlaveEndpointTest_NoAuthorizer_2_WeB0Fj" --sandbox_directory="/mnt/mesos/sandbox"
--strict="true" --switch_user="true" --systemd_enable_support="true" --systemd_runtime_directory="/run/systemd/system"
--version="false" --work_dir="/tmp/Endpoint_SlaveEndpointTest_NoAuthorizer_2_NXZRbF"
I0429 04:04:55.875922   988 credentials.hpp:86] Loading credential for authentication from
'/tmp/Endpoint_SlaveEndpointTest_NoAuthorizer_2_WeB0Fj/credential'
I0429 04:04:55.876027   988 slave.cpp:258] Agent using credential for: test-principal
I0429 04:04:55.876040   988 credentials.hpp:37] Loading credentials for authentication from
'/tmp/Endpoint_SlaveEndpointTest_NoAuthorizer_2_WeB0Fj/http_credentials'
I0429 04:04:55.876229   988 http.cpp:975] Creating default 'basic' HTTP authenticator for
realm 'mesos-agent-executor'
I0429 04:04:55.876272   988 http.cpp:996] Creating default 'jwt' HTTP authenticator for realm
'mesos-agent-executor'
I0429 04:04:55.876348   988 http.cpp:975] Creating default 'basic' HTTP authenticator for
realm 'mesos-agent-readonly'
I0429 04:04:55.876368   988 http.cpp:996] Creating default 'jwt' HTTP authenticator for realm
'mesos-agent-readonly'
I0429 04:04:55.876420   988 http.cpp:975] Creating default 'basic' HTTP authenticator for
realm 'mesos-agent-readwrite'
I0429 04:04:55.876441   988 http.cpp:996] Creating default 'jwt' HTTP authenticator for realm
'mesos-agent-readwrite'
I0429 04:04:55.876972   988 slave.cpp:525] Agent resources: cpus(*):2; mem(*):1024; disk(*):1024;
ports(*):[31000-32000]
I0429 04:04:55.877009   988 slave.cpp:533] Agent attributes: [  ]
I0429 04:04:55.877014   988 slave.cpp:538] Agent hostname: 89e232596a23
I0429 04:04:55.877334   988 status_update_manager.cpp:177] Pausing sending status updates
I0429 04:04:55.877679   988 state.cpp:62] Recovering state from '/tmp/Endpoint_SlaveEndpointTest_NoAuthorizer_2_NXZRbF/meta'
I0429 04:04:55.877861   988 status_update_manager.cpp:203] Recovering status update manager
I0429 04:04:55.877936   988 containerizer.cpp:608] Recovering containerizer
I0429 04:04:55.878487   986 provisioner.cpp:410] Provisioner recovery complete
I0429 04:04:55.878777   993 slave.cpp:5963] Finished recovery
I0429 04:04:55.879256   993 slave.cpp:6145] Querying resource estimator for oversubscribable
resources
I0429 04:04:55.879422   982 slave.cpp:6159] Received oversubscribable resources {} from the
resource estimator
I0429 04:04:55.880461   987 process.cpp:3731] Handling HTTP event for process 'slave(752)'
with path: '/slave(752)/containers'
I0429 04:04:55.881016   993 http.cpp:1115] HTTP GET for /slave(752)/containers from 172.17.0.2:60629
I0429 04:04:55.881057   993 http.cpp:936] Authorizing principal 'test-principal' to GET the
'/containers' endpoint
I0429 04:04:55.882329   988 slave.cpp:790] Agent terminating
[       OK ] Endpoint/SlaveEndpointTest.NoAuthorizer/2 (13 ms)
[----------] 9 tests from Endpoint/SlaveEndpointTest (372 ms total)

[----------] Global test environment tear-down
[==========] 1527 tests from 169 test cases ran. (425451 ms total)
[  PASSED  ] 1526 tests.
[  FAILED  ] 1 test, listed below:
[  FAILED  ] ContainerLoggerTest.LOGROTATE_RotateInSandbox

 1 FAILED TEST
  YOU HAVE 19 DISABLED TESTS

E0429 04:04:55.957167   996 process.cpp:951] Failed to accept socket: future discarded
make[3]: Leaving directory `/mesos/build'
make[3]: *** [CMakeFiles/check] Error 1
make[2]: *** [CMakeFiles/check.dir/all] Error 2
make[2]: Leaving directory `/mesos/build'
make[1]: *** [CMakeFiles/check.dir/rule] Error 2
make[1]: Leaving directory `/mesos/build'
make: *** [check] Error 2
+ docker rmi mesos-1493434723-32412
Untagged: mesos-1493434723-32412:latest
Deleted: sha256:9227639a5d123f3d10a43514388cc43e9071d232a40a1867632730675d847fb7
Deleted: sha256:0f103847ea00b3a95950913fcffce51a83629be33f7f6e085aa6107450a032e9
Deleted: sha256:4e245b2c2a38f7c70bdba744cdc47d1af7bb9ed4c09dbe3e4b69d530467e706d
Deleted: sha256:9d7f725cfe6a48c75d60b9ab631cd62d7dc30f9c8ddd9f6e702f34c2b2481b34
Deleted: sha256:3ddc6bdf45ba8c379365d7bb605b2cae06fb3a72c90b905d8f1270ce18255350
Deleted: sha256:6faf124b60effc9f3f52624068d2c3274e916afec39429f029954e9550214d0f
Deleted: sha256:6faa17159e92bdd3096ef7b1c51c32e664d99967d9305bb7f5acf7afc6f139be
Deleted: sha256:829c6b776aacbdeaf6fad55ce7420c6d7ff9bd1f5152f543444319fed57d0889
Deleted: sha256:10c36c52810c1a077af543e925709347e33f6fe2bd2c997f3bbce917ab1ace76
Deleted: sha256:2b00e83cc2eb2bf7e415d43744cc3a382fa2c5fedfd8d4d60b9852f49a01760c
Deleted: sha256:058a35ec5191ee970712e6a81406459b61afa3b602fd1318e445bdf28317a6ee
Deleted: sha256:3864fdc8ff8d5d0c66ab1ec439716afa028d6289dcc2853949f3ba749f1aaa66
Deleted: sha256:cba41f8a8d79e8b9840134a9dfb5ac3f401244c1429a3fbbc66ae859b79c744a
Deleted: sha256:6504423128eadaa312f376e0105fcfc7c2feb5691af49afff12fd4e98e3735bb
Deleted: sha256:00b47b16ac0407fc765de2746d853909be4500c970625b2561458636e4b1209c
Deleted: sha256:7799a7f870d94aa4fc3fd4cf320fd39dec06421833f42d896e418c1454033ba1
Deleted: sha256:5bb26a5cfcfd6424172fb32c538836257340654b4dfff93648c0b2317b342252
Deleted: sha256:c50c6ec280da3016c4de9e9eb983d6258c847ccae987343c2dec2eeff050862b
Deleted: sha256:17058ede2a3a2fe91f0115f0c63c2ebb07071e1034da0cc60734a61e15914112
Deleted: sha256:bcc5d2dd2babfa3dbd3200634041e1505309b02837a3b319f8b2c3fc4ea2c89b
Deleted: sha256:872220fb7eb62e17656c475f94db4f57bd18487d5f320f1e360bd5e87ca869e0
Deleted: sha256:e837cb16eac1f188e5611efad84389c5d7f92d35b60b8e6a086364f2e8b77b28
Deleted: sha256:651ea46e7a807dbacec6e8799f1c9f3a9f55ba02e0481f3d33510d4b0112b515
Deleted: sha256:ab00ec22e0192039e7d050b4ad8008ad133805fe6c5ae20785aba5aa5ebabe33
Build step 'Execute shell' marked build as failure
Not sending mail to unregistered user xujyan@apple.com

Mime
View raw message