mesos-builds mailing list archives

Site index · List index
Message view « Date » · « Thread »
Top « Date » · « Thread »
From Apache Jenkins Server <jenk...@builds.apache.org>
Subject Build failed in Jenkins: Mesos-Buildbot » cmake,clang,--verbose,GLOG_v=1 MESOS_VERBOSE=1,ubuntu:14.04,(docker||Hadoop)&&(!ubuntu-us1)&&(!ubuntu-eu2) #3483
Date Fri, 14 Apr 2017 02:40:36 GMT
See <https://builds.apache.org/job/Mesos-Buildbot/BUILDTOOL=cmake,COMPILER=clang,CONFIGURATION=--verbose,ENVIRONMENT=GLOG_v=1%20MESOS_VERBOSE=1,OS=ubuntu%3A14.04,label_exp=(docker%7C%7CHadoop)&&(!ubuntu-us1)&&(!ubuntu-eu2)/3483/display/redirect?page=changes>

Changes:

[josephwu] Windows: Fixed Base64Test.EncodeURLSafe.

[josephwu] CLI: Added a Table abstraction.

[josephwu] CLI: Moved settings into a user-defined TOML file.

[josephwu] CLI: Added 'config' plugin.

------------------------------------------
[...truncated 24.28 MB...]
I0414 02:40:30.620136 23977 process.cpp:3722] Handling HTTP event for process 'slave(724)'
with path: '/slave(724)/monitor/statistics.json'
I0414 02:40:30.620662 23981 http.cpp:1115] HTTP GET for /slave(724)/monitor/statistics.json
from 172.17.0.3:55076
I0414 02:40:30.620712 23981 http.cpp:936] Authorizing principal 'test-principal' to GET the
'/monitor/statistics.json' endpoint
I0414 02:40:30.623262 23982 slave.cpp:790] Agent terminating
[       OK ] Endpoint/SlaveEndpointTest.AuthorizedRequest/1 (16 ms)
[ RUN      ] Endpoint/SlaveEndpointTest.AuthorizedRequest/2
I0414 02:40:30.629897 23966 containerizer.cpp:221] Using isolation: posix/cpu,posix/mem,filesystem/posix,network/cni
W0414 02:40:30.630252 23966 backend.cpp:76] Failed to create 'aufs' backend: AufsBackend requires
root privileges
W0414 02:40:30.630304 23966 backend.cpp:76] Failed to create 'bind' backend: BindBackend requires
root privileges
I0414 02:40:30.630324 23966 provisioner.cpp:249] Using default backend 'copy'
I0414 02:40:30.631822 23976 slave.cpp:225] Mesos agent started on (725)@172.17.0.3:54978
I0414 02:40:30.631862 23976 slave.cpp:226] Flags at startup: --acls="" --appc_simple_discovery_uri_prefix="http://"
--appc_store_dir="/tmp/mesos/store/appc" --authenticate_http_readonly="true" --authenticate_http_readwrite="true"
--authenticatee="crammd5" --authentication_backoff_factor="1secs" --authorizer="local" --cgroups_cpu_enable_pids_and_tids_count="false"
--cgroups_enable_cfs="false" --cgroups_hierarchy="/sys/fs/cgroup" --cgroups_limit_swap="false"
--cgroups_root="mesos" --container_disk_watch_interval="15secs" --containerizers="mesos" --credential="/tmp/Endpoint_SlaveEndpointTest_AuthorizedRequest_2_ScjTXM/credential"
--default_role="*" --disk_watch_interval="1mins" --docker="docker" --docker_kill_orphans="true"
--docker_registry="https://registry-1.docker.io" --docker_remove_delay="6hrs" --docker_socket="/var/run/docker.sock"
--docker_stop_timeout="0ns" --docker_store_dir="/tmp/mesos/store/docker" --docker_volume_checkpoint_dir="/var/run/mesos/isolators/docker/volume"
--enforce_container_disk_quota="false" --executor_registration_timeout="1mins" --executor_shutdown_grace_period="5secs"
--fetcher_cache_dir="/tmp/Endpoint_SlaveEndpointTest_AuthorizedRequest_2_ScjTXM/fetch" --fetcher_cache_size="2GB"
--frameworks_home="" --gc_delay="1weeks" --gc_disk_headroom="0.1" --hadoop_home="" --help="false"
--hostname_lookup="true" --http_command_executor="false" --http_credentials="/tmp/Endpoint_SlaveEndpointTest_AuthorizedRequest_2_ScjTXM/http_credentials"
--http_heartbeat_interval="30secs" --initialize_driver_logging="true" --isolation="posix/cpu,posix/mem"
--launcher="posix" --launcher_dir="/mesos/build/src" --logbufsecs="0" --logging_level="INFO"
--max_completed_executors_per_framework="150" --oversubscribed_resources_interval="15secs"
--perf_duration="10secs" --perf_interval="1mins" --port="5051" --qos_correction_interval_min="0ns"
--quiet="false" --recover="reconnect" --recovery_timeout="15mins" --registration_backoff_factor="10ms"
--resources="cpus:2;gpus:0;mem:1024;disk:1024;ports:[31000-32000]" --revocable_cpu_low_priority="true"
--runtime_dir="/tmp/Endpoint_SlaveEndpointTest_AuthorizedRequest_2_ScjTXM" --sandbox_directory="/mnt/mesos/sandbox"
--strict="true" --switch_user="true" --systemd_enable_support="true" --systemd_runtime_directory="/run/systemd/system"
--version="false" --work_dir="/tmp/Endpoint_SlaveEndpointTest_AuthorizedRequest_2_RTzlw4"
I0414 02:40:30.632151 23976 credentials.hpp:86] Loading credential for authentication from
'/tmp/Endpoint_SlaveEndpointTest_AuthorizedRequest_2_ScjTXM/credential'
I0414 02:40:30.632293 23976 slave.cpp:258] Agent using credential for: test-principal
I0414 02:40:30.632304 23976 credentials.hpp:37] Loading credentials for authentication from
'/tmp/Endpoint_SlaveEndpointTest_AuthorizedRequest_2_ScjTXM/http_credentials'
I0414 02:40:30.632401 23976 http.cpp:975] Creating default 'basic' HTTP authenticator for
realm 'mesos-agent-readonly'
I0414 02:40:30.632468 23976 http.cpp:975] Creating default 'basic' HTTP authenticator for
realm 'mesos-agent-readwrite'
I0414 02:40:30.632905 23976 slave.cpp:525] Agent resources: cpus(*):2; mem(*):1024; disk(*):1024;
ports(*):[31000-32000]
I0414 02:40:30.632936 23976 slave.cpp:533] Agent attributes: [  ]
I0414 02:40:30.632941 23976 slave.cpp:538] Agent hostname: 4d40ae9389f4
I0414 02:40:30.633193 23967 status_update_manager.cpp:177] Pausing sending status updates
I0414 02:40:30.633369 23973 state.cpp:62] Recovering state from '/tmp/Endpoint_SlaveEndpointTest_AuthorizedRequest_2_RTzlw4/meta'
I0414 02:40:30.633543 23977 status_update_manager.cpp:203] Recovering status update manager
I0414 02:40:30.633623 23977 containerizer.cpp:608] Recovering containerizer
I0414 02:40:30.634177 23976 provisioner.cpp:410] Provisioner recovery complete
I0414 02:40:30.634348 23967 slave.cpp:5963] Finished recovery
I0414 02:40:30.634891 23967 slave.cpp:6145] Querying resource estimator for oversubscribable
resources
I0414 02:40:30.635056 23976 slave.cpp:6159] Received oversubscribable resources {} from the
resource estimator
I0414 02:40:30.635982 23969 process.cpp:3722] Handling HTTP event for process 'slave(725)'
with path: '/slave(725)/containers'
I0414 02:40:30.636364 23973 http.cpp:1115] HTTP GET for /slave(725)/containers from 172.17.0.3:55077
I0414 02:40:30.636397 23973 http.cpp:936] Authorizing principal 'test-principal' to GET the
'/containers' endpoint
I0414 02:40:30.637935 23966 slave.cpp:790] Agent terminating
[       OK ] Endpoint/SlaveEndpointTest.AuthorizedRequest/2 (14 ms)
[ RUN      ] Endpoint/SlaveEndpointTest.UnauthorizedRequest/0
I0414 02:40:30.643707 23966 containerizer.cpp:221] Using isolation: posix/cpu,posix/mem,filesystem/posix,network/cni
W0414 02:40:30.644052 23966 backend.cpp:76] Failed to create 'aufs' backend: AufsBackend requires
root privileges
W0414 02:40:30.644101 23966 backend.cpp:76] Failed to create 'bind' backend: BindBackend requires
root privileges
I0414 02:40:30.644120 23966 provisioner.cpp:249] Using default backend 'copy'
I0414 02:40:30.645522 23976 slave.cpp:225] Mesos agent started on (726)@172.17.0.3:54978
I0414 02:40:30.645552 23976 slave.cpp:226] Flags at startup: --acls="" --appc_simple_discovery_uri_prefix="http://"
--appc_store_dir="/tmp/mesos/store/appc" --authenticate_http_readonly="true" --authenticate_http_readwrite="true"
--authenticatee="crammd5" --authentication_backoff_factor="1secs" --authorizer="local" --cgroups_cpu_enable_pids_and_tids_count="false"
--cgroups_enable_cfs="false" --cgroups_hierarchy="/sys/fs/cgroup" --cgroups_limit_swap="false"
--cgroups_root="mesos" --container_disk_watch_interval="15secs" --containerizers="mesos" --credential="/tmp/Endpoint_SlaveEndpointTest_UnauthorizedRequest_0_uKeERE/credential"
--default_role="*" --disk_watch_interval="1mins" --docker="docker" --docker_kill_orphans="true"
--docker_registry="https://registry-1.docker.io" --docker_remove_delay="6hrs" --docker_socket="/var/run/docker.sock"
--docker_stop_timeout="0ns" --docker_store_dir="/tmp/mesos/store/docker" --docker_volume_checkpoint_dir="/var/run/mesos/isolators/docker/volume"
--enforce_container_disk_quota="false" --executor_registration_timeout="1mins" --executor_shutdown_grace_period="5secs"
--fetcher_cache_dir="/tmp/Endpoint_SlaveEndpointTest_UnauthorizedRequest_0_uKeERE/fetch" --fetcher_cache_size="2GB"
--frameworks_home="" --gc_delay="1weeks" --gc_disk_headroom="0.1" --hadoop_home="" --help="false"
--hostname_lookup="true" --http_command_executor="false" --http_credentials="/tmp/Endpoint_SlaveEndpointTest_UnauthorizedRequest_0_uKeERE/http_credentials"
--http_heartbeat_interval="30secs" --initialize_driver_logging="true" --isolation="posix/cpu,posix/mem"
--launcher="posix" --launcher_dir="/mesos/build/src" --logbufsecs="0" --logging_level="INFO"
--max_completed_executors_per_framework="150" --oversubscribed_resources_interval="15secs"
--perf_duration="10secs" --perf_interval="1mins" --port="5051" --qos_correction_interval_min="0ns"
--quiet="false" --recover="reconnect" --recovery_timeout="15mins" --registration_backoff_factor="10ms"
--resources="cpus:2;gpus:0;mem:1024;disk:1024;ports:[31000-32000]" --revocable_cpu_low_priority="true"
--runtime_dir="/tmp/Endpoint_SlaveEndpointTest_UnauthorizedRequest_0_uKeERE" --sandbox_directory="/mnt/mesos/sandbox"
--strict="true" --switch_user="true" --systemd_enable_support="true" --systemd_runtime_directory="/run/systemd/system"
--version="false" --work_dir="/tmp/Endpoint_SlaveEndpointTest_UnauthorizedRequest_0_24eRnW"
I0414 02:40:30.645820 23976 credentials.hpp:86] Loading credential for authentication from
'/tmp/Endpoint_SlaveEndpointTest_UnauthorizedRequest_0_uKeERE/credential'
I0414 02:40:30.645942 23976 slave.cpp:258] Agent using credential for: test-principal
I0414 02:40:30.645953 23976 credentials.hpp:37] Loading credentials for authentication from
'/tmp/Endpoint_SlaveEndpointTest_UnauthorizedRequest_0_uKeERE/http_credentials'
I0414 02:40:30.646050 23976 http.cpp:975] Creating default 'basic' HTTP authenticator for
realm 'mesos-agent-readonly'
I0414 02:40:30.646102 23976 http.cpp:975] Creating default 'basic' HTTP authenticator for
realm 'mesos-agent-readwrite'
I0414 02:40:30.646435 23976 slave.cpp:525] Agent resources: cpus(*):2; mem(*):1024; disk(*):1024;
ports(*):[31000-32000]
I0414 02:40:30.646466 23976 slave.cpp:533] Agent attributes: [  ]
I0414 02:40:30.646469 23976 slave.cpp:538] Agent hostname: 4d40ae9389f4
I0414 02:40:30.646754 23976 status_update_manager.cpp:177] Pausing sending status updates
I0414 02:40:30.647038 23974 state.cpp:62] Recovering state from '/tmp/Endpoint_SlaveEndpointTest_UnauthorizedRequest_0_24eRnW/meta'
I0414 02:40:30.647210 23972 status_update_manager.cpp:203] Recovering status update manager
I0414 02:40:30.647275 23972 containerizer.cpp:608] Recovering containerizer
I0414 02:40:30.647691 23970 provisioner.cpp:410] Provisioner recovery complete
I0414 02:40:30.647964 23978 slave.cpp:5963] Finished recovery
I0414 02:40:30.648558 23978 slave.cpp:6145] Querying resource estimator for oversubscribable
resources
I0414 02:40:30.648655 23978 slave.cpp:6159] Received oversubscribable resources {} from the
resource estimator
I0414 02:40:30.649704 23982 process.cpp:3722] Handling HTTP event for process 'slave(726)'
with path: '/slave(726)/monitor/statistics'
I0414 02:40:30.650110 23982 http.cpp:1115] HTTP GET for /slave(726)/monitor/statistics from
172.17.0.3:55078
I0414 02:40:30.650151 23982 http.cpp:936] Authorizing principal 'test-principal' to GET the
'/monitor/statistics' endpoint
I0414 02:40:30.651283 23972 slave.cpp:790] Agent terminating
[       OK ] Endpoint/SlaveEndpointTest.UnauthorizedRequest/0 (13 ms)
[ RUN      ] Endpoint/SlaveEndpointTest.UnauthorizedRequest/1
I0414 02:40:30.657805 23966 containerizer.cpp:221] Using isolation: posix/cpu,posix/mem,filesystem/posix,network/cni
W0414 02:40:30.658143 23966 backend.cpp:76] Failed to create 'aufs' backend: AufsBackend requires
root privileges
W0414 02:40:30.658191 23966 backend.cpp:76] Failed to create 'bind' backend: BindBackend requires
root privileges
I0414 02:40:30.658208 23966 provisioner.cpp:249] Using default backend 'copy'
I0414 02:40:30.659544 23972 slave.cpp:225] Mesos agent started on (727)@172.17.0.3:54978
I0414 02:40:30.659579 23972 slave.cpp:226] Flags at startup: --acls="" --appc_simple_discovery_uri_prefix="http://"
--appc_store_dir="/tmp/mesos/store/appc" --authenticate_http_readonly="true" --authenticate_http_readwrite="true"
--authenticatee="crammd5" --authentication_backoff_factor="1secs" --authorizer="local" --cgroups_cpu_enable_pids_and_tids_count="false"
--cgroups_enable_cfs="false" --cgroups_hierarchy="/sys/fs/cgroup" --cgroups_limit_swap="false"
--cgroups_root="mesos" --container_disk_watch_interval="15secs" --containerizers="mesos" --credential="/tmp/Endpoint_SlaveEndpointTest_UnauthorizedRequest_1_n48nUw/credential"
--default_role="*" --disk_watch_interval="1mins" --docker="docker" --docker_kill_orphans="true"
--docker_registry="https://registry-1.docker.io" --docker_remove_delay="6hrs" --docker_socket="/var/run/docker.sock"
--docker_stop_timeout="0ns" --docker_store_dir="/tmp/mesos/store/docker" --docker_volume_checkpoint_dir="/var/run/mesos/isolators/docker/volume"
--enforce_container_disk_quota="false" --executor_registration_timeout="1mins" --executor_shutdown_grace_period="5secs"
--fetcher_cache_dir="/tmp/Endpoint_SlaveEndpointTest_UnauthorizedRequest_1_n48nUw/fetch" --fetcher_cache_size="2GB"
--frameworks_home="" --gc_delay="1weeks" --gc_disk_headroom="0.1" --hadoop_home="" --help="false"
--hostname_lookup="true" --http_command_executor="false" --http_credentials="/tmp/Endpoint_SlaveEndpointTest_UnauthorizedRequest_1_n48nUw/http_credentials"
--http_heartbeat_interval="30secs" --initialize_driver_logging="true" --isolation="posix/cpu,posix/mem"
--launcher="posix" --launcher_dir="/mesos/build/src" --logbufsecs="0" --logging_level="INFO"
--max_completed_executors_per_framework="150" --oversubscribed_resources_interval="15secs"
--perf_duration="10secs" --perf_interval="1mins" --port="5051" --qos_correction_interval_min="0ns"
--quiet="false" --recover="reconnect" --recovery_timeout="15mins" --registration_backoff_factor="10ms"
--resources="cpus:2;gpus:0;mem:1024;disk:1024;ports:[31000-32000]" --revocable_cpu_low_priority="true"
--runtime_dir="/tmp/Endpoint_SlaveEndpointTest_UnauthorizedRequest_1_n48nUw" --sandbox_directory="/mnt/mesos/sandbox"
--strict="true" --switch_user="true" --systemd_enable_support="true" --systemd_runtime_directory="/run/systemd/system"
--version="false" --work_dir="/tmp/Endpoint_SlaveEndpointTest_UnauthorizedRequest_1_jJCkoO"
I0414 02:40:30.659957 23972 credentials.hpp:86] Loading credential for authentication from
'/tmp/Endpoint_SlaveEndpointTest_UnauthorizedRequest_1_n48nUw/credential'
I0414 02:40:30.660091 23972 slave.cpp:258] Agent using credential for: test-principal
I0414 02:40:30.660107 23972 credentials.hpp:37] Loading credentials for authentication from
'/tmp/Endpoint_SlaveEndpointTest_UnauthorizedRequest_1_n48nUw/http_credentials'
I0414 02:40:30.660302 23972 http.cpp:975] Creating default 'basic' HTTP authenticator for
realm 'mesos-agent-readonly'
I0414 02:40:30.660440 23972 http.cpp:975] Creating default 'basic' HTTP authenticator for
realm 'mesos-agent-readwrite'
I0414 02:40:30.660917 23972 slave.cpp:525] Agent resources: cpus(*):2; mem(*):1024; disk(*):1024;
ports(*):[31000-32000]
I0414 02:40:30.660954 23972 slave.cpp:533] Agent attributes: [  ]
I0414 02:40:30.660962 23972 slave.cpp:538] Agent hostname: 4d40ae9389f4
I0414 02:40:30.661186 23969 status_update_manager.cpp:177] Pausing sending status updates
I0414 02:40:30.661664 23980 state.cpp:62] Recovering state from '/tmp/Endpoint_SlaveEndpointTest_UnauthorizedRequest_1_jJCkoO/meta'
I0414 02:40:30.661784 23967 status_update_manager.cpp:203] Recovering status update manager
I0414 02:40:30.661912 23967 containerizer.cpp:608] Recovering containerizer
I0414 02:40:30.662602 23979 provisioner.cpp:410] Provisioner recovery complete
I0414 02:40:30.662745 23979 slave.cpp:5963] Finished recovery
I0414 02:40:30.663269 23979 slave.cpp:6145] Querying resource estimator for oversubscribable
resources
I0414 02:40:30.663453 23968 slave.cpp:6159] Received oversubscribable resources {} from the
resource estimator
I0414 02:40:30.664286 23976 process.cpp:3722] Handling HTTP event for process 'slave(727)'
with path: '/slave(727)/monitor/statistics.json'
I0414 02:40:30.664700 23976 http.cpp:1115] HTTP GET for /slave(727)/monitor/statistics.json
from 172.17.0.3:55079
I0414 02:40:30.664741 23976 http.cpp:936] Authorizing principal 'test-principal' to GET the
'/monitor/statistics.json' endpoint
I0414 02:40:30.665817 23968 slave.cpp:790] Agent terminating
[       OK ] Endpoint/SlaveEndpointTest.UnauthorizedRequest/1 (14 ms)
[ RUN      ] Endpoint/SlaveEndpointTest.UnauthorizedRequest/2
I0414 02:40:30.671619 23966 containerizer.cpp:221] Using isolation: posix/cpu,posix/mem,filesystem/posix,network/cni
W0414 02:40:30.671954 23966 backend.cpp:76] Failed to create 'aufs' backend: AufsBackend requires
root privileges
W0414 02:40:30.672005 23966 backend.cpp:76] Failed to create 'bind' backend: BindBackend requires
root privileges
I0414 02:40:30.672024 23966 provisioner.cpp:249] Using default backend 'copy'
I0414 02:40:30.673364 23967 slave.cpp:225] Mesos agent started on (728)@172.17.0.3:54978
I0414 02:40:30.673391 23967 slave.cpp:226] Flags at startup: --acls="" --appc_simple_discovery_uri_prefix="http://"
--appc_store_dir="/tmp/mesos/store/appc" --authenticate_http_readonly="true" --authenticate_http_readwrite="true"
--authenticatee="crammd5" --authentication_backoff_factor="1secs" --authorizer="local" --cgroups_cpu_enable_pids_and_tids_count="false"
--cgroups_enable_cfs="false" --cgroups_hierarchy="/sys/fs/cgroup" --cgroups_limit_swap="false"
--cgroups_root="mesos" --container_disk_watch_interval="15secs" --containerizers="mesos" --credential="/tmp/Endpoint_SlaveEndpointTest_UnauthorizedRequest_2_uXpn6o/credential"
--default_role="*" --disk_watch_interval="1mins" --docker="docker" --docker_kill_orphans="true"
--docker_registry="https://registry-1.docker.io" --docker_remove_delay="6hrs" --docker_socket="/var/run/docker.sock"
--docker_stop_timeout="0ns" --docker_store_dir="/tmp/mesos/store/docker" --docker_volume_checkpoint_dir="/var/run/mesos/isolators/docker/volume"
--enforce_container_disk_quota="false" --executor_registration_timeout="1mins" --executor_shutdown_grace_period="5secs"
--fetcher_cache_dir="/tmp/Endpoint_SlaveEndpointTest_UnauthorizedRequest_2_uXpn6o/fetch" --fetcher_cache_size="2GB"
--frameworks_home="" --gc_delay="1weeks" --gc_disk_headroom="0.1" --hadoop_home="" --help="false"
--hostname_lookup="true" --http_command_executor="false" --http_credentials="/tmp/Endpoint_SlaveEndpointTest_UnauthorizedRequest_2_uXpn6o/http_credentials"
--http_heartbeat_interval="30secs" --initialize_driver_logging="true" --isolation="posix/cpu,posix/mem"
--launcher="posix" --launcher_dir="/mesos/build/src" --logbufsecs="0" --logging_level="INFO"
--max_completed_executors_per_framework="150" --oversubscribed_resources_interval="15secs"
--perf_duration="10secs" --perf_interval="1mins" --port="5051" --qos_correction_interval_min="0ns"
--quiet="false" --recover="reconnect" --recovery_timeout="15mins" --registration_backoff_factor="10ms"
--resources="cpus:2;gpus:0;mem:1024;disk:1024;ports:[31000-32000]" --revocable_cpu_low_priority="true"
--runtime_dir="/tmp/Endpoint_SlaveEndpointTest_UnauthorizedRequest_2_uXpn6o" --sandbox_directory="/mnt/mesos/sandbox"
--strict="true" --switch_user="true" --systemd_enable_support="true" --systemd_runtime_directory="/run/systemd/system"
--version="false" --work_dir="/tmp/Endpoint_SlaveEndpointTest_UnauthorizedRequest_2_JtN2xG"
I0414 02:40:30.673669 23967 credentials.hpp:86] Loading credential for authentication from
'/tmp/Endpoint_SlaveEndpointTest_UnauthorizedRequest_2_uXpn6o/credential'
I0414 02:40:30.673789 23967 slave.cpp:258] Agent using credential for: test-principal
I0414 02:40:30.673799 23967 credentials.hpp:37] Loading credentials for authentication from
'/tmp/Endpoint_SlaveEndpointTest_UnauthorizedRequest_2_uXpn6o/http_credentials'
I0414 02:40:30.673888 23967 http.cpp:975] Creating default 'basic' HTTP authenticator for
realm 'mesos-agent-readonly'
I0414 02:40:30.673936 23967 http.cpp:975] Creating default 'basic' HTTP authenticator for
realm 'mesos-agent-readwrite'
I0414 02:40:30.674342 23967 slave.cpp:525] Agent resources: cpus(*):2; mem(*):1024; disk(*):1024;
ports(*):[31000-32000]
I0414 02:40:30.674373 23967 slave.cpp:533] Agent attributes: [  ]
I0414 02:40:30.674377 23967 slave.cpp:538] Agent hostname: 4d40ae9389f4
I0414 02:40:30.674482 23971 status_update_manager.cpp:177] Pausing sending status updates
I0414 02:40:30.674794 23972 state.cpp:62] Recovering state from '/tmp/Endpoint_SlaveEndpointTest_UnauthorizedRequest_2_JtN2xG/meta'
I0414 02:40:30.674995 23977 status_update_manager.cpp:203] Recovering status update manager
I0414 02:40:30.675109 23974 containerizer.cpp:608] Recovering containerizer
I0414 02:40:30.675734 23974 provisioner.cpp:410] Provisioner recovery complete
I0414 02:40:30.675904 23974 slave.cpp:5963] Finished recovery
I0414 02:40:30.676403 23974 slave.cpp:6145] Querying resource estimator for oversubscribable
resources
I0414 02:40:30.676595 23974 slave.cpp:6159] Received oversubscribable resources {} from the
resource estimator
I0414 02:40:30.677434 23971 process.cpp:3722] Handling HTTP event for process 'slave(728)'
with path: '/slave(728)/containers'
I0414 02:40:30.677928 23968 http.cpp:1115] HTTP GET for /slave(728)/containers from 172.17.0.3:55080
I0414 02:40:30.677973 23968 http.cpp:936] Authorizing principal 'test-principal' to GET the
'/containers' endpoint
I0414 02:40:30.679213 23976 slave.cpp:790] Agent terminating
[       OK ] Endpoint/SlaveEndpointTest.UnauthorizedRequest/2 (13 ms)
[ RUN      ] Endpoint/SlaveEndpointTest.NoAuthorizer/0
I0414 02:40:30.685703 23966 containerizer.cpp:221] Using isolation: posix/cpu,posix/mem,filesystem/posix,network/cni
W0414 02:40:30.686039 23966 backend.cpp:76] Failed to create 'aufs' backend: AufsBackend requires
root privileges
W0414 02:40:30.686086 23966 backend.cpp:76] Failed to create 'bind' backend: BindBackend requires
root privileges
I0414 02:40:30.686105 23966 provisioner.cpp:249] Using default backend 'copy'
I0414 02:40:30.686797 23966 cluster.cpp:448] Creating default 'local' authorizer
I0414 02:40:30.687510 23969 slave.cpp:225] Mesos agent started on (729)@172.17.0.3:54978
I0414 02:40:30.687546 23969 slave.cpp:226] Flags at startup: --acls="" --appc_simple_discovery_uri_prefix="http://"
--appc_store_dir="/tmp/mesos/store/appc" --authenticate_http_readonly="true" --authenticate_http_readwrite="true"
--authenticatee="crammd5" --authentication_backoff_factor="1secs" --authorizer="local" --cgroups_cpu_enable_pids_and_tids_count="false"
--cgroups_enable_cfs="false" --cgroups_hierarchy="/sys/fs/cgroup" --cgroups_limit_swap="false"
--cgroups_root="mesos" --container_disk_watch_interval="15secs" --containerizers="mesos" --credential="/tmp/Endpoint_SlaveEndpointTest_NoAuthorizer_0_WTygrh/credential"
--default_role="*" --disk_watch_interval="1mins" --docker="docker" --docker_kill_orphans="true"
--docker_registry="https://registry-1.docker.io" --docker_remove_delay="6hrs" --docker_socket="/var/run/docker.sock"
--docker_stop_timeout="0ns" --docker_store_dir="/tmp/mesos/store/docker" --docker_volume_checkpoint_dir="/var/run/mesos/isolators/docker/volume"
--enforce_container_disk_quota="false" --executor_registration_timeout="1mins" --executor_shutdown_grace_period="5secs"
--fetcher_cache_dir="/tmp/Endpoint_SlaveEndpointTest_NoAuthorizer_0_WTygrh/fetch" --fetcher_cache_size="2GB"
--frameworks_home="" --gc_delay="1weeks" --gc_disk_headroom="0.1" --hadoop_home="" --help="false"
--hostname_lookup="true" --http_command_executor="false" --http_credentials="/tmp/Endpoint_SlaveEndpointTest_NoAuthorizer_0_WTygrh/http_credentials"
--http_heartbeat_interval="30secs" --initialize_driver_logging="true" --isolation="posix/cpu,posix/mem"
--launcher="posix" --launcher_dir="/mesos/build/src" --logbufsecs="0" --logging_level="INFO"
--max_completed_executors_per_framework="150" --oversubscribed_resources_interval="15secs"
--perf_duration="10secs" --perf_interval="1mins" --port="5051" --qos_correction_interval_min="0ns"
--quiet="false" --recover="reconnect" --recovery_timeout="15mins" --registration_backoff_factor="10ms"
--resources="cpus:2;gpus:0;mem:1024;disk:1024;ports:[31000-32000]" --revocable_cpu_low_priority="true"
--runtime_dir="/tmp/Endpoint_SlaveEndpointTest_NoAuthorizer_0_WTygrh" --sandbox_directory="/mnt/mesos/sandbox"
--strict="true" --switch_user="true" --systemd_enable_support="true" --systemd_runtime_directory="/run/systemd/system"
--version="false" --work_dir="/tmp/Endpoint_SlaveEndpointTest_NoAuthorizer_0_kUuFQy"
I0414 02:40:30.687798 23969 credentials.hpp:86] Loading credential for authentication from
'/tmp/Endpoint_SlaveEndpointTest_NoAuthorizer_0_WTygrh/credential'
I0414 02:40:30.687940 23969 slave.cpp:258] Agent using credential for: test-principal
I0414 02:40:30.687954 23969 credentials.hpp:37] Loading credentials for authentication from
'/tmp/Endpoint_SlaveEndpointTest_NoAuthorizer_0_WTygrh/http_credentials'
I0414 02:40:30.688084 23969 http.cpp:975] Creating default 'basic' HTTP authenticator for
realm 'mesos-agent-readonly'
I0414 02:40:30.688150 23969 http.cpp:975] Creating default 'basic' HTTP authenticator for
realm 'mesos-agent-readwrite'
I0414 02:40:30.688710 23969 slave.cpp:525] Agent resources: cpus(*):2; mem(*):1024; disk(*):1024;
ports(*):[31000-32000]
I0414 02:40:30.688752 23969 slave.cpp:533] Agent attributes: [  ]
I0414 02:40:30.688761 23969 slave.cpp:538] Agent hostname: 4d40ae9389f4
I0414 02:40:30.688837 23980 status_update_manager.cpp:177] Pausing sending status updates
I0414 02:40:30.689301 23969 state.cpp:62] Recovering state from '/tmp/Endpoint_SlaveEndpointTest_NoAuthorizer_0_kUuFQy/meta'
I0414 02:40:30.689462 23976 status_update_manager.cpp:203] Recovering status update manager
I0414 02:40:30.689750 23973 containerizer.cpp:608] Recovering containerizer
I0414 02:40:30.690330 23976 provisioner.cpp:410] Provisioner recovery complete
I0414 02:40:30.690503 23969 slave.cpp:5963] Finished recovery
I0414 02:40:30.691004 23969 slave.cpp:6145] Querying resource estimator for oversubscribable
resources
I0414 02:40:30.691133 23973 slave.cpp:6159] Received oversubscribable resources {} from the
resource estimator
I0414 02:40:30.691927 23982 process.cpp:3722] Handling HTTP event for process 'slave(729)'
with path: '/slave(729)/monitor/statistics'
I0414 02:40:30.692489 23976 http.cpp:1115] HTTP GET for /slave(729)/monitor/statistics from
172.17.0.3:55081
I0414 02:40:30.692544 23976 http.cpp:936] Authorizing principal 'test-principal' to GET the
'/monitor/statistics' endpoint
I0414 02:40:30.693934 23982 slave.cpp:790] Agent terminating
[       OK ] Endpoint/SlaveEndpointTest.NoAuthorizer/0 (14 ms)
[ RUN      ] Endpoint/SlaveEndpointTest.NoAuthorizer/1
I0414 02:40:30.699517 23966 containerizer.cpp:221] Using isolation: posix/cpu,posix/mem,filesystem/posix,network/cni
W0414 02:40:30.699856 23966 backend.cpp:76] Failed to create 'aufs' backend: AufsBackend requires
root privileges
W0414 02:40:30.699904 23966 backend.cpp:76] Failed to create 'bind' backend: BindBackend requires
root privileges
I0414 02:40:30.699921 23966 provisioner.cpp:249] Using default backend 'copy'
I0414 02:40:30.700565 23966 cluster.cpp:448] Creating default 'local' authorizer
I0414 02:40:30.701323 23967 slave.cpp:225] Mesos agent started on (730)@172.17.0.3:54978
I0414 02:40:30.701355 23967 slave.cpp:226] Flags at startup: --acls="" --appc_simple_discovery_uri_prefix="http://"
--appc_store_dir="/tmp/mesos/store/appc" --authenticate_http_readonly="true" --authenticate_http_readwrite="true"
--authenticatee="crammd5" --authentication_backoff_factor="1secs" --authorizer="local" --cgroups_cpu_enable_pids_and_tids_count="false"
--cgroups_enable_cfs="false" --cgroups_hierarchy="/sys/fs/cgroup" --cgroups_limit_swap="false"
--cgroups_root="mesos" --container_disk_watch_interval="15secs" --containerizers="mesos" --credential="/tmp/Endpoint_SlaveEndpointTest_NoAuthorizer_1_DPnjV9/credential"
--default_role="*" --disk_watch_interval="1mins" --docker="docker" --docker_kill_orphans="true"
--docker_registry="https://registry-1.docker.io" --docker_remove_delay="6hrs" --docker_socket="/var/run/docker.sock"
--docker_stop_timeout="0ns" --docker_store_dir="/tmp/mesos/store/docker" --docker_volume_checkpoint_dir="/var/run/mesos/isolators/docker/volume"
--enforce_container_disk_quota="false" --executor_registration_timeout="1mins" --executor_shutdown_grace_period="5secs"
--fetcher_cache_dir="/tmp/Endpoint_SlaveEndpointTest_NoAuthorizer_1_DPnjV9/fetch" --fetcher_cache_size="2GB"
--frameworks_home="" --gc_delay="1weeks" --gc_disk_headroom="0.1" --hadoop_home="" --help="false"
--hostname_lookup="true" --http_command_executor="false" --http_credentials="/tmp/Endpoint_SlaveEndpointTest_NoAuthorizer_1_DPnjV9/http_credentials"
--http_heartbeat_interval="30secs" --initialize_driver_logging="true" --isolation="posix/cpu,posix/mem"
--launcher="posix" --launcher_dir="/mesos/build/src" --logbufsecs="0" --logging_level="INFO"
--max_completed_executors_per_framework="150" --oversubscribed_resources_interval="15secs"
--perf_duration="10secs" --perf_interval="1mins" --port="5051" --qos_correction_interval_min="0ns"
--quiet="false" --recover="reconnect" --recovery_timeout="15mins" --registration_backoff_factor="10ms"
--resources="cpus:2;gpus:0;mem:1024;disk:1024;ports:[31000-32000]" --revocable_cpu_low_priority="true"
--runtime_dir="/tmp/Endpoint_SlaveEndpointTest_NoAuthorizer_1_DPnjV9" --sandbox_directory="/mnt/mesos/sandbox"
--strict="true" --switch_user="true" --systemd_enable_support="true" --systemd_runtime_directory="/run/systemd/system"
--version="false" --work_dir="/tmp/Endpoint_SlaveEndpointTest_NoAuthorizer_1_4Yysir"
I0414 02:40:30.701649 23967 credentials.hpp:86] Loading credential for authentication from
'/tmp/Endpoint_SlaveEndpointTest_NoAuthorizer_1_DPnjV9/credential'
I0414 02:40:30.701800 23967 slave.cpp:258] Agent using credential for: test-principal
I0414 02:40:30.701815 23967 credentials.hpp:37] Loading credentials for authentication from
'/tmp/Endpoint_SlaveEndpointTest_NoAuthorizer_1_DPnjV9/http_credentials'
I0414 02:40:30.701939 23967 http.cpp:975] Creating default 'basic' HTTP authenticator for
realm 'mesos-agent-readonly'
I0414 02:40:30.701997 23967 http.cpp:975] Creating default 'basic' HTTP authenticator for
realm 'mesos-agent-readwrite'
I0414 02:40:30.702416 23967 slave.cpp:525] Agent resources: cpus(*):2; mem(*):1024; disk(*):1024;
ports(*):[31000-32000]
I0414 02:40:30.702446 23967 slave.cpp:533] Agent attributes: [  ]
I0414 02:40:30.702450 23967 slave.cpp:538] Agent hostname: 4d40ae9389f4
I0414 02:40:30.702509 23970 status_update_manager.cpp:177] Pausing sending status updates
I0414 02:40:30.702826 23982 state.cpp:62] Recovering state from '/tmp/Endpoint_SlaveEndpointTest_NoAuthorizer_1_4Yysir/meta'
I0414 02:40:30.703052 23980 status_update_manager.cpp:203] Recovering status update manager
I0414 02:40:30.703128 23980 containerizer.cpp:608] Recovering containerizer
I0414 02:40:30.703788 23978 provisioner.cpp:410] Provisioner recovery complete
I0414 02:40:30.703902 23978 slave.cpp:5963] Finished recovery
I0414 02:40:30.704349 23978 slave.cpp:6145] Querying resource estimator for oversubscribable
resources
I0414 02:40:30.704435 23982 slave.cpp:6159] Received oversubscribable resources {} from the
resource estimator
I0414 02:40:30.705394 23975 process.cpp:3722] Handling HTTP event for process 'slave(730)'
with path: '/slave(730)/monitor/statistics.json'
I0414 02:40:30.705761 23977 http.cpp:1115] HTTP GET for /slave(730)/monitor/statistics.json
from 172.17.0.3:55082
I0414 02:40:30.705799 23977 http.cpp:936] Authorizing principal 'test-principal' to GET the
'/monitor/statistics.json' endpoint
I0414 02:40:30.707000 23980 slave.cpp:790] Agent terminating
[       OK ] Endpoint/SlaveEndpointTest.NoAuthorizer/1 (13 ms)
[ RUN      ] Endpoint/SlaveEndpointTest.NoAuthorizer/2
I0414 02:40:30.712826 23966 containerizer.cpp:221] Using isolation: posix/cpu,posix/mem,filesystem/posix,network/cni
W0414 02:40:30.713172 23966 backend.cpp:76] Failed to create 'aufs' backend: AufsBackend requires
root privileges
W0414 02:40:30.713220 23966 backend.cpp:76] Failed to create 'bind' backend: BindBackend requires
root privileges
I0414 02:40:30.713238 23966 provisioner.cpp:249] Using default backend 'copy'
I0414 02:40:30.714056 23966 cluster.cpp:448] Creating default 'local' authorizer
I0414 02:40:30.714965 23975 slave.cpp:225] Mesos agent started on (731)@172.17.0.3:54978
I0414 02:40:30.715190 23975 slave.cpp:226] Flags at startup: --acls="" --appc_simple_discovery_uri_prefix="http://"
--appc_store_dir="/tmp/mesos/store/appc" --authenticate_http_readonly="true" --authenticate_http_readwrite="true"
--authenticatee="crammd5" --authentication_backoff_factor="1secs" --authorizer="local" --cgroups_cpu_enable_pids_and_tids_count="false"
--cgroups_enable_cfs="false" --cgroups_hierarchy="/sys/fs/cgroup" --cgroups_limit_swap="false"
--cgroups_root="mesos" --container_disk_watch_interval="15secs" --containerizers="mesos" --credential="/tmp/Endpoint_SlaveEndpointTest_NoAuthorizer_2_fug0x2/credential"
--default_role="*" --disk_watch_interval="1mins" --docker="docker" --docker_kill_orphans="true"
--docker_registry="https://registry-1.docker.io" --docker_remove_delay="6hrs" --docker_socket="/var/run/docker.sock"
--docker_stop_timeout="0ns" --docker_store_dir="/tmp/mesos/store/docker" --docker_volume_checkpoint_dir="/var/run/mesos/isolators/docker/volume"
--enforce_container_disk_quota="false" --executor_registration_timeout="1mins" --executor_shutdown_grace_period="5secs"
--fetcher_cache_dir="/tmp/Endpoint_SlaveEndpointTest_NoAuthorizer_2_fug0x2/fetch" --fetcher_cache_size="2GB"
--frameworks_home="" --gc_delay="1weeks" --gc_disk_headroom="0.1" --hadoop_home="" --help="false"
--hostname_lookup="true" --http_command_executor="false" --http_credentials="/tmp/Endpoint_SlaveEndpointTest_NoAuthorizer_2_fug0x2/http_credentials"
--http_heartbeat_interval="30secs" --initialize_driver_logging="true" --isolation="posix/cpu,posix/mem"
--launcher="posix" --launcher_dir="/mesos/build/src" --logbufsecs="0" --logging_level="INFO"
--max_completed_executors_per_framework="150" --oversubscribed_resources_interval="15secs"
--perf_duration="10secs" --perf_interval="1mins" --port="5051" --qos_correction_interval_min="0ns"
--quiet="false" --recover="reconnect" --recovery_timeout="15mins" --registration_backoff_factor="10ms"
--resources="cpus:2;gpus:0;mem:1024;disk:1024;ports:[31000-32000]" --revocable_cpu_low_priority="true"
--runtime_dir="/tmp/Endpoint_SlaveEndpointTest_NoAuthorizer_2_fug0x2" --sandbox_directory="/mnt/mesos/sandbox"
--strict="true" --switch_user="true" --systemd_enable_support="true" --systemd_runtime_directory="/run/systemd/system"
--version="false" --work_dir="/tmp/Endpoint_SlaveEndpointTest_NoAuthorizer_2_w9DZSj"
I0414 02:40:30.715641 23975 credentials.hpp:86] Loading credential for authentication from
'/tmp/Endpoint_SlaveEndpointTest_NoAuthorizer_2_fug0x2/credential'
I0414 02:40:30.715785 23975 slave.cpp:258] Agent using credential for: test-principal
I0414 02:40:30.715901 23975 credentials.hpp:37] Loading credentials for authentication from
'/tmp/Endpoint_SlaveEndpointTest_NoAuthorizer_2_fug0x2/http_credentials'
I0414 02:40:30.716035 23975 http.cpp:975] Creating default 'basic' HTTP authenticator for
realm 'mesos-agent-readonly'
I0414 02:40:30.716207 23975 http.cpp:975] Creating default 'basic' HTTP authenticator for
realm 'mesos-agent-readwrite'
I0414 02:40:30.716785 23975 slave.cpp:525] Agent resources: cpus(*):2; mem(*):1024; disk(*):1024;
ports(*):[31000-32000]
I0414 02:40:30.716855 23975 slave.cpp:533] Agent attributes: [  ]
I0414 02:40:30.716893 23975 slave.cpp:538] Agent hostname: 4d40ae9389f4
I0414 02:40:30.716984 23972 status_update_manager.cpp:177] Pausing sending status updates
I0414 02:40:30.717419 23975 state.cpp:62] Recovering state from '/tmp/Endpoint_SlaveEndpointTest_NoAuthorizer_2_w9DZSj/meta'
I0414 02:40:30.717675 23975 status_update_manager.cpp:203] Recovering status update manager
I0414 02:40:30.717743 23975 containerizer.cpp:608] Recovering containerizer
I0414 02:40:30.718435 23971 provisioner.cpp:410] Provisioner recovery complete
I0414 02:40:30.718580 23982 slave.cpp:5963] Finished recovery
I0414 02:40:30.719169 23982 slave.cpp:6145] Querying resource estimator for oversubscribable
resources
I0414 02:40:30.719441 23982 slave.cpp:6159] Received oversubscribable resources {} from the
resource estimator
I0414 02:40:30.720309 23970 process.cpp:3722] Handling HTTP event for process 'slave(731)'
with path: '/slave(731)/containers'
I0414 02:40:30.720701 23970 http.cpp:1115] HTTP GET for /slave(731)/containers from 172.17.0.3:55083
I0414 02:40:30.720742 23970 http.cpp:936] Authorizing principal 'test-principal' to GET the
'/containers' endpoint
I0414 02:40:30.722154 23966 slave.cpp:790] Agent terminating
[       OK ] Endpoint/SlaveEndpointTest.NoAuthorizer/2 (15 ms)
[----------] 9 tests from Endpoint/SlaveEndpointTest (130 ms total)

[----------] Global test environment tear-down
[==========] 1487 tests from 166 test cases ran. (231058 ms total)
[  PASSED  ] 1486 tests.
[  FAILED  ] 1 test, listed below:
[  FAILED  ] ContentType/SchedulerTest.MasterFailover/0, where GetParam() = application/x-protobuf

 1 FAILED TEST
  YOU HAVE 12 DISABLED TESTS

make[3]: *** [CMakeFiles/check] Error 1
make[3]: Leaving directory `/mesos/build'
make[2]: *** [CMakeFiles/check.dir/all] Error 2
make[2]: Leaving directory `/mesos/build'
make[1]: *** [CMakeFiles/check.dir/rule] Error 2
make[1]: Leaving directory `/mesos/build'
make: *** [check] Error 2
+ docker rmi mesos-1492135250-26221
Untagged: mesos-1492135250-26221:latest
Deleted: sha256:da0a67ef91ee29d5a01a7d60dfa373a5da7407d4e48be1ba062051d574f05dfb
Deleted: sha256:1a8617403bc9878c1aea1c504fb52575a007d9fb7286ffbec29b968fdf488cc9
Deleted: sha256:75e0439822838766011886885eddc5753bea56e0ef7d9289c57326b6058e41f4
Deleted: sha256:0d45a8ba0c72949807261b9c9503eddbe40f54dcad8a5b3e83c81c22e2a45aae
Deleted: sha256:c6e0df1453601b7a8b5d1fdc6e9a62348dc0ce424240b06ed86d1d8e5db2b5e9
Deleted: sha256:a13102d1ac1896ffc4adb50af2ca4af0470f0c02fed230ce85de47f32783c327
Deleted: sha256:e0ebae14eebce3d7b6d44e5ba9b80bd71652fbfc2a553dda4dd1f9d726ff83f6
Deleted: sha256:b16078da11dbe7211bcf4fafa357ba29a9d66c23944e0f4d3bb669edae68256f
Deleted: sha256:3f78b743d1e8d30448edaf8d05efd747cc4ff2b4a5d997e2d1511bdd371e2e54
Deleted: sha256:acd1241bb9ad2811ea38945bc782260c79b7ccb92645fd394aa25e855a72cd4b
Deleted: sha256:7155ccb3b66303b2d1e87ed12cf9884d56ddfd467b85853eb005c08f65009ba4
Deleted: sha256:9f0943b3eeafeda1a887b3182ae3f78ca728efd7928cbed9ee90f2fa0e63fcb8
Deleted: sha256:b6833a5c3b109367dbafbfa9d69e43b396f19ab4bff8aae1e647a7b88a0b6551
Deleted: sha256:064ecf1a97a3408a3302f830624aae25265b1f1b70b3011168dedb0b40f2c408
Deleted: sha256:a7391127c66a03c1d11dcf7f200c2ddcac92983089c4539c58850c895440d0ec
Deleted: sha256:95d70cba309ab3621687d668a74b14308c2f1e0024707729088230e25894b88d
Deleted: sha256:601532d3845604dca47ab6f13630313a0618b9ceec5f0b4886059127b6c59071
Deleted: sha256:b8584b78d069e4bf8f2ec12f16eefe7fd9da30e4f02c0c977558c2bcb3b107e9
Deleted: sha256:cbe31a388b64eb708ba8db4bc7d39503a5d3c3df320cd0fdf70f8a4d2b835554
Deleted: sha256:b14c7158256da87805cab014bbf335afe5186db83e2138a837c318c15d2965c4
Deleted: sha256:0692b954a7f4c72b32a89a740158d5b4fe4d801f827a0c2f999d54e33ec74d46
Deleted: sha256:7fb4859b3eb6f0e78a577a9efc051316f141245cad5f7b833144eecb3d5fb3b1
Deleted: sha256:bf9d0c349baace7f5aacb365b5ca24f525e2825351729d142ec6922d9cc14071
Deleted: sha256:58a08f1e3de0039c7fdb49bcd1930058320a87af6ae12bcde325790d7adfaefb
Build step 'Execute shell' marked build as failure

Mime
View raw message