mesos-builds mailing list archives

Site index · List index
Message view « Date » · « Thread »
Top « Date » · « Thread »
From Apache Jenkins Server <jenk...@builds.apache.org>
Subject Build failed in Jenkins: Mesos-Buildbot » autotools,gcc,--verbose,GLOG_v=1 MESOS_VERBOSE=1,centos:7,(docker||Hadoop)&&(!ubuntu-us1)&&(!ubuntu-eu2) #3572
Date Thu, 27 Apr 2017 06:15:27 GMT
See <https://builds.apache.org/job/Mesos-Buildbot/BUILDTOOL=autotools,COMPILER=gcc,CONFIGURATION=--verbose,ENVIRONMENT=GLOG_v=1%20MESOS_VERBOSE=1,OS=centos%3A7,label_exp=(docker%7C%7CHadoop)&&(!ubuntu-us1)&&(!ubuntu-eu2)/3572/display/redirect>

------------------------------------------
[...truncated 26.50 MB...]
[       OK ] Endpoint/SlaveEndpointTest.AuthorizedRequest/1 (34 ms)
[ RUN      ] Endpoint/SlaveEndpointTest.AuthorizedRequest/2
I0427 06:15:21.343971 31663 containerizer.cpp:221] Using isolation: posix/cpu,posix/mem,filesystem/posix,network/cni
W0427 06:15:21.344744 31663 backend.cpp:76] Failed to create 'aufs' backend: AufsBackend requires
root privileges
W0427 06:15:21.344874 31663 backend.cpp:76] Failed to create 'bind' backend: BindBackend requires
root privileges
I0427 06:15:21.344923 31663 provisioner.cpp:249] Using default backend 'copy'
I0427 06:15:21.349251 31682 slave.cpp:225] Mesos agent started on (734)@172.17.0.2:53142
I0427 06:15:21.349285 31682 slave.cpp:226] Flags at startup: --acls="" --appc_simple_discovery_uri_prefix="http://"
--appc_store_dir="/tmp/mesos/store/appc" --authenticate_http_readonly="true" --authenticate_http_readwrite="true"
--authenticatee="crammd5" --authentication_backoff_factor="1secs" --authorizer="local" --cgroups_cpu_enable_pids_and_tids_count="false"
--cgroups_enable_cfs="false" --cgroups_hierarchy="/sys/fs/cgroup" --cgroups_limit_swap="false"
--cgroups_root="mesos" --container_disk_watch_interval="15secs" --containerizers="mesos" --credential="/tmp/Endpoint_SlaveEndpointTest_AuthorizedRequest_2_yPBoQJ/credential"
--default_role="*" --disk_watch_interval="1mins" --docker="docker" --docker_kill_orphans="true"
--docker_registry="https://registry-1.docker.io" --docker_remove_delay="6hrs" --docker_socket="/var/run/docker.sock"
--docker_stop_timeout="0ns" --docker_store_dir="/tmp/mesos/store/docker" --docker_volume_checkpoint_dir="/var/run/mesos/isolators/docker/volume"
--enforce_container_disk_quota="false" --executor_registration_timeout="1mins" --executor_shutdown_grace_period="5secs"
--fetcher_cache_dir="/tmp/Endpoint_SlaveEndpointTest_AuthorizedRequest_2_yPBoQJ/fetch" --fetcher_cache_size="2GB"
--frameworks_home="" --gc_delay="1weeks" --gc_disk_headroom="0.1" --hadoop_home="" --help="false"
--hostname_lookup="true" --http_command_executor="false" --http_credentials="/tmp/Endpoint_SlaveEndpointTest_AuthorizedRequest_2_yPBoQJ/http_credentials"
--http_heartbeat_interval="30secs" --initialize_driver_logging="true" --isolation="posix/cpu,posix/mem"
--launcher="posix" --launcher_dir="/mesos/mesos-1.3.0/_build/src" --logbufsecs="0" --logging_level="INFO"
--max_completed_executors_per_framework="150" --oversubscribed_resources_interval="15secs"
--perf_duration="10secs" --perf_interval="1mins" --port="5051" --qos_correction_interval_min="0ns"
--quiet="false" --recover="reconnect" --recovery_timeout="15mins" --registration_backoff_factor="10ms"
--resources="cpus:2;gpus:0;mem:1024;disk:1024;ports:[31000-32000]" --revocable_cpu_low_priority="true"
--runtime_dir="/tmp/Endpoint_SlaveEndpointTest_AuthorizedRequest_2_yPBoQJ" --sandbox_directory="/mnt/mesos/sandbox"
--strict="true" --switch_user="true" --systemd_enable_support="true" --systemd_runtime_directory="/run/systemd/system"
--version="false" --work_dir="/tmp/Endpoint_SlaveEndpointTest_AuthorizedRequest_2_b2L7bj"
I0427 06:15:21.349844 31682 credentials.hpp:86] Loading credential for authentication from
'/tmp/Endpoint_SlaveEndpointTest_AuthorizedRequest_2_yPBoQJ/credential'
I0427 06:15:21.350069 31682 slave.cpp:258] Agent using credential for: test-principal
I0427 06:15:21.350100 31682 credentials.hpp:37] Loading credentials for authentication from
'/tmp/Endpoint_SlaveEndpointTest_AuthorizedRequest_2_yPBoQJ/http_credentials'
I0427 06:15:21.350466 31682 http.cpp:975] Creating default 'basic' HTTP authenticator for
realm 'mesos-agent-readonly'
I0427 06:15:21.350626 31682 http.cpp:975] Creating default 'basic' HTTP authenticator for
realm 'mesos-agent-readwrite'
I0427 06:15:21.351912 31682 slave.cpp:525] Agent resources: cpus(*):2; mem(*):1024; disk(*):1024;
ports(*):[31000-32000]
I0427 06:15:21.351994 31682 slave.cpp:533] Agent attributes: [  ]
I0427 06:15:21.352007 31682 slave.cpp:538] Agent hostname: e8b0125ae30a
I0427 06:15:21.352177 31684 status_update_manager.cpp:177] Pausing sending status updates
I0427 06:15:21.353471 31688 state.cpp:62] Recovering state from '/tmp/Endpoint_SlaveEndpointTest_AuthorizedRequest_2_b2L7bj/meta'
I0427 06:15:21.353837 31682 status_update_manager.cpp:203] Recovering status update manager
I0427 06:15:21.354053 31691 containerizer.cpp:608] Recovering containerizer
I0427 06:15:21.355546 31683 provisioner.cpp:410] Provisioner recovery complete
I0427 06:15:21.355973 31685 slave.cpp:5963] Finished recovery
I0427 06:15:21.356582 31685 slave.cpp:6145] Querying resource estimator for oversubscribable
resources
I0427 06:15:21.356905 31686 slave.cpp:6159] Received oversubscribable resources {} from the
resource estimator
I0427 06:15:21.359616 31686 process.cpp:3731] Handling HTTP event for process 'slave(734)'
with path: '/slave(734)/containers'
I0427 06:15:21.361001 31683 http.cpp:1115] HTTP GET for /slave(734)/containers from 172.17.0.2:45804
I0427 06:15:21.361117 31683 http.cpp:936] Authorizing principal 'test-principal' to GET the
'/containers' endpoint
I0427 06:15:21.364897 31691 slave.cpp:790] Agent terminating
[       OK ] Endpoint/SlaveEndpointTest.AuthorizedRequest/2 (33 ms)
[ RUN      ] Endpoint/SlaveEndpointTest.UnauthorizedRequest/0
I0427 06:15:21.374763 31663 containerizer.cpp:221] Using isolation: posix/cpu,posix/mem,filesystem/posix,network/cni
W0427 06:15:21.375258 31663 backend.cpp:76] Failed to create 'aufs' backend: AufsBackend requires
root privileges
W0427 06:15:21.375362 31663 backend.cpp:76] Failed to create 'bind' backend: BindBackend requires
root privileges
I0427 06:15:21.375401 31663 provisioner.cpp:249] Using default backend 'copy'
I0427 06:15:21.379524 31685 slave.cpp:225] Mesos agent started on (735)@172.17.0.2:53142
I0427 06:15:21.379547 31685 slave.cpp:226] Flags at startup: --acls="" --appc_simple_discovery_uri_prefix="http://"
--appc_store_dir="/tmp/mesos/store/appc" --authenticate_http_readonly="true" --authenticate_http_readwrite="true"
--authenticatee="crammd5" --authentication_backoff_factor="1secs" --authorizer="local" --cgroups_cpu_enable_pids_and_tids_count="false"
--cgroups_enable_cfs="false" --cgroups_hierarchy="/sys/fs/cgroup" --cgroups_limit_swap="false"
--cgroups_root="mesos" --container_disk_watch_interval="15secs" --containerizers="mesos" --credential="/tmp/Endpoint_SlaveEndpointTest_UnauthorizedRequest_0_KTFlJs/credential"
--default_role="*" --disk_watch_interval="1mins" --docker="docker" --docker_kill_orphans="true"
--docker_registry="https://registry-1.docker.io" --docker_remove_delay="6hrs" --docker_socket="/var/run/docker.sock"
--docker_stop_timeout="0ns" --docker_store_dir="/tmp/mesos/store/docker" --docker_volume_checkpoint_dir="/var/run/mesos/isolators/docker/volume"
--enforce_container_disk_quota="false" --executor_registration_timeout="1mins" --executor_shutdown_grace_period="5secs"
--fetcher_cache_dir="/tmp/Endpoint_SlaveEndpointTest_UnauthorizedRequest_0_KTFlJs/fetch" --fetcher_cache_size="2GB"
--frameworks_home="" --gc_delay="1weeks" --gc_disk_headroom="0.1" --hadoop_home="" --help="false"
--hostname_lookup="true" --http_command_executor="false" --http_credentials="/tmp/Endpoint_SlaveEndpointTest_UnauthorizedRequest_0_KTFlJs/http_credentials"
--http_heartbeat_interval="30secs" --initialize_driver_logging="true" --isolation="posix/cpu,posix/mem"
--launcher="posix" --launcher_dir="/mesos/mesos-1.3.0/_build/src" --logbufsecs="0" --logging_level="INFO"
--max_completed_executors_per_framework="150" --oversubscribed_resources_interval="15secs"
--perf_duration="10secs" --perf_interval="1mins" --port="5051" --qos_correction_interval_min="0ns"
--quiet="false" --recover="reconnect" --recovery_timeout="15mins" --registration_backoff_factor="10ms"
--resources="cpus:2;gpus:0;mem:1024;disk:1024;ports:[31000-32000]" --revocable_cpu_low_priority="true"
--runtime_dir="/tmp/Endpoint_SlaveEndpointTest_UnauthorizedRequest_0_KTFlJs" --sandbox_directory="/mnt/mesos/sandbox"
--strict="true" --switch_user="true" --systemd_enable_support="true" --systemd_runtime_directory="/run/systemd/system"
--version="false" --work_dir="/tmp/Endpoint_SlaveEndpointTest_UnauthorizedRequest_0_VjZRZ1"
I0427 06:15:21.379909 31685 credentials.hpp:86] Loading credential for authentication from
'/tmp/Endpoint_SlaveEndpointTest_UnauthorizedRequest_0_KTFlJs/credential'
I0427 06:15:21.380076 31685 slave.cpp:258] Agent using credential for: test-principal
I0427 06:15:21.380098 31685 credentials.hpp:37] Loading credentials for authentication from
'/tmp/Endpoint_SlaveEndpointTest_UnauthorizedRequest_0_KTFlJs/http_credentials'
I0427 06:15:21.380317 31685 http.cpp:975] Creating default 'basic' HTTP authenticator for
realm 'mesos-agent-readonly'
I0427 06:15:21.380455 31685 http.cpp:975] Creating default 'basic' HTTP authenticator for
realm 'mesos-agent-readwrite'
I0427 06:15:21.381688 31685 slave.cpp:525] Agent resources: cpus(*):2; mem(*):1024; disk(*):1024;
ports(*):[31000-32000]
I0427 06:15:21.381770 31685 slave.cpp:533] Agent attributes: [  ]
I0427 06:15:21.381783 31685 slave.cpp:538] Agent hostname: e8b0125ae30a
I0427 06:15:21.381934 31695 status_update_manager.cpp:177] Pausing sending status updates
I0427 06:15:21.383539 31690 state.cpp:62] Recovering state from '/tmp/Endpoint_SlaveEndpointTest_UnauthorizedRequest_0_VjZRZ1/meta'
I0427 06:15:21.383880 31688 status_update_manager.cpp:203] Recovering status update manager
I0427 06:15:21.384194 31682 containerizer.cpp:608] Recovering containerizer
I0427 06:15:21.385617 31688 provisioner.cpp:410] Provisioner recovery complete
I0427 06:15:21.386117 31697 slave.cpp:5963] Finished recovery
I0427 06:15:21.386732 31697 slave.cpp:6145] Querying resource estimator for oversubscribable
resources
I0427 06:15:21.387081 31682 slave.cpp:6159] Received oversubscribable resources {} from the
resource estimator
I0427 06:15:21.389853 31686 process.cpp:3731] Handling HTTP event for process 'slave(735)'
with path: '/slave(735)/monitor/statistics'
I0427 06:15:21.391199 31688 http.cpp:1115] HTTP GET for /slave(735)/monitor/statistics from
172.17.0.2:45805
I0427 06:15:21.391283 31688 http.cpp:936] Authorizing principal 'test-principal' to GET the
'/monitor/statistics' endpoint
I0427 06:15:21.393612 31683 slave.cpp:790] Agent terminating
[       OK ] Endpoint/SlaveEndpointTest.UnauthorizedRequest/0 (29 ms)
[ RUN      ] Endpoint/SlaveEndpointTest.UnauthorizedRequest/1
I0427 06:15:21.406556 31663 containerizer.cpp:221] Using isolation: posix/cpu,posix/mem,filesystem/posix,network/cni
W0427 06:15:21.407369 31663 backend.cpp:76] Failed to create 'aufs' backend: AufsBackend requires
root privileges
W0427 06:15:21.407503 31663 backend.cpp:76] Failed to create 'bind' backend: BindBackend requires
root privileges
I0427 06:15:21.407595 31663 provisioner.cpp:249] Using default backend 'copy'
I0427 06:15:21.411911 31682 slave.cpp:225] Mesos agent started on (736)@172.17.0.2:53142
I0427 06:15:21.411936 31682 slave.cpp:226] Flags at startup: --acls="" --appc_simple_discovery_uri_prefix="http://"
--appc_store_dir="/tmp/mesos/store/appc" --authenticate_http_readonly="true" --authenticate_http_readwrite="true"
--authenticatee="crammd5" --authentication_backoff_factor="1secs" --authorizer="local" --cgroups_cpu_enable_pids_and_tids_count="false"
--cgroups_enable_cfs="false" --cgroups_hierarchy="/sys/fs/cgroup" --cgroups_limit_swap="false"
--cgroups_root="mesos" --container_disk_watch_interval="15secs" --containerizers="mesos" --credential="/tmp/Endpoint_SlaveEndpointTest_UnauthorizedRequest_1_kq1TVb/credential"
--default_role="*" --disk_watch_interval="1mins" --docker="docker" --docker_kill_orphans="true"
--docker_registry="https://registry-1.docker.io" --docker_remove_delay="6hrs" --docker_socket="/var/run/docker.sock"
--docker_stop_timeout="0ns" --docker_store_dir="/tmp/mesos/store/docker" --docker_volume_checkpoint_dir="/var/run/mesos/isolators/docker/volume"
--enforce_container_disk_quota="false" --executor_registration_timeout="1mins" --executor_shutdown_grace_period="5secs"
--fetcher_cache_dir="/tmp/Endpoint_SlaveEndpointTest_UnauthorizedRequest_1_kq1TVb/fetch" --fetcher_cache_size="2GB"
--frameworks_home="" --gc_delay="1weeks" --gc_disk_headroom="0.1" --hadoop_home="" --help="false"
--hostname_lookup="true" --http_command_executor="false" --http_credentials="/tmp/Endpoint_SlaveEndpointTest_UnauthorizedRequest_1_kq1TVb/http_credentials"
--http_heartbeat_interval="30secs" --initialize_driver_logging="true" --isolation="posix/cpu,posix/mem"
--launcher="posix" --launcher_dir="/mesos/mesos-1.3.0/_build/src" --logbufsecs="0" --logging_level="INFO"
--max_completed_executors_per_framework="150" --oversubscribed_resources_interval="15secs"
--perf_duration="10secs" --perf_interval="1mins" --port="5051" --qos_correction_interval_min="0ns"
--quiet="false" --recover="reconnect" --recovery_timeout="15mins" --registration_backoff_factor="10ms"
--resources="cpus:2;gpus:0;mem:1024;disk:1024;ports:[31000-32000]" --revocable_cpu_low_priority="true"
--runtime_dir="/tmp/Endpoint_SlaveEndpointTest_UnauthorizedRequest_1_kq1TVb" --sandbox_directory="/mnt/mesos/sandbox"
--strict="true" --switch_user="true" --systemd_enable_support="true" --systemd_runtime_directory="/run/systemd/system"
--version="false" --work_dir="/tmp/Endpoint_SlaveEndpointTest_UnauthorizedRequest_1_1EUs7K"
I0427 06:15:21.412423 31682 credentials.hpp:86] Loading credential for authentication from
'/tmp/Endpoint_SlaveEndpointTest_UnauthorizedRequest_1_kq1TVb/credential'
I0427 06:15:21.412633 31682 slave.cpp:258] Agent using credential for: test-principal
I0427 06:15:21.412663 31682 credentials.hpp:37] Loading credentials for authentication from
'/tmp/Endpoint_SlaveEndpointTest_UnauthorizedRequest_1_kq1TVb/http_credentials'
I0427 06:15:21.412936 31682 http.cpp:975] Creating default 'basic' HTTP authenticator for
realm 'mesos-agent-readonly'
I0427 06:15:21.413108 31682 http.cpp:975] Creating default 'basic' HTTP authenticator for
realm 'mesos-agent-readwrite'
I0427 06:15:21.414364 31682 slave.cpp:525] Agent resources: cpus(*):2; mem(*):1024; disk(*):1024;
ports(*):[31000-32000]
I0427 06:15:21.414479 31682 slave.cpp:533] Agent attributes: [  ]
I0427 06:15:21.414497 31682 slave.cpp:538] Agent hostname: e8b0125ae30a
I0427 06:15:21.414671 31696 status_update_manager.cpp:177] Pausing sending status updates
I0427 06:15:21.416050 31695 state.cpp:62] Recovering state from '/tmp/Endpoint_SlaveEndpointTest_UnauthorizedRequest_1_1EUs7K/meta'
I0427 06:15:21.416391 31690 status_update_manager.cpp:203] Recovering status update manager
I0427 06:15:21.416632 31693 containerizer.cpp:608] Recovering containerizer
I0427 06:15:21.418154 31686 provisioner.cpp:410] Provisioner recovery complete
I0427 06:15:21.418565 31687 slave.cpp:5963] Finished recovery
I0427 06:15:21.419230 31687 slave.cpp:6145] Querying resource estimator for oversubscribable
resources
I0427 06:15:21.419529 31686 slave.cpp:6159] Received oversubscribable resources {} from the
resource estimator
I0427 06:15:21.422183 31684 process.cpp:3731] Handling HTTP event for process 'slave(736)'
with path: '/slave(736)/monitor/statistics.json'
I0427 06:15:21.423526 31695 http.cpp:1115] HTTP GET for /slave(736)/monitor/statistics.json
from 172.17.0.2:45806
I0427 06:15:21.423621 31695 http.cpp:936] Authorizing principal 'test-principal' to GET the
'/monitor/statistics.json' endpoint
I0427 06:15:21.425810 31692 slave.cpp:790] Agent terminating
[       OK ] Endpoint/SlaveEndpointTest.UnauthorizedRequest/1 (31 ms)
[ RUN      ] Endpoint/SlaveEndpointTest.UnauthorizedRequest/2
I0427 06:15:21.435302 31663 containerizer.cpp:221] Using isolation: posix/cpu,posix/mem,filesystem/posix,network/cni
W0427 06:15:21.435822 31663 backend.cpp:76] Failed to create 'aufs' backend: AufsBackend requires
root privileges
W0427 06:15:21.435937 31663 backend.cpp:76] Failed to create 'bind' backend: BindBackend requires
root privileges
I0427 06:15:21.436033 31663 provisioner.cpp:249] Using default backend 'copy'
I0427 06:15:21.439169 31686 slave.cpp:225] Mesos agent started on (737)@172.17.0.2:53142
I0427 06:15:21.439198 31686 slave.cpp:226] Flags at startup: --acls="" --appc_simple_discovery_uri_prefix="http://"
--appc_store_dir="/tmp/mesos/store/appc" --authenticate_http_readonly="true" --authenticate_http_readwrite="true"
--authenticatee="crammd5" --authentication_backoff_factor="1secs" --authorizer="local" --cgroups_cpu_enable_pids_and_tids_count="false"
--cgroups_enable_cfs="false" --cgroups_hierarchy="/sys/fs/cgroup" --cgroups_limit_swap="false"
--cgroups_root="mesos" --container_disk_watch_interval="15secs" --containerizers="mesos" --credential="/tmp/Endpoint_SlaveEndpointTest_UnauthorizedRequest_2_AsKvsV/credential"
--default_role="*" --disk_watch_interval="1mins" --docker="docker" --docker_kill_orphans="true"
--docker_registry="https://registry-1.docker.io" --docker_remove_delay="6hrs" --docker_socket="/var/run/docker.sock"
--docker_stop_timeout="0ns" --docker_store_dir="/tmp/mesos/store/docker" --docker_volume_checkpoint_dir="/var/run/mesos/isolators/docker/volume"
--enforce_container_disk_quota="false" --executor_registration_timeout="1mins" --executor_shutdown_grace_period="5secs"
--fetcher_cache_dir="/tmp/Endpoint_SlaveEndpointTest_UnauthorizedRequest_2_AsKvsV/fetch" --fetcher_cache_size="2GB"
--frameworks_home="" --gc_delay="1weeks" --gc_disk_headroom="0.1" --hadoop_home="" --help="false"
--hostname_lookup="true" --http_command_executor="false" --http_credentials="/tmp/Endpoint_SlaveEndpointTest_UnauthorizedRequest_2_AsKvsV/http_credentials"
--http_heartbeat_interval="30secs" --initialize_driver_logging="true" --isolation="posix/cpu,posix/mem"
--launcher="posix" --launcher_dir="/mesos/mesos-1.3.0/_build/src" --logbufsecs="0" --logging_level="INFO"
--max_completed_executors_per_framework="150" --oversubscribed_resources_interval="15secs"
--perf_duration="10secs" --perf_interval="1mins" --port="5051" --qos_correction_interval_min="0ns"
--quiet="false" --recover="reconnect" --recovery_timeout="15mins" --registration_backoff_factor="10ms"
--resources="cpus:2;gpus:0;mem:1024;disk:1024;ports:[31000-32000]" --revocable_cpu_low_priority="true"
--runtime_dir="/tmp/Endpoint_SlaveEndpointTest_UnauthorizedRequest_2_AsKvsV" --sandbox_directory="/mnt/mesos/sandbox"
--strict="true" --switch_user="true" --systemd_enable_support="true" --systemd_runtime_directory="/run/systemd/system"
--version="false" --work_dir="/tmp/Endpoint_SlaveEndpointTest_UnauthorizedRequest_2_nLMczu"
I0427 06:15:21.439718 31686 credentials.hpp:86] Loading credential for authentication from
'/tmp/Endpoint_SlaveEndpointTest_UnauthorizedRequest_2_AsKvsV/credential'
I0427 06:15:21.439940 31686 slave.cpp:258] Agent using credential for: test-principal
I0427 06:15:21.439968 31686 credentials.hpp:37] Loading credentials for authentication from
'/tmp/Endpoint_SlaveEndpointTest_UnauthorizedRequest_2_AsKvsV/http_credentials'
I0427 06:15:21.440289 31686 http.cpp:975] Creating default 'basic' HTTP authenticator for
realm 'mesos-agent-readonly'
I0427 06:15:21.440466 31686 http.cpp:975] Creating default 'basic' HTTP authenticator for
realm 'mesos-agent-readwrite'
I0427 06:15:21.441704 31686 slave.cpp:525] Agent resources: cpus(*):2; mem(*):1024; disk(*):1024;
ports(*):[31000-32000]
I0427 06:15:21.441787 31686 slave.cpp:533] Agent attributes: [  ]
I0427 06:15:21.441802 31686 slave.cpp:538] Agent hostname: e8b0125ae30a
I0427 06:15:21.441946 31692 status_update_manager.cpp:177] Pausing sending status updates
I0427 06:15:21.443325 31683 state.cpp:62] Recovering state from '/tmp/Endpoint_SlaveEndpointTest_UnauthorizedRequest_2_nLMczu/meta'
I0427 06:15:21.443716 31691 status_update_manager.cpp:203] Recovering status update manager
I0427 06:15:21.443998 31684 containerizer.cpp:608] Recovering containerizer
I0427 06:15:21.445539 31683 provisioner.cpp:410] Provisioner recovery complete
I0427 06:15:21.445976 31695 slave.cpp:5963] Finished recovery
I0427 06:15:21.446566 31695 slave.cpp:6145] Querying resource estimator for oversubscribable
resources
I0427 06:15:21.446934 31682 slave.cpp:6159] Received oversubscribable resources {} from the
resource estimator
I0427 06:15:21.449754 31693 process.cpp:3731] Handling HTTP event for process 'slave(737)'
with path: '/slave(737)/containers'
I0427 06:15:21.452136 31693 http.cpp:1115] HTTP GET for /slave(737)/containers from 172.17.0.2:45807
I0427 06:15:21.452921 31693 http.cpp:936] Authorizing principal 'test-principal' to GET the
'/containers' endpoint
I0427 06:15:21.458315 31663 slave.cpp:790] Agent terminating
[       OK ] Endpoint/SlaveEndpointTest.UnauthorizedRequest/2 (35 ms)
[ RUN      ] Endpoint/SlaveEndpointTest.NoAuthorizer/0
I0427 06:15:21.470608 31663 containerizer.cpp:221] Using isolation: posix/cpu,posix/mem,filesystem/posix,network/cni
W0427 06:15:21.471138 31663 backend.cpp:76] Failed to create 'aufs' backend: AufsBackend requires
root privileges
W0427 06:15:21.471261 31663 backend.cpp:76] Failed to create 'bind' backend: BindBackend requires
root privileges
I0427 06:15:21.471330 31663 provisioner.cpp:249] Using default backend 'copy'
I0427 06:15:21.472947 31663 cluster.cpp:448] Creating default 'local' authorizer
I0427 06:15:21.474573 31693 slave.cpp:225] Mesos agent started on (738)@172.17.0.2:53142
I0427 06:15:21.474601 31693 slave.cpp:226] Flags at startup: --acls="" --appc_simple_discovery_uri_prefix="http://"
--appc_store_dir="/tmp/mesos/store/appc" --authenticate_http_readonly="true" --authenticate_http_readwrite="true"
--authenticatee="crammd5" --authentication_backoff_factor="1secs" --authorizer="local" --cgroups_cpu_enable_pids_and_tids_count="false"
--cgroups_enable_cfs="false" --cgroups_hierarchy="/sys/fs/cgroup" --cgroups_limit_swap="false"
--cgroups_root="mesos" --container_disk_watch_interval="15secs" --containerizers="mesos" --credential="/tmp/Endpoint_SlaveEndpointTest_NoAuthorizer_0_ePBCkF/credential"
--default_role="*" --disk_watch_interval="1mins" --docker="docker" --docker_kill_orphans="true"
--docker_registry="https://registry-1.docker.io" --docker_remove_delay="6hrs" --docker_socket="/var/run/docker.sock"
--docker_stop_timeout="0ns" --docker_store_dir="/tmp/mesos/store/docker" --docker_volume_checkpoint_dir="/var/run/mesos/isolators/docker/volume"
--enforce_container_disk_quota="false" --executor_registration_timeout="1mins" --executor_shutdown_grace_period="5secs"
--fetcher_cache_dir="/tmp/Endpoint_SlaveEndpointTest_NoAuthorizer_0_ePBCkF/fetch" --fetcher_cache_size="2GB"
--frameworks_home="" --gc_delay="1weeks" --gc_disk_headroom="0.1" --hadoop_home="" --help="false"
--hostname_lookup="true" --http_command_executor="false" --http_credentials="/tmp/Endpoint_SlaveEndpointTest_NoAuthorizer_0_ePBCkF/http_credentials"
--http_heartbeat_interval="30secs" --initialize_driver_logging="true" --isolation="posix/cpu,posix/mem"
--launcher="posix" --launcher_dir="/mesos/mesos-1.3.0/_build/src" --logbufsecs="0" --logging_level="INFO"
--max_completed_executors_per_framework="150" --oversubscribed_resources_interval="15secs"
--perf_duration="10secs" --perf_interval="1mins" --port="5051" --qos_correction_interval_min="0ns"
--quiet="false" --recover="reconnect" --recovery_timeout="15mins" --registration_backoff_factor="10ms"
--resources="cpus:2;gpus:0;mem:1024;disk:1024;ports:[31000-32000]" --revocable_cpu_low_priority="true"
--runtime_dir="/tmp/Endpoint_SlaveEndpointTest_NoAuthorizer_0_ePBCkF" --sandbox_directory="/mnt/mesos/sandbox"
--strict="true" --switch_user="true" --systemd_enable_support="true" --systemd_runtime_directory="/run/systemd/system"
--version="false" --work_dir="/tmp/Endpoint_SlaveEndpointTest_NoAuthorizer_0_bZOCle"
I0427 06:15:21.475260 31693 credentials.hpp:86] Loading credential for authentication from
'/tmp/Endpoint_SlaveEndpointTest_NoAuthorizer_0_ePBCkF/credential'
I0427 06:15:21.475559 31693 slave.cpp:258] Agent using credential for: test-principal
I0427 06:15:21.475589 31693 credentials.hpp:37] Loading credentials for authentication from
'/tmp/Endpoint_SlaveEndpointTest_NoAuthorizer_0_ePBCkF/http_credentials'
I0427 06:15:21.475953 31693 http.cpp:975] Creating default 'basic' HTTP authenticator for
realm 'mesos-agent-readonly'
I0427 06:15:21.476111 31693 http.cpp:975] Creating default 'basic' HTTP authenticator for
realm 'mesos-agent-readwrite'
I0427 06:15:21.477337 31693 slave.cpp:525] Agent resources: cpus(*):2; mem(*):1024; disk(*):1024;
ports(*):[31000-32000]
I0427 06:15:21.477422 31693 slave.cpp:533] Agent attributes: [  ]
I0427 06:15:21.477442 31693 slave.cpp:538] Agent hostname: e8b0125ae30a
I0427 06:15:21.477885 31695 status_update_manager.cpp:177] Pausing sending status updates
I0427 06:15:21.479204 31683 state.cpp:62] Recovering state from '/tmp/Endpoint_SlaveEndpointTest_NoAuthorizer_0_bZOCle/meta'
I0427 06:15:21.479645 31683 status_update_manager.cpp:203] Recovering status update manager
I0427 06:15:21.479945 31697 containerizer.cpp:608] Recovering containerizer
I0427 06:15:21.481536 31683 provisioner.cpp:410] Provisioner recovery complete
I0427 06:15:21.482130 31684 slave.cpp:5963] Finished recovery
I0427 06:15:21.482872 31684 slave.cpp:6145] Querying resource estimator for oversubscribable
resources
I0427 06:15:21.483330 31689 slave.cpp:6159] Received oversubscribable resources {} from the
resource estimator
I0427 06:15:21.486539 31692 process.cpp:3731] Handling HTTP event for process 'slave(738)'
with path: '/slave(738)/monitor/statistics'
I0427 06:15:21.488872 31692 http.cpp:1115] HTTP GET for /slave(738)/monitor/statistics from
172.17.0.2:45808
I0427 06:15:21.488970 31692 http.cpp:936] Authorizing principal 'test-principal' to GET the
'/monitor/statistics' endpoint
I0427 06:15:21.492960 31694 slave.cpp:790] Agent terminating
[       OK ] Endpoint/SlaveEndpointTest.NoAuthorizer/0 (32 ms)
[ RUN      ] Endpoint/SlaveEndpointTest.NoAuthorizer/1
I0427 06:15:21.502883 31663 containerizer.cpp:221] Using isolation: posix/cpu,posix/mem,filesystem/posix,network/cni
W0427 06:15:21.503422 31663 backend.cpp:76] Failed to create 'aufs' backend: AufsBackend requires
root privileges
W0427 06:15:21.503532 31663 backend.cpp:76] Failed to create 'bind' backend: BindBackend requires
root privileges
I0427 06:15:21.503614 31663 provisioner.cpp:249] Using default backend 'copy'
I0427 06:15:21.505143 31663 cluster.cpp:448] Creating default 'local' authorizer
I0427 06:15:21.506788 31692 slave.cpp:225] Mesos agent started on (739)@172.17.0.2:53142
I0427 06:15:21.508466 31692 slave.cpp:226] Flags at startup: --acls="" --appc_simple_discovery_uri_prefix="http://"
--appc_store_dir="/tmp/mesos/store/appc" --authenticate_http_readonly="true" --authenticate_http_readwrite="true"
--authenticatee="crammd5" --authentication_backoff_factor="1secs" --authorizer="local" --cgroups_cpu_enable_pids_and_tids_count="false"
--cgroups_enable_cfs="false" --cgroups_hierarchy="/sys/fs/cgroup" --cgroups_limit_swap="false"
--cgroups_root="mesos" --container_disk_watch_interval="15secs" --containerizers="mesos" --credential="/tmp/Endpoint_SlaveEndpointTest_NoAuthorizer_1_kaAmyp/credential"
--default_role="*" --disk_watch_interval="1mins" --docker="docker" --docker_kill_orphans="true"
--docker_registry="https://registry-1.docker.io" --docker_remove_delay="6hrs" --docker_socket="/var/run/docker.sock"
--docker_stop_timeout="0ns" --docker_store_dir="/tmp/mesos/store/docker" --docker_volume_checkpoint_dir="/var/run/mesos/isolators/docker/volume"
--enforce_container_disk_quota="false" --executor_registration_timeout="1mins" --executor_shutdown_grace_period="5secs"
--fetcher_cache_dir="/tmp/Endpoint_SlaveEndpointTest_NoAuthorizer_1_kaAmyp/fetch" --fetcher_cache_size="2GB"
--frameworks_home="" --gc_delay="1weeks" --gc_disk_headroom="0.1" --hadoop_home="" --help="false"
--hostname_lookup="true" --http_command_executor="false" --http_credentials="/tmp/Endpoint_SlaveEndpointTest_NoAuthorizer_1_kaAmyp/http_credentials"
--http_heartbeat_interval="30secs" --initialize_driver_logging="true" --isolation="posix/cpu,posix/mem"
--launcher="posix" --launcher_dir="/mesos/mesos-1.3.0/_build/src" --logbufsecs="0" --logging_level="INFO"
--max_completed_executors_per_framework="150" --oversubscribed_resources_interval="15secs"
--perf_duration="10secs" --perf_interval="1mins" --port="5051" --qos_correction_interval_min="0ns"
--quiet="false" --recover="reconnect" --recovery_timeout="15mins" --registration_backoff_factor="10ms"
--resources="cpus:2;gpus:0;mem:1024;disk:1024;ports:[31000-32000]" --revocable_cpu_low_priority="true"
--runtime_dir="/tmp/Endpoint_SlaveEndpointTest_NoAuthorizer_1_kaAmyp" --sandbox_directory="/mnt/mesos/sandbox"
--strict="true" --switch_user="true" --systemd_enable_support="true" --systemd_runtime_directory="/run/systemd/system"
--version="false" --work_dir="/tmp/Endpoint_SlaveEndpointTest_NoAuthorizer_1_bRZ7tY"
I0427 06:15:21.509683 31692 credentials.hpp:86] Loading credential for authentication from
'/tmp/Endpoint_SlaveEndpointTest_NoAuthorizer_1_kaAmyp/credential'
I0427 06:15:21.510329 31692 slave.cpp:258] Agent using credential for: test-principal
I0427 06:15:21.510764 31692 credentials.hpp:37] Loading credentials for authentication from
'/tmp/Endpoint_SlaveEndpointTest_NoAuthorizer_1_kaAmyp/http_credentials'
I0427 06:15:21.511441 31692 http.cpp:975] Creating default 'basic' HTTP authenticator for
realm 'mesos-agent-readonly'
I0427 06:15:21.512022 31692 http.cpp:975] Creating default 'basic' HTTP authenticator for
realm 'mesos-agent-readwrite'
I0427 06:15:21.514477 31692 slave.cpp:525] Agent resources: cpus(*):2; mem(*):1024; disk(*):1024;
ports(*):[31000-32000]
I0427 06:15:21.514598 31692 slave.cpp:533] Agent attributes: [  ]
I0427 06:15:21.514616 31692 slave.cpp:538] Agent hostname: e8b0125ae30a
I0427 06:15:21.514799 31684 status_update_manager.cpp:177] Pausing sending status updates
I0427 06:15:21.516393 31693 state.cpp:62] Recovering state from '/tmp/Endpoint_SlaveEndpointTest_NoAuthorizer_1_bRZ7tY/meta'
I0427 06:15:21.516898 31695 status_update_manager.cpp:203] Recovering status update manager
I0427 06:15:21.517122 31695 containerizer.cpp:608] Recovering containerizer
I0427 06:15:21.518895 31696 provisioner.cpp:410] Provisioner recovery complete
I0427 06:15:21.519337 31690 slave.cpp:5963] Finished recovery
I0427 06:15:21.519994 31690 slave.cpp:6145] Querying resource estimator for oversubscribable
resources
I0427 06:15:21.520406 31695 slave.cpp:6159] Received oversubscribable resources {} from the
resource estimator
I0427 06:15:21.523365 31696 process.cpp:3731] Handling HTTP event for process 'slave(739)'
with path: '/slave(739)/monitor/statistics.json'
I0427 06:15:21.526527 31690 http.cpp:1115] HTTP GET for /slave(739)/monitor/statistics.json
from 172.17.0.2:45809
I0427 06:15:21.526728 31690 http.cpp:936] Authorizing principal 'test-principal' to GET the
'/monitor/statistics.json' endpoint
I0427 06:15:21.530999 31697 slave.cpp:790] Agent terminating
[       OK ] Endpoint/SlaveEndpointTest.NoAuthorizer/1 (38 ms)
[ RUN      ] Endpoint/SlaveEndpointTest.NoAuthorizer/2
I0427 06:15:21.541169 31663 containerizer.cpp:221] Using isolation: posix/cpu,posix/mem,filesystem/posix,network/cni
W0427 06:15:21.541735 31663 backend.cpp:76] Failed to create 'aufs' backend: AufsBackend requires
root privileges
W0427 06:15:21.541852 31663 backend.cpp:76] Failed to create 'bind' backend: BindBackend requires
root privileges
I0427 06:15:21.541896 31663 provisioner.cpp:249] Using default backend 'copy'
I0427 06:15:21.543609 31663 cluster.cpp:448] Creating default 'local' authorizer
I0427 06:15:21.545233 31682 slave.cpp:225] Mesos agent started on (740)@172.17.0.2:53142
I0427 06:15:21.545363 31682 slave.cpp:226] Flags at startup: --acls="" --appc_simple_discovery_uri_prefix="http://"
--appc_store_dir="/tmp/mesos/store/appc" --authenticate_http_readonly="true" --authenticate_http_readwrite="true"
--authenticatee="crammd5" --authentication_backoff_factor="1secs" --authorizer="local" --cgroups_cpu_enable_pids_and_tids_count="false"
--cgroups_enable_cfs="false" --cgroups_hierarchy="/sys/fs/cgroup" --cgroups_limit_swap="false"
--cgroups_root="mesos" --container_disk_watch_interval="15secs" --containerizers="mesos" --credential="/tmp/Endpoint_SlaveEndpointTest_NoAuthorizer_2_q5HQaa/credential"
--default_role="*" --disk_watch_interval="1mins" --docker="docker" --docker_kill_orphans="true"
--docker_registry="https://registry-1.docker.io" --docker_remove_delay="6hrs" --docker_socket="/var/run/docker.sock"
--docker_stop_timeout="0ns" --docker_store_dir="/tmp/mesos/store/docker" --docker_volume_checkpoint_dir="/var/run/mesos/isolators/docker/volume"
--enforce_container_disk_quota="false" --executor_registration_timeout="1mins" --executor_shutdown_grace_period="5secs"
--fetcher_cache_dir="/tmp/Endpoint_SlaveEndpointTest_NoAuthorizer_2_q5HQaa/fetch" --fetcher_cache_size="2GB"
--frameworks_home="" --gc_delay="1weeks" --gc_disk_headroom="0.1" --hadoop_home="" --help="false"
--hostname_lookup="true" --http_command_executor="false" --http_credentials="/tmp/Endpoint_SlaveEndpointTest_NoAuthorizer_2_q5HQaa/http_credentials"
--http_heartbeat_interval="30secs" --initialize_driver_logging="true" --isolation="posix/cpu,posix/mem"
--launcher="posix" --launcher_dir="/mesos/mesos-1.3.0/_build/src" --logbufsecs="0" --logging_level="INFO"
--max_completed_executors_per_framework="150" --oversubscribed_resources_interval="15secs"
--perf_duration="10secs" --perf_interval="1mins" --port="5051" --qos_correction_interval_min="0ns"
--quiet="false" --recover="reconnect" --recovery_timeout="15mins" --registration_backoff_factor="10ms"
--resources="cpus:2;gpus:0;mem:1024;disk:1024;ports:[31000-32000]" --revocable_cpu_low_priority="true"
--runtime_dir="/tmp/Endpoint_SlaveEndpointTest_NoAuthorizer_2_q5HQaa" --sandbox_directory="/mnt/mesos/sandbox"
--strict="true" --switch_user="true" --systemd_enable_support="true" --systemd_runtime_directory="/run/systemd/system"
--version="false" --work_dir="/tmp/Endpoint_SlaveEndpointTest_NoAuthorizer_2_3g3m0I"
I0427 06:15:21.546205 31682 credentials.hpp:86] Loading credential for authentication from
'/tmp/Endpoint_SlaveEndpointTest_NoAuthorizer_2_q5HQaa/credential'
I0427 06:15:21.546553 31682 slave.cpp:258] Agent using credential for: test-principal
I0427 06:15:21.546643 31682 credentials.hpp:37] Loading credentials for authentication from
'/tmp/Endpoint_SlaveEndpointTest_NoAuthorizer_2_q5HQaa/http_credentials'
I0427 06:15:21.547127 31682 http.cpp:975] Creating default 'basic' HTTP authenticator for
realm 'mesos-agent-readonly'
I0427 06:15:21.547518 31682 http.cpp:975] Creating default 'basic' HTTP authenticator for
realm 'mesos-agent-readwrite'
I0427 06:15:21.549927 31682 slave.cpp:525] Agent resources: cpus(*):2; mem(*):1024; disk(*):1024;
ports(*):[31000-32000]
I0427 06:15:21.550164 31682 slave.cpp:533] Agent attributes: [  ]
I0427 06:15:21.550274 31682 slave.cpp:538] Agent hostname: e8b0125ae30a
I0427 06:15:21.550621 31684 status_update_manager.cpp:177] Pausing sending status updates
I0427 06:15:21.553001 31684 state.cpp:62] Recovering state from '/tmp/Endpoint_SlaveEndpointTest_NoAuthorizer_2_3g3m0I/meta'
I0427 06:15:21.553505 31691 status_update_manager.cpp:203] Recovering status update manager
I0427 06:15:21.553872 31697 containerizer.cpp:608] Recovering containerizer
I0427 06:15:21.555724 31684 provisioner.cpp:410] Provisioner recovery complete
I0427 06:15:21.556133 31691 slave.cpp:5963] Finished recovery
I0427 06:15:21.556743 31691 slave.cpp:6145] Querying resource estimator for oversubscribable
resources
I0427 06:15:21.557082 31695 slave.cpp:6159] Received oversubscribable resources {} from the
resource estimator
I0427 06:15:21.560039 31689 process.cpp:3731] Handling HTTP event for process 'slave(740)'
with path: '/slave(740)/containers'
I0427 06:15:21.561741 31685 http.cpp:1115] HTTP GET for /slave(740)/containers from 172.17.0.2:45810
I0427 06:15:21.561910 31685 http.cpp:936] Authorizing principal 'test-principal' to GET the
'/containers' endpoint
I0427 06:15:21.565764 31692 slave.cpp:790] Agent terminating
[       OK ] Endpoint/SlaveEndpointTest.NoAuthorizer/2 (34 ms)
[----------] 9 tests from Endpoint/SlaveEndpointTest (300 ms total)

[----------] Global test environment tear-down
[==========] 1550 tests from 174 test cases ran. (597976 ms total)
[  PASSED  ] 1549 tests.
[  FAILED  ] 1 test, listed below:
[  FAILED  ] RegisterSlaveValidationTest.DropInvalidRegistration

 1 FAILED TEST
  YOU HAVE 19 DISABLED TESTS

E0427 06:15:21.629011 31698 process.cpp:951] Failed to accept socket: future discarded
make[4]: *** [check-local] Error 1
make[4]: Leaving directory `/mesos/mesos-1.3.0/_build/src'
make[3]: *** [check-am] Error 2
make[3]: Leaving directory `/mesos/mesos-1.3.0/_build/src'
make[2]: *** [check] Error 2
make[2]: Leaving directory `/mesos/mesos-1.3.0/_build/src'
make[1]: *** [check-recursive] Error 1
make[1]: Leaving directory `/mesos/mesos-1.3.0/_build'
make: *** [distcheck] Error 1
+ docker rmi mesos-1493270822-21029
Untagged: mesos-1493270822-21029:latest
Deleted: sha256:01165c055a41a18ef0251d526f965bcb749c2cb0bdc05a273f913b86db5e8c6c
Deleted: sha256:97b5c3b04233950164f85a01c279ea019594e932136c161f16a4bfafa1edb595
Deleted: sha256:51ddb9a9d32a19f1327730a92d7a46a110c0b3e51133d76217c65925e0ad02d8
Deleted: sha256:eaf4d22af711699c30cae81440816b17886c5d005ae025dfc14880dd10ad56d5
Deleted: sha256:19e956d2957941f4b628379758b8a97758e4c0c4b9469ff2c2741367944b9dd2
Deleted: sha256:f6196f39674b2c20c82bcc2313c981874917422c764a3e8c0099648db838fdbd
Deleted: sha256:552f3e6a7e8504d99d3f8fa7109da3b22b7ef31ac787555b7a5f93a4e50125db
Deleted: sha256:68ee745880f51f078c1d802646dbc1fae66b9fa963bb498fdb5fd7e4b3504b97
Deleted: sha256:31a0754f061db02bb87f0894a46f48562d925bc49f3526a24b1ab08898a7fe36
Deleted: sha256:8a87f361114d8255170baf1251f04b38b274c1ff529d2ff014f2ce39eae85432
Deleted: sha256:797427a76e6fe512fdd81f83a2d0ac3f22f77bee703da14ffab19e2be7bc4d20
Deleted: sha256:48f0cf998d6a636eaefdf5f4f08b2095bb340842a49a54ac513cc35e96df464f
Deleted: sha256:244c725bb6b517105e8b5ff27c7cd9c840652e4ddb5bcbac0c0769aa2abc462c
Deleted: sha256:a0cc138ca536d81dfa13d05551e8283e292ffa17faabd3d0826e35925bca0f0a
Deleted: sha256:d0266fa21bc36d20ab2f49f5558caf3dde20e3697b4b8886fb653ab33227da14
Deleted: sha256:df414e21429ef1849b938cefe3e8f0e942077eeadab2d522fdadb255eae3572e
Deleted: sha256:5d75e6cb28190754dc48de9694d508216a1ae1c32941a4c1933ba5312fefa71c
Deleted: sha256:201d96dc7fae6536a02e14ff90bde8f94448e30ead86bb172a73d571ee8b4e24
Deleted: sha256:444606b62a0c39e2b38b8e8dc28d6ece487329d1754878f588ceb25e703f20a7
Deleted: sha256:69cbaba3c8c1c00deb7b5e4bdbe8a10f25d3aed44b98dfa9e62facda5581aeab
Deleted: sha256:bac18da804695490dd044ec88924c2f3068e6a024a6835af86a6023f4fb5c228
Deleted: sha256:2a6246f1bb36cc04cac9be1f0817f914cb65521a163a8d04bca03f409dfad6bb
Deleted: sha256:c63ab66191f51f7b680431dd0898a9620c64679f8881327ae21b4e072e13cd86
Deleted: sha256:099be2f88eb93b91c67429f89747b2d77baa7f622e050901df89ae6acac73305
Deleted: sha256:b24b1eb060c539fa6c49fbb89e98c53c1f00f5bcae8e330c5bb18174f3f17805
Build step 'Execute shell' marked build as failure

Mime
View raw message