mesos-builds mailing list archives

Site index · List index
Message view « Date » · « Thread »
Top « Date » · « Thread »
From Apache Jenkins Server <jenk...@builds.apache.org>
Subject Build failed in Jenkins: Mesos-Buildbot » autotools,gcc,--verbose,GLOG_v=1 MESOS_VERBOSE=1,ubuntu:14.04,(docker||Hadoop)&&(!ubuntu-us1)&&(!ubuntu-eu2) #3576
Date Thu, 27 Apr 2017 15:55:03 GMT
See <https://builds.apache.org/job/Mesos-Buildbot/BUILDTOOL=autotools,COMPILER=gcc,CONFIGURATION=--verbose,ENVIRONMENT=GLOG_v=1%20MESOS_VERBOSE=1,OS=ubuntu%3A14.04,label_exp=(docker%7C%7CHadoop)&&(!ubuntu-us1)&&(!ubuntu-eu2)/3576/display/redirect?page=changes>

Changes:

[alexr] Removed unused variable from api tests.

------------------------------------------
[...truncated 26.65 MB...]
I0427 15:54:51.863756 30677 slave.cpp:790] Agent terminating
[       OK ] Endpoint/SlaveEndpointTest.AuthorizedRequest/1 (35 ms)
[ RUN      ] Endpoint/SlaveEndpointTest.AuthorizedRequest/2
I0427 15:54:51.875056 30656 containerizer.cpp:221] Using isolation: posix/cpu,posix/mem,filesystem/posix,network/cni
W0427 15:54:51.875526 30656 backend.cpp:76] Failed to create 'aufs' backend: AufsBackend requires
root privileges
W0427 15:54:51.875666 30656 backend.cpp:76] Failed to create 'bind' backend: BindBackend requires
root privileges
I0427 15:54:51.875708 30656 provisioner.cpp:249] Using default backend 'copy'
I0427 15:54:51.879140 30682 slave.cpp:225] Mesos agent started on (737)@172.17.0.2:35748
I0427 15:54:51.879184 30682 slave.cpp:226] Flags at startup: --acls="" --appc_simple_discovery_uri_prefix="http://"
--appc_store_dir="/tmp/mesos/store/appc" --authenticate_http_readonly="true" --authenticate_http_readwrite="true"
--authenticatee="crammd5" --authentication_backoff_factor="1secs" --authorizer="local" --cgroups_cpu_enable_pids_and_tids_count="false"
--cgroups_enable_cfs="false" --cgroups_hierarchy="/sys/fs/cgroup" --cgroups_limit_swap="false"
--cgroups_root="mesos" --container_disk_watch_interval="15secs" --containerizers="mesos" --credential="/tmp/Endpoint_SlaveEndpointTest_AuthorizedRequest_2_IXQTU9/credential"
--default_role="*" --disk_watch_interval="1mins" --docker="docker" --docker_kill_orphans="true"
--docker_registry="https://registry-1.docker.io" --docker_remove_delay="6hrs" --docker_socket="/var/run/docker.sock"
--docker_stop_timeout="0ns" --docker_store_dir="/tmp/mesos/store/docker" --docker_volume_checkpoint_dir="/var/run/mesos/isolators/docker/volume"
--enforce_container_disk_quota="false" --executor_registration_timeout="1mins" --executor_shutdown_grace_period="5secs"
--fetcher_cache_dir="/tmp/Endpoint_SlaveEndpointTest_AuthorizedRequest_2_IXQTU9/fetch" --fetcher_cache_size="2GB"
--frameworks_home="" --gc_delay="1weeks" --gc_disk_headroom="0.1" --hadoop_home="" --help="false"
--hostname_lookup="true" --http_command_executor="false" --http_credentials="/tmp/Endpoint_SlaveEndpointTest_AuthorizedRequest_2_IXQTU9/http_credentials"
--http_heartbeat_interval="30secs" --initialize_driver_logging="true" --isolation="posix/cpu,posix/mem"
--launcher="posix" --launcher_dir="/mesos/mesos-1.3.0/_build/src" --logbufsecs="0" --logging_level="INFO"
--max_completed_executors_per_framework="150" --oversubscribed_resources_interval="15secs"
--perf_duration="10secs" --perf_interval="1mins" --port="5051" --qos_correction_interval_min="0ns"
--quiet="false" --recover="reconnect" --recovery_timeout="15mins" --registration_backoff_factor="10ms"
--resources="cpus:2;gpus:0;mem:1024;disk:1024;ports:[31000-32000]" --revocable_cpu_low_priority="true"
--runtime_dir="/tmp/Endpoint_SlaveEndpointTest_AuthorizedRequest_2_IXQTU9" --sandbox_directory="/mnt/mesos/sandbox"
--strict="true" --switch_user="true" --systemd_enable_support="true" --systemd_runtime_directory="/run/systemd/system"
--version="false" --work_dir="/tmp/Endpoint_SlaveEndpointTest_AuthorizedRequest_2_8i1jHY"
I0427 15:54:51.879765 30682 credentials.hpp:86] Loading credential for authentication from
'/tmp/Endpoint_SlaveEndpointTest_AuthorizedRequest_2_IXQTU9/credential'
I0427 15:54:51.880019 30682 slave.cpp:258] Agent using credential for: test-principal
I0427 15:54:51.880046 30682 credentials.hpp:37] Loading credentials for authentication from
'/tmp/Endpoint_SlaveEndpointTest_AuthorizedRequest_2_IXQTU9/http_credentials'
I0427 15:54:51.880295 30682 http.cpp:975] Creating default 'basic' HTTP authenticator for
realm 'mesos-agent-readonly'
I0427 15:54:51.880471 30682 http.cpp:975] Creating default 'basic' HTTP authenticator for
realm 'mesos-agent-readwrite'
I0427 15:54:51.881775 30682 slave.cpp:525] Agent resources: cpus(*):2; mem(*):1024; disk(*):1024;
ports(*):[31000-32000]
I0427 15:54:51.881865 30682 slave.cpp:533] Agent attributes: [  ]
I0427 15:54:51.881884 30682 slave.cpp:538] Agent hostname: ed854eea68fd
I0427 15:54:51.882050 30685 status_update_manager.cpp:177] Pausing sending status updates
I0427 15:54:51.883976 30680 state.cpp:62] Recovering state from '/tmp/Endpoint_SlaveEndpointTest_AuthorizedRequest_2_8i1jHY/meta'
I0427 15:54:51.884536 30681 status_update_manager.cpp:203] Recovering status update manager
I0427 15:54:51.884814 30677 containerizer.cpp:608] Recovering containerizer
I0427 15:54:51.887006 30682 provisioner.cpp:410] Provisioner recovery complete
I0427 15:54:51.887483 30688 slave.cpp:5963] Finished recovery
I0427 15:54:51.887989 30688 slave.cpp:6145] Querying resource estimator for oversubscribable
resources
I0427 15:54:51.888268 30681 slave.cpp:6159] Received oversubscribable resources {} from the
resource estimator
I0427 15:54:51.891798 30686 process.cpp:3731] Handling HTTP event for process 'slave(737)'
with path: '/slave(737)/containers'
I0427 15:54:51.893424 30675 http.cpp:1115] HTTP GET for /slave(737)/containers from 172.17.0.2:57510
I0427 15:54:51.893513 30675 http.cpp:936] Authorizing principal 'test-principal' to GET the
'/containers' endpoint
I0427 15:54:51.897949 30690 slave.cpp:790] Agent terminating
[       OK ] Endpoint/SlaveEndpointTest.AuthorizedRequest/2 (33 ms)
[ RUN      ] Endpoint/SlaveEndpointTest.UnauthorizedRequest/0
I0427 15:54:51.909138 30656 containerizer.cpp:221] Using isolation: posix/cpu,posix/mem,filesystem/posix,network/cni
W0427 15:54:51.909782 30656 backend.cpp:76] Failed to create 'aufs' backend: AufsBackend requires
root privileges
W0427 15:54:51.909906 30656 backend.cpp:76] Failed to create 'bind' backend: BindBackend requires
root privileges
I0427 15:54:51.909958 30656 provisioner.cpp:249] Using default backend 'copy'
I0427 15:54:51.913919 30687 slave.cpp:225] Mesos agent started on (738)@172.17.0.2:35748
I0427 15:54:51.913949 30687 slave.cpp:226] Flags at startup: --acls="" --appc_simple_discovery_uri_prefix="http://"
--appc_store_dir="/tmp/mesos/store/appc" --authenticate_http_readonly="true" --authenticate_http_readwrite="true"
--authenticatee="crammd5" --authentication_backoff_factor="1secs" --authorizer="local" --cgroups_cpu_enable_pids_and_tids_count="false"
--cgroups_enable_cfs="false" --cgroups_hierarchy="/sys/fs/cgroup" --cgroups_limit_swap="false"
--cgroups_root="mesos" --container_disk_watch_interval="15secs" --containerizers="mesos" --credential="/tmp/Endpoint_SlaveEndpointTest_UnauthorizedRequest_0_24Qv5S/credential"
--default_role="*" --disk_watch_interval="1mins" --docker="docker" --docker_kill_orphans="true"
--docker_registry="https://registry-1.docker.io" --docker_remove_delay="6hrs" --docker_socket="/var/run/docker.sock"
--docker_stop_timeout="0ns" --docker_store_dir="/tmp/mesos/store/docker" --docker_volume_checkpoint_dir="/var/run/mesos/isolators/docker/volume"
--enforce_container_disk_quota="false" --executor_registration_timeout="1mins" --executor_shutdown_grace_period="5secs"
--fetcher_cache_dir="/tmp/Endpoint_SlaveEndpointTest_UnauthorizedRequest_0_24Qv5S/fetch" --fetcher_cache_size="2GB"
--frameworks_home="" --gc_delay="1weeks" --gc_disk_headroom="0.1" --hadoop_home="" --help="false"
--hostname_lookup="true" --http_command_executor="false" --http_credentials="/tmp/Endpoint_SlaveEndpointTest_UnauthorizedRequest_0_24Qv5S/http_credentials"
--http_heartbeat_interval="30secs" --initialize_driver_logging="true" --isolation="posix/cpu,posix/mem"
--launcher="posix" --launcher_dir="/mesos/mesos-1.3.0/_build/src" --logbufsecs="0" --logging_level="INFO"
--max_completed_executors_per_framework="150" --oversubscribed_resources_interval="15secs"
--perf_duration="10secs" --perf_interval="1mins" --port="5051" --qos_correction_interval_min="0ns"
--quiet="false" --recover="reconnect" --recovery_timeout="15mins" --registration_backoff_factor="10ms"
--resources="cpus:2;gpus:0;mem:1024;disk:1024;ports:[31000-32000]" --revocable_cpu_low_priority="true"
--runtime_dir="/tmp/Endpoint_SlaveEndpointTest_UnauthorizedRequest_0_24Qv5S" --sandbox_directory="/mnt/mesos/sandbox"
--strict="true" --switch_user="true" --systemd_enable_support="true" --systemd_runtime_directory="/run/systemd/system"
--version="false" --work_dir="/tmp/Endpoint_SlaveEndpointTest_UnauthorizedRequest_0_wQsvMH"
I0427 15:54:51.914515 30687 credentials.hpp:86] Loading credential for authentication from
'/tmp/Endpoint_SlaveEndpointTest_UnauthorizedRequest_0_24Qv5S/credential'
I0427 15:54:51.914744 30687 slave.cpp:258] Agent using credential for: test-principal
I0427 15:54:51.914783 30687 credentials.hpp:37] Loading credentials for authentication from
'/tmp/Endpoint_SlaveEndpointTest_UnauthorizedRequest_0_24Qv5S/http_credentials'
I0427 15:54:51.915141 30687 http.cpp:975] Creating default 'basic' HTTP authenticator for
realm 'mesos-agent-readonly'
I0427 15:54:51.915334 30687 http.cpp:975] Creating default 'basic' HTTP authenticator for
realm 'mesos-agent-readwrite'
I0427 15:54:51.917045 30687 slave.cpp:525] Agent resources: cpus(*):2; mem(*):1024; disk(*):1024;
ports(*):[31000-32000]
I0427 15:54:51.917153 30687 slave.cpp:533] Agent attributes: [  ]
I0427 15:54:51.917171 30687 slave.cpp:538] Agent hostname: ed854eea68fd
I0427 15:54:51.917330 30686 status_update_manager.cpp:177] Pausing sending status updates
I0427 15:54:51.919040 30685 state.cpp:62] Recovering state from '/tmp/Endpoint_SlaveEndpointTest_UnauthorizedRequest_0_wQsvMH/meta'
I0427 15:54:51.919395 30676 status_update_manager.cpp:203] Recovering status update manager
I0427 15:54:51.919605 30681 containerizer.cpp:608] Recovering containerizer
I0427 15:54:51.921001 30679 provisioner.cpp:410] Provisioner recovery complete
I0427 15:54:51.921407 30680 slave.cpp:5963] Finished recovery
I0427 15:54:51.921927 30680 slave.cpp:6145] Querying resource estimator for oversubscribable
resources
I0427 15:54:51.922222 30681 slave.cpp:6159] Received oversubscribable resources {} from the
resource estimator
I0427 15:54:51.925493 30690 process.cpp:3731] Handling HTTP event for process 'slave(738)'
with path: '/slave(738)/monitor/statistics'
I0427 15:54:51.927165 30682 http.cpp:1115] HTTP GET for /slave(738)/monitor/statistics from
172.17.0.2:57512
I0427 15:54:51.927233 30682 http.cpp:936] Authorizing principal 'test-principal' to GET the
'/monitor/statistics' endpoint
I0427 15:54:51.929889 30676 slave.cpp:790] Agent terminating
[       OK ] Endpoint/SlaveEndpointTest.UnauthorizedRequest/0 (33 ms)
[ RUN      ] Endpoint/SlaveEndpointTest.UnauthorizedRequest/1
I0427 15:54:51.941462 30656 containerizer.cpp:221] Using isolation: posix/cpu,posix/mem,filesystem/posix,network/cni
W0427 15:54:51.942098 30656 backend.cpp:76] Failed to create 'aufs' backend: AufsBackend requires
root privileges
W0427 15:54:51.942239 30656 backend.cpp:76] Failed to create 'bind' backend: BindBackend requires
root privileges
I0427 15:54:51.942293 30656 provisioner.cpp:249] Using default backend 'copy'
I0427 15:54:51.946455 30679 slave.cpp:225] Mesos agent started on (739)@172.17.0.2:35748
I0427 15:54:51.946481 30679 slave.cpp:226] Flags at startup: --acls="" --appc_simple_discovery_uri_prefix="http://"
--appc_store_dir="/tmp/mesos/store/appc" --authenticate_http_readonly="true" --authenticate_http_readwrite="true"
--authenticatee="crammd5" --authentication_backoff_factor="1secs" --authorizer="local" --cgroups_cpu_enable_pids_and_tids_count="false"
--cgroups_enable_cfs="false" --cgroups_hierarchy="/sys/fs/cgroup" --cgroups_limit_swap="false"
--cgroups_root="mesos" --container_disk_watch_interval="15secs" --containerizers="mesos" --credential="/tmp/Endpoint_SlaveEndpointTest_UnauthorizedRequest_1_UlYJBC/credential"
--default_role="*" --disk_watch_interval="1mins" --docker="docker" --docker_kill_orphans="true"
--docker_registry="https://registry-1.docker.io" --docker_remove_delay="6hrs" --docker_socket="/var/run/docker.sock"
--docker_stop_timeout="0ns" --docker_store_dir="/tmp/mesos/store/docker" --docker_volume_checkpoint_dir="/var/run/mesos/isolators/docker/volume"
--enforce_container_disk_quota="false" --executor_registration_timeout="1mins" --executor_shutdown_grace_period="5secs"
--fetcher_cache_dir="/tmp/Endpoint_SlaveEndpointTest_UnauthorizedRequest_1_UlYJBC/fetch" --fetcher_cache_size="2GB"
--frameworks_home="" --gc_delay="1weeks" --gc_disk_headroom="0.1" --hadoop_home="" --help="false"
--hostname_lookup="true" --http_command_executor="false" --http_credentials="/tmp/Endpoint_SlaveEndpointTest_UnauthorizedRequest_1_UlYJBC/http_credentials"
--http_heartbeat_interval="30secs" --initialize_driver_logging="true" --isolation="posix/cpu,posix/mem"
--launcher="posix" --launcher_dir="/mesos/mesos-1.3.0/_build/src" --logbufsecs="0" --logging_level="INFO"
--max_completed_executors_per_framework="150" --oversubscribed_resources_interval="15secs"
--perf_duration="10secs" --perf_interval="1mins" --port="5051" --qos_correction_interval_min="0ns"
--quiet="false" --recover="reconnect" --recovery_timeout="15mins" --registration_backoff_factor="10ms"
--resources="cpus:2;gpus:0;mem:1024;disk:1024;ports:[31000-32000]" --revocable_cpu_low_priority="true"
--runtime_dir="/tmp/Endpoint_SlaveEndpointTest_UnauthorizedRequest_1_UlYJBC" --sandbox_directory="/mnt/mesos/sandbox"
--strict="true" --switch_user="true" --systemd_enable_support="true" --systemd_runtime_directory="/run/systemd/system"
--version="false" --work_dir="/tmp/Endpoint_SlaveEndpointTest_UnauthorizedRequest_1_wF8ndr"
I0427 15:54:51.947052 30679 credentials.hpp:86] Loading credential for authentication from
'/tmp/Endpoint_SlaveEndpointTest_UnauthorizedRequest_1_UlYJBC/credential'
I0427 15:54:51.947326 30679 slave.cpp:258] Agent using credential for: test-principal
I0427 15:54:51.947347 30679 credentials.hpp:37] Loading credentials for authentication from
'/tmp/Endpoint_SlaveEndpointTest_UnauthorizedRequest_1_UlYJBC/http_credentials'
I0427 15:54:51.947659 30679 http.cpp:975] Creating default 'basic' HTTP authenticator for
realm 'mesos-agent-readonly'
I0427 15:54:51.947921 30679 http.cpp:975] Creating default 'basic' HTTP authenticator for
realm 'mesos-agent-readwrite'
I0427 15:54:51.949252 30679 slave.cpp:525] Agent resources: cpus(*):2; mem(*):1024; disk(*):1024;
ports(*):[31000-32000]
I0427 15:54:51.949332 30679 slave.cpp:533] Agent attributes: [  ]
I0427 15:54:51.949352 30679 slave.cpp:538] Agent hostname: ed854eea68fd
I0427 15:54:51.949506 30687 status_update_manager.cpp:177] Pausing sending status updates
I0427 15:54:51.951355 30677 state.cpp:62] Recovering state from '/tmp/Endpoint_SlaveEndpointTest_UnauthorizedRequest_1_wF8ndr/meta'
I0427 15:54:51.951860 30685 status_update_manager.cpp:203] Recovering status update manager
I0427 15:54:51.952090 30685 containerizer.cpp:608] Recovering containerizer
I0427 15:54:51.953794 30682 provisioner.cpp:410] Provisioner recovery complete
I0427 15:54:51.954390 30677 slave.cpp:5963] Finished recovery
I0427 15:54:51.954859 30677 slave.cpp:6145] Querying resource estimator for oversubscribable
resources
I0427 15:54:51.955157 30677 slave.cpp:6159] Received oversubscribable resources {} from the
resource estimator
I0427 15:54:51.957942 30689 process.cpp:3731] Handling HTTP event for process 'slave(739)'
with path: '/slave(739)/monitor/statistics.json'
I0427 15:54:51.959254 30685 http.cpp:1115] HTTP GET for /slave(739)/monitor/statistics.json
from 172.17.0.2:57515
I0427 15:54:51.959393 30685 http.cpp:936] Authorizing principal 'test-principal' to GET the
'/monitor/statistics.json' endpoint
I0427 15:54:51.961843 30681 slave.cpp:790] Agent terminating
[       OK ] Endpoint/SlaveEndpointTest.UnauthorizedRequest/1 (30 ms)
[ RUN      ] Endpoint/SlaveEndpointTest.UnauthorizedRequest/2
I0427 15:54:51.973505 30656 containerizer.cpp:221] Using isolation: posix/cpu,posix/mem,filesystem/posix,network/cni
W0427 15:54:51.974206 30656 backend.cpp:76] Failed to create 'aufs' backend: AufsBackend requires
root privileges
W0427 15:54:51.974349 30656 backend.cpp:76] Failed to create 'bind' backend: BindBackend requires
root privileges
I0427 15:54:51.974470 30656 provisioner.cpp:249] Using default backend 'copy'
I0427 15:54:51.979282 30685 slave.cpp:225] Mesos agent started on (740)@172.17.0.2:35748
I0427 15:54:51.979331 30685 slave.cpp:226] Flags at startup: --acls="" --appc_simple_discovery_uri_prefix="http://"
--appc_store_dir="/tmp/mesos/store/appc" --authenticate_http_readonly="true" --authenticate_http_readwrite="true"
--authenticatee="crammd5" --authentication_backoff_factor="1secs" --authorizer="local" --cgroups_cpu_enable_pids_and_tids_count="false"
--cgroups_enable_cfs="false" --cgroups_hierarchy="/sys/fs/cgroup" --cgroups_limit_swap="false"
--cgroups_root="mesos" --container_disk_watch_interval="15secs" --containerizers="mesos" --credential="/tmp/Endpoint_SlaveEndpointTest_UnauthorizedRequest_2_wyvnsm/credential"
--default_role="*" --disk_watch_interval="1mins" --docker="docker" --docker_kill_orphans="true"
--docker_registry="https://registry-1.docker.io" --docker_remove_delay="6hrs" --docker_socket="/var/run/docker.sock"
--docker_stop_timeout="0ns" --docker_store_dir="/tmp/mesos/store/docker" --docker_volume_checkpoint_dir="/var/run/mesos/isolators/docker/volume"
--enforce_container_disk_quota="false" --executor_registration_timeout="1mins" --executor_shutdown_grace_period="5secs"
--fetcher_cache_dir="/tmp/Endpoint_SlaveEndpointTest_UnauthorizedRequest_2_wyvnsm/fetch" --fetcher_cache_size="2GB"
--frameworks_home="" --gc_delay="1weeks" --gc_disk_headroom="0.1" --hadoop_home="" --help="false"
--hostname_lookup="true" --http_command_executor="false" --http_credentials="/tmp/Endpoint_SlaveEndpointTest_UnauthorizedRequest_2_wyvnsm/http_credentials"
--http_heartbeat_interval="30secs" --initialize_driver_logging="true" --isolation="posix/cpu,posix/mem"
--launcher="posix" --launcher_dir="/mesos/mesos-1.3.0/_build/src" --logbufsecs="0" --logging_level="INFO"
--max_completed_executors_per_framework="150" --oversubscribed_resources_interval="15secs"
--perf_duration="10secs" --perf_interval="1mins" --port="5051" --qos_correction_interval_min="0ns"
--quiet="false" --recover="reconnect" --recovery_timeout="15mins" --registration_backoff_factor="10ms"
--resources="cpus:2;gpus:0;mem:1024;disk:1024;ports:[31000-32000]" --revocable_cpu_low_priority="true"
--runtime_dir="/tmp/Endpoint_SlaveEndpointTest_UnauthorizedRequest_2_wyvnsm" --sandbox_directory="/mnt/mesos/sandbox"
--strict="true" --switch_user="true" --systemd_enable_support="true" --systemd_runtime_directory="/run/systemd/system"
--version="false" --work_dir="/tmp/Endpoint_SlaveEndpointTest_UnauthorizedRequest_2_g0GYYa"
I0427 15:54:51.979848 30685 credentials.hpp:86] Loading credential for authentication from
'/tmp/Endpoint_SlaveEndpointTest_UnauthorizedRequest_2_wyvnsm/credential'
I0427 15:54:51.980139 30685 slave.cpp:258] Agent using credential for: test-principal
I0427 15:54:51.980180 30685 credentials.hpp:37] Loading credentials for authentication from
'/tmp/Endpoint_SlaveEndpointTest_UnauthorizedRequest_2_wyvnsm/http_credentials'
I0427 15:54:51.980597 30685 http.cpp:975] Creating default 'basic' HTTP authenticator for
realm 'mesos-agent-readonly'
I0427 15:54:51.980792 30685 http.cpp:975] Creating default 'basic' HTTP authenticator for
realm 'mesos-agent-readwrite'
I0427 15:54:51.982781 30685 slave.cpp:525] Agent resources: cpus(*):2; mem(*):1024; disk(*):1024;
ports(*):[31000-32000]
I0427 15:54:51.982894 30685 slave.cpp:533] Agent attributes: [  ]
I0427 15:54:51.982924 30685 slave.cpp:538] Agent hostname: ed854eea68fd
I0427 15:54:51.983132 30683 status_update_manager.cpp:177] Pausing sending status updates
I0427 15:54:51.985071 30678 state.cpp:62] Recovering state from '/tmp/Endpoint_SlaveEndpointTest_UnauthorizedRequest_2_g0GYYa/meta'
I0427 15:54:51.985882 30683 status_update_manager.cpp:203] Recovering status update manager
I0427 15:54:51.986387 30684 containerizer.cpp:608] Recovering containerizer
I0427 15:54:51.988379 30690 provisioner.cpp:410] Provisioner recovery complete
I0427 15:54:51.988939 30687 slave.cpp:5963] Finished recovery
I0427 15:54:51.989634 30687 slave.cpp:6145] Querying resource estimator for oversubscribable
resources
I0427 15:54:51.989976 30685 slave.cpp:6159] Received oversubscribable resources {} from the
resource estimator
I0427 15:54:51.993362 30677 process.cpp:3731] Handling HTTP event for process 'slave(740)'
with path: '/slave(740)/containers'
I0427 15:54:51.994966 30683 http.cpp:1115] HTTP GET for /slave(740)/containers from 172.17.0.2:57522
I0427 15:54:51.995069 30683 http.cpp:936] Authorizing principal 'test-principal' to GET the
'/containers' endpoint
I0427 15:54:51.997699 30685 slave.cpp:790] Agent terminating
[       OK ] Endpoint/SlaveEndpointTest.UnauthorizedRequest/2 (35 ms)
[ RUN      ] Endpoint/SlaveEndpointTest.NoAuthorizer/0
I0427 15:54:52.007356 30656 containerizer.cpp:221] Using isolation: posix/cpu,posix/mem,filesystem/posix,network/cni
W0427 15:54:52.007854 30656 backend.cpp:76] Failed to create 'aufs' backend: AufsBackend requires
root privileges
W0427 15:54:52.007957 30656 backend.cpp:76] Failed to create 'bind' backend: BindBackend requires
root privileges
I0427 15:54:52.007992 30656 provisioner.cpp:249] Using default backend 'copy'
I0427 15:54:52.009565 30656 cluster.cpp:448] Creating default 'local' authorizer
I0427 15:54:52.011206 30686 slave.cpp:225] Mesos agent started on (741)@172.17.0.2:35748
I0427 15:54:52.011245 30686 slave.cpp:226] Flags at startup: --acls="" --appc_simple_discovery_uri_prefix="http://"
--appc_store_dir="/tmp/mesos/store/appc" --authenticate_http_readonly="true" --authenticate_http_readwrite="true"
--authenticatee="crammd5" --authentication_backoff_factor="1secs" --authorizer="local" --cgroups_cpu_enable_pids_and_tids_count="false"
--cgroups_enable_cfs="false" --cgroups_hierarchy="/sys/fs/cgroup" --cgroups_limit_swap="false"
--cgroups_root="mesos" --container_disk_watch_interval="15secs" --containerizers="mesos" --credential="/tmp/Endpoint_SlaveEndpointTest_NoAuthorizer_0_chCwF6/credential"
--default_role="*" --disk_watch_interval="1mins" --docker="docker" --docker_kill_orphans="true"
--docker_registry="https://registry-1.docker.io" --docker_remove_delay="6hrs" --docker_socket="/var/run/docker.sock"
--docker_stop_timeout="0ns" --docker_store_dir="/tmp/mesos/store/docker" --docker_volume_checkpoint_dir="/var/run/mesos/isolators/docker/volume"
--enforce_container_disk_quota="false" --executor_registration_timeout="1mins" --executor_shutdown_grace_period="5secs"
--fetcher_cache_dir="/tmp/Endpoint_SlaveEndpointTest_NoAuthorizer_0_chCwF6/fetch" --fetcher_cache_size="2GB"
--frameworks_home="" --gc_delay="1weeks" --gc_disk_headroom="0.1" --hadoop_home="" --help="false"
--hostname_lookup="true" --http_command_executor="false" --http_credentials="/tmp/Endpoint_SlaveEndpointTest_NoAuthorizer_0_chCwF6/http_credentials"
--http_heartbeat_interval="30secs" --initialize_driver_logging="true" --isolation="posix/cpu,posix/mem"
--launcher="posix" --launcher_dir="/mesos/mesos-1.3.0/_build/src" --logbufsecs="0" --logging_level="INFO"
--max_completed_executors_per_framework="150" --oversubscribed_resources_interval="15secs"
--perf_duration="10secs" --perf_interval="1mins" --port="5051" --qos_correction_interval_min="0ns"
--quiet="false" --recover="reconnect" --recovery_timeout="15mins" --registration_backoff_factor="10ms"
--resources="cpus:2;gpus:0;mem:1024;disk:1024;ports:[31000-32000]" --revocable_cpu_low_priority="true"
--runtime_dir="/tmp/Endpoint_SlaveEndpointTest_NoAuthorizer_0_chCwF6" --sandbox_directory="/mnt/mesos/sandbox"
--strict="true" --switch_user="true" --systemd_enable_support="true" --systemd_runtime_directory="/run/systemd/system"
--version="false" --work_dir="/tmp/Endpoint_SlaveEndpointTest_NoAuthorizer_0_Sq2w6U"
I0427 15:54:52.011806 30686 credentials.hpp:86] Loading credential for authentication from
'/tmp/Endpoint_SlaveEndpointTest_NoAuthorizer_0_chCwF6/credential'
I0427 15:54:52.012073 30686 slave.cpp:258] Agent using credential for: test-principal
I0427 15:54:52.012104 30686 credentials.hpp:37] Loading credentials for authentication from
'/tmp/Endpoint_SlaveEndpointTest_NoAuthorizer_0_chCwF6/http_credentials'
I0427 15:54:52.012480 30686 http.cpp:975] Creating default 'basic' HTTP authenticator for
realm 'mesos-agent-readonly'
I0427 15:54:52.012750 30686 http.cpp:975] Creating default 'basic' HTTP authenticator for
realm 'mesos-agent-readwrite'
I0427 15:54:52.014122 30686 slave.cpp:525] Agent resources: cpus(*):2; mem(*):1024; disk(*):1024;
ports(*):[31000-32000]
I0427 15:54:52.014230 30686 slave.cpp:533] Agent attributes: [  ]
I0427 15:54:52.014247 30686 slave.cpp:538] Agent hostname: ed854eea68fd
I0427 15:54:52.014420 30682 status_update_manager.cpp:177] Pausing sending status updates
I0427 15:54:52.016203 30690 state.cpp:62] Recovering state from '/tmp/Endpoint_SlaveEndpointTest_NoAuthorizer_0_Sq2w6U/meta'
I0427 15:54:52.016602 30686 status_update_manager.cpp:203] Recovering status update manager
I0427 15:54:52.016839 30684 containerizer.cpp:608] Recovering containerizer
I0427 15:54:52.018623 30676 provisioner.cpp:410] Provisioner recovery complete
I0427 15:54:52.019088 30689 slave.cpp:5963] Finished recovery
I0427 15:54:52.019723 30689 slave.cpp:6145] Querying resource estimator for oversubscribable
resources
I0427 15:54:52.020016 30686 slave.cpp:6159] Received oversubscribable resources {} from the
resource estimator
I0427 15:54:52.023454 30676 process.cpp:3731] Handling HTTP event for process 'slave(741)'
with path: '/slave(741)/monitor/statistics'
I0427 15:54:52.024857 30682 http.cpp:1115] HTTP GET for /slave(741)/monitor/statistics from
172.17.0.2:57523
I0427 15:54:52.024943 30682 http.cpp:936] Authorizing principal 'test-principal' to GET the
'/monitor/statistics' endpoint
I0427 15:54:52.028965 30688 slave.cpp:790] Agent terminating
[       OK ] Endpoint/SlaveEndpointTest.NoAuthorizer/0 (34 ms)
[ RUN      ] Endpoint/SlaveEndpointTest.NoAuthorizer/1
I0427 15:54:52.043085 30656 containerizer.cpp:221] Using isolation: posix/cpu,posix/mem,filesystem/posix,network/cni
W0427 15:54:52.043848 30656 backend.cpp:76] Failed to create 'aufs' backend: AufsBackend requires
root privileges
W0427 15:54:52.043982 30656 backend.cpp:76] Failed to create 'bind' backend: BindBackend requires
root privileges
I0427 15:54:52.044040 30656 provisioner.cpp:249] Using default backend 'copy'
I0427 15:54:52.046041 30656 cluster.cpp:448] Creating default 'local' authorizer
I0427 15:54:52.048271 30677 slave.cpp:225] Mesos agent started on (742)@172.17.0.2:35748
I0427 15:54:52.048307 30677 slave.cpp:226] Flags at startup: --acls="" --appc_simple_discovery_uri_prefix="http://"
--appc_store_dir="/tmp/mesos/store/appc" --authenticate_http_readonly="true" --authenticate_http_readwrite="true"
--authenticatee="crammd5" --authentication_backoff_factor="1secs" --authorizer="local" --cgroups_cpu_enable_pids_and_tids_count="false"
--cgroups_enable_cfs="false" --cgroups_hierarchy="/sys/fs/cgroup" --cgroups_limit_swap="false"
--cgroups_root="mesos" --container_disk_watch_interval="15secs" --containerizers="mesos" --credential="/tmp/Endpoint_SlaveEndpointTest_NoAuthorizer_1_KKyneR/credential"
--default_role="*" --disk_watch_interval="1mins" --docker="docker" --docker_kill_orphans="true"
--docker_registry="https://registry-1.docker.io" --docker_remove_delay="6hrs" --docker_socket="/var/run/docker.sock"
--docker_stop_timeout="0ns" --docker_store_dir="/tmp/mesos/store/docker" --docker_volume_checkpoint_dir="/var/run/mesos/isolators/docker/volume"
--enforce_container_disk_quota="false" --executor_registration_timeout="1mins" --executor_shutdown_grace_period="5secs"
--fetcher_cache_dir="/tmp/Endpoint_SlaveEndpointTest_NoAuthorizer_1_KKyneR/fetch" --fetcher_cache_size="2GB"
--frameworks_home="" --gc_delay="1weeks" --gc_disk_headroom="0.1" --hadoop_home="" --help="false"
--hostname_lookup="true" --http_command_executor="false" --http_credentials="/tmp/Endpoint_SlaveEndpointTest_NoAuthorizer_1_KKyneR/http_credentials"
--http_heartbeat_interval="30secs" --initialize_driver_logging="true" --isolation="posix/cpu,posix/mem"
--launcher="posix" --launcher_dir="/mesos/mesos-1.3.0/_build/src" --logbufsecs="0" --logging_level="INFO"
--max_completed_executors_per_framework="150" --oversubscribed_resources_interval="15secs"
--perf_duration="10secs" --perf_interval="1mins" --port="5051" --qos_correction_interval_min="0ns"
--quiet="false" --recover="reconnect" --recovery_timeout="15mins" --registration_backoff_factor="10ms"
--resources="cpus:2;gpus:0;mem:1024;disk:1024;ports:[31000-32000]" --revocable_cpu_low_priority="true"
--runtime_dir="/tmp/Endpoint_SlaveEndpointTest_NoAuthorizer_1_KKyneR" --sandbox_directory="/mnt/mesos/sandbox"
--strict="true" --switch_user="true" --systemd_enable_support="true" --systemd_runtime_directory="/run/systemd/system"
--version="false" --work_dir="/tmp/Endpoint_SlaveEndpointTest_NoAuthorizer_1_UuHKzF"
I0427 15:54:52.049012 30677 credentials.hpp:86] Loading credential for authentication from
'/tmp/Endpoint_SlaveEndpointTest_NoAuthorizer_1_KKyneR/credential'
I0427 15:54:52.049304 30677 slave.cpp:258] Agent using credential for: test-principal
I0427 15:54:52.049330 30677 credentials.hpp:37] Loading credentials for authentication from
'/tmp/Endpoint_SlaveEndpointTest_NoAuthorizer_1_KKyneR/http_credentials'
I0427 15:54:52.049593 30677 http.cpp:975] Creating default 'basic' HTTP authenticator for
realm 'mesos-agent-readonly'
I0427 15:54:52.049823 30677 http.cpp:975] Creating default 'basic' HTTP authenticator for
realm 'mesos-agent-readwrite'
I0427 15:54:52.051730 30677 slave.cpp:525] Agent resources: cpus(*):2; mem(*):1024; disk(*):1024;
ports(*):[31000-32000]
I0427 15:54:52.051847 30677 slave.cpp:533] Agent attributes: [  ]
I0427 15:54:52.051864 30677 slave.cpp:538] Agent hostname: ed854eea68fd
I0427 15:54:52.052047 30687 status_update_manager.cpp:177] Pausing sending status updates
I0427 15:54:52.053823 30679 state.cpp:62] Recovering state from '/tmp/Endpoint_SlaveEndpointTest_NoAuthorizer_1_UuHKzF/meta'
I0427 15:54:52.054214 30683 status_update_manager.cpp:203] Recovering status update manager
I0427 15:54:52.054675 30690 containerizer.cpp:608] Recovering containerizer
I0427 15:54:52.056639 30687 provisioner.cpp:410] Provisioner recovery complete
I0427 15:54:52.057186 30682 slave.cpp:5963] Finished recovery
I0427 15:54:52.057742 30682 slave.cpp:6145] Querying resource estimator for oversubscribable
resources
I0427 15:54:52.058051 30678 slave.cpp:6159] Received oversubscribable resources {} from the
resource estimator
I0427 15:54:52.061514 30678 process.cpp:3731] Handling HTTP event for process 'slave(742)'
with path: '/slave(742)/monitor/statistics.json'
I0427 15:54:52.063315 30681 http.cpp:1115] HTTP GET for /slave(742)/monitor/statistics.json
from 172.17.0.2:57527
I0427 15:54:52.063453 30681 http.cpp:936] Authorizing principal 'test-principal' to GET the
'/monitor/statistics.json' endpoint
I0427 15:54:52.067523 30685 slave.cpp:790] Agent terminating
[       OK ] Endpoint/SlaveEndpointTest.NoAuthorizer/1 (37 ms)
[ RUN      ] Endpoint/SlaveEndpointTest.NoAuthorizer/2
I0427 15:54:52.081640 30656 containerizer.cpp:221] Using isolation: posix/cpu,posix/mem,filesystem/posix,network/cni
W0427 15:54:52.082659 30656 backend.cpp:76] Failed to create 'aufs' backend: AufsBackend requires
root privileges
W0427 15:54:52.082835 30656 backend.cpp:76] Failed to create 'bind' backend: BindBackend requires
root privileges
I0427 15:54:52.082896 30656 provisioner.cpp:249] Using default backend 'copy'
I0427 15:54:52.084974 30656 cluster.cpp:448] Creating default 'local' authorizer
I0427 15:54:52.087249 30688 slave.cpp:225] Mesos agent started on (743)@172.17.0.2:35748
I0427 15:54:52.087294 30688 slave.cpp:226] Flags at startup: --acls="" --appc_simple_discovery_uri_prefix="http://"
--appc_store_dir="/tmp/mesos/store/appc" --authenticate_http_readonly="true" --authenticate_http_readwrite="true"
--authenticatee="crammd5" --authentication_backoff_factor="1secs" --authorizer="local" --cgroups_cpu_enable_pids_and_tids_count="false"
--cgroups_enable_cfs="false" --cgroups_hierarchy="/sys/fs/cgroup" --cgroups_limit_swap="false"
--cgroups_root="mesos" --container_disk_watch_interval="15secs" --containerizers="mesos" --credential="/tmp/Endpoint_SlaveEndpointTest_NoAuthorizer_2_geD2bC/credential"
--default_role="*" --disk_watch_interval="1mins" --docker="docker" --docker_kill_orphans="true"
--docker_registry="https://registry-1.docker.io" --docker_remove_delay="6hrs" --docker_socket="/var/run/docker.sock"
--docker_stop_timeout="0ns" --docker_store_dir="/tmp/mesos/store/docker" --docker_volume_checkpoint_dir="/var/run/mesos/isolators/docker/volume"
--enforce_container_disk_quota="false" --executor_registration_timeout="1mins" --executor_shutdown_grace_period="5secs"
--fetcher_cache_dir="/tmp/Endpoint_SlaveEndpointTest_NoAuthorizer_2_geD2bC/fetch" --fetcher_cache_size="2GB"
--frameworks_home="" --gc_delay="1weeks" --gc_disk_headroom="0.1" --hadoop_home="" --help="false"
--hostname_lookup="true" --http_command_executor="false" --http_credentials="/tmp/Endpoint_SlaveEndpointTest_NoAuthorizer_2_geD2bC/http_credentials"
--http_heartbeat_interval="30secs" --initialize_driver_logging="true" --isolation="posix/cpu,posix/mem"
--launcher="posix" --launcher_dir="/mesos/mesos-1.3.0/_build/src" --logbufsecs="0" --logging_level="INFO"
--max_completed_executors_per_framework="150" --oversubscribed_resources_interval="15secs"
--perf_duration="10secs" --perf_interval="1mins" --port="5051" --qos_correction_interval_min="0ns"
--quiet="false" --recover="reconnect" --recovery_timeout="15mins" --registration_backoff_factor="10ms"
--resources="cpus:2;gpus:0;mem:1024;disk:1024;ports:[31000-32000]" --revocable_cpu_low_priority="true"
--runtime_dir="/tmp/Endpoint_SlaveEndpointTest_NoAuthorizer_2_geD2bC" --sandbox_directory="/mnt/mesos/sandbox"
--strict="true" --switch_user="true" --systemd_enable_support="true" --systemd_runtime_directory="/run/systemd/system"
--version="false" --work_dir="/tmp/Endpoint_SlaveEndpointTest_NoAuthorizer_2_yrU9qq"
I0427 15:54:52.087925 30688 credentials.hpp:86] Loading credential for authentication from
'/tmp/Endpoint_SlaveEndpointTest_NoAuthorizer_2_geD2bC/credential'
I0427 15:54:52.088142 30688 slave.cpp:258] Agent using credential for: test-principal
I0427 15:54:52.088165 30688 credentials.hpp:37] Loading credentials for authentication from
'/tmp/Endpoint_SlaveEndpointTest_NoAuthorizer_2_geD2bC/http_credentials'
I0427 15:54:52.088387 30688 http.cpp:975] Creating default 'basic' HTTP authenticator for
realm 'mesos-agent-readonly'
I0427 15:54:52.088601 30688 http.cpp:975] Creating default 'basic' HTTP authenticator for
realm 'mesos-agent-readwrite'
I0427 15:54:52.089790 30688 slave.cpp:525] Agent resources: cpus(*):2; mem(*):1024; disk(*):1024;
ports(*):[31000-32000]
I0427 15:54:52.089869 30688 slave.cpp:533] Agent attributes: [  ]
I0427 15:54:52.089881 30688 slave.cpp:538] Agent hostname: ed854eea68fd
I0427 15:54:52.090073 30678 status_update_manager.cpp:177] Pausing sending status updates
I0427 15:54:52.091343 30689 state.cpp:62] Recovering state from '/tmp/Endpoint_SlaveEndpointTest_NoAuthorizer_2_yrU9qq/meta'
I0427 15:54:52.091742 30675 status_update_manager.cpp:203] Recovering status update manager
I0427 15:54:52.091969 30681 containerizer.cpp:608] Recovering containerizer
I0427 15:54:52.093554 30683 provisioner.cpp:410] Provisioner recovery complete
I0427 15:54:52.093948 30680 slave.cpp:5963] Finished recovery
I0427 15:54:52.099226 30680 slave.cpp:6145] Querying resource estimator for oversubscribable
resources
I0427 15:54:52.099594 30683 slave.cpp:6159] Received oversubscribable resources {} from the
resource estimator
I0427 15:54:52.102702 30687 process.cpp:3731] Handling HTTP event for process 'slave(743)'
with path: '/slave(743)/containers'
I0427 15:54:52.104096 30687 http.cpp:1115] HTTP GET for /slave(743)/containers from 172.17.0.2:57533
I0427 15:54:52.104190 30687 http.cpp:936] Authorizing principal 'test-principal' to GET the
'/containers' endpoint
I0427 15:54:52.108564 30679 slave.cpp:790] Agent terminating
[       OK ] Endpoint/SlaveEndpointTest.NoAuthorizer/2 (40 ms)
[----------] 9 tests from Endpoint/SlaveEndpointTest (317 ms total)

[----------] Global test environment tear-down
[==========] 1562 tests from 175 test cases ran. (493277 ms total)
[  PASSED  ] 1561 tests.
[  FAILED  ] 1 test, listed below:
[  FAILED  ] RegisterSlaveValidationTest.DropInvalidRegistration

 1 FAILED TEST
  YOU HAVE 19 DISABLED TESTS

E0427 15:54:52.173816 30691 process.cpp:951] Failed to accept socket: future discarded
make[4]: *** [check-local] Error 1
make[4]: Leaving directory `/mesos/mesos-1.3.0/_build/src'
make[3]: *** [check-am] Error 2
make[3]: Leaving directory `/mesos/mesos-1.3.0/_build/src'
make[2]: *** [check] Error 2
make[2]: Leaving directory `/mesos/mesos-1.3.0/_build/src'
make[1]: *** [check-recursive] Error 1
make[1]: Leaving directory `/mesos/mesos-1.3.0/_build'
make: *** [distcheck] Error 1
+ docker rmi mesos-1493305250-6100
Untagged: mesos-1493305250-6100:latest
Deleted: sha256:8a4c632c6a5aada485d5f2a1a027cacd561788f30a393cec9334f39d1bbd6c66
Deleted: sha256:40cc4d5ea51b617845ebd196b4e43510c9eb5154644f4d1ef2147fbff0a1cd3a
Deleted: sha256:152e00d7448e6f0fcf745c7185fdf38791f9a8f9b01846ce39b560a24cea7094
Deleted: sha256:c4d9326c748e9a8d683189b937e897321136b949d0db1839d84240779e6f0558
Deleted: sha256:2ed8d02ca354ee3c174d64d697a94063a78a07e5d661543c8a00baac01dd41c8
Deleted: sha256:85e864e487e50605a01bf2c887e4c7da26a436f7893589b21c7790e6ccf87887
Deleted: sha256:44bdfece5b8814254b3cb7a28ce22d7b9b31a5829eb83751035c601e9e5d6c44
Deleted: sha256:2817d6ef4c9470ea174fded56a80954b295e06f343b14ca6a602102b139e8655
Deleted: sha256:b9c4e25fe5b2922691e23ea512052e5060e270bd0cf1df6991d12a7206b091d3
Deleted: sha256:7e8dd078cb227790b1c35789868d38767d5d8ee85c3c8552982669a31f908175
Deleted: sha256:e0906f9a9e6089ae202656bc769781d36d2f6ad83b4e6be64627fe154caa01c9
Deleted: sha256:b4ad5e4297f887b8bde20c90d06b55897f0b6016b1ce6634886b96fd790b5600
Deleted: sha256:723d9c9491cd78f1961ae8011a5228d5bf7b90f7d05e952c67cd564cce730e90
Deleted: sha256:d27cfab3fb79ff43b9b89d3729fbb93cbdd17fd98990fb71997fbdbc86cb333f
Deleted: sha256:79ca12f42afcf6d3199c997eb9155c1fc175d452a58cf06efe0bf65a6e14b3e4
Deleted: sha256:129eb799bd9894b68137a664faf95fe2f508fd4d0cf77b833de33bb5d8b2d520
Deleted: sha256:119831ccbda4b95f8fb84462e8446d4a7a2ffdbfcc8751d6614f5629a688a580
Deleted: sha256:f1547238003d666bf8b0e8cace6e8ff5ce88bff17c9e4debbb0cfe1e80008865
Deleted: sha256:39bd3cda453805b5b4e1eaeb341c3f1d026f61616986a2034be884c96f312489
Deleted: sha256:99320d97106980c1b9495c0763c0a8630bad8d76498773bedae763c37ace0dda
Deleted: sha256:5041aa0c97066ca6898418607b93ab6bb8bdebb3763f83cabf3a58e0eacaefad
Deleted: sha256:094c55cc49d61d858e56c3616d6bb9d6f68e12dd60f535da720fbe0b44d40054
Deleted: sha256:5a94db8a280c072bbf6aee6b250f8162cb453099bd8f1154bdab2d74663877f7
Deleted: sha256:16754e54f63c06a03e1875a59b17ecaf86fcef84b30a391a7998aabd179b83f3
Build step 'Execute shell' marked build as failure

Mime
View raw message