mesos-builds mailing list archives

Site index · List index
Message view « Date » · « Thread »
Top « Date » · « Thread »
From Apache Jenkins Server <jenk...@builds.apache.org>
Subject Build failed in Jenkins: Mesos-Buildbot » cmake,gcc,--verbose,GLOG_v=1 MESOS_VERBOSE=1,centos:7,(docker||Hadoop)&&(!ubuntu-us1)&&(!ubuntu-eu2) #3445
Date Sat, 01 Apr 2017 01:34:46 GMT
See <https://builds.apache.org/job/Mesos-Buildbot/BUILDTOOL=cmake,COMPILER=gcc,CONFIGURATION=--verbose,ENVIRONMENT=GLOG_v=1%20MESOS_VERBOSE=1,OS=centos%3A7,label_exp=(docker%7C%7CHadoop)&&(!ubuntu-us1)&&(!ubuntu-eu2)/3445/display/redirect?page=changes>

Changes:

[bmahler] Documentation updates to reflect multi-role framework support.

[bmahler] Added MULTI_ROLE support to the upgrades documentation.

------------------------------------------
[...truncated 24.10 MB...]
I0401 01:34:40.897884 24429 state.cpp:62] Recovering state from '/tmp/Endpoint_SlaveEndpointTest_AuthorizedRequest_1_sVbaNu/meta'
I0401 01:34:40.898026 24439 status_update_manager.cpp:203] Recovering status update manager
I0401 01:34:40.898139 24430 containerizer.cpp:608] Recovering containerizer
I0401 01:34:40.898710 24436 provisioner.cpp:410] Provisioner recovery complete
I0401 01:34:40.898896 24431 slave.cpp:5927] Finished recovery
I0401 01:34:40.901032 24431 slave.cpp:6109] Querying resource estimator for oversubscribable
resources
I0401 01:34:40.901171 24434 slave.cpp:6123] Received oversubscribable resources {} from the
resource estimator
I0401 01:34:40.901983 24428 process.cpp:3705] Handling HTTP event for process 'slave(719)'
with path: '/slave(719)/monitor/statistics.json'
I0401 01:34:40.902462 24436 http.cpp:936] Authorizing principal 'test-principal' to GET the
'/monitor/statistics.json' endpoint
I0401 01:34:40.903774 24440 slave.cpp:754] Agent terminating
[       OK ] Endpoint/SlaveEndpointTest.AuthorizedRequest/1 (14 ms)
[ RUN      ] Endpoint/SlaveEndpointTest.AuthorizedRequest/2
I0401 01:34:40.909566 24425 containerizer.cpp:221] Using isolation: posix/cpu,posix/mem,filesystem/posix,network/cni
W0401 01:34:40.909996 24425 backend.cpp:76] Failed to create 'aufs' backend: AufsBackend requires
root privileges
W0401 01:34:40.910056 24425 backend.cpp:76] Failed to create 'bind' backend: BindBackend requires
root privileges
I0401 01:34:40.910084 24425 provisioner.cpp:249] Using default backend 'copy'
I0401 01:34:40.911262 24434 slave.cpp:226] Mesos agent started on (720)@172.17.0.2:39138
I0401 01:34:40.911281 24434 slave.cpp:227] Flags at startup: --acls="" --appc_simple_discovery_uri_prefix="http://"
--appc_store_dir="/tmp/mesos/store/appc" --authenticate_http_readonly="true" --authenticate_http_readwrite="true"
--authenticatee="crammd5" --authentication_backoff_factor="1secs" --authorizer="local" --cgroups_cpu_enable_pids_and_tids_count="false"
--cgroups_enable_cfs="false" --cgroups_hierarchy="/sys/fs/cgroup" --cgroups_limit_swap="false"
--cgroups_root="mesos" --container_disk_watch_interval="15secs" --containerizers="mesos" --credential="/tmp/Endpoint_SlaveEndpointTest_AuthorizedRequest_2_LUMC6n/credential"
--default_role="*" --disk_watch_interval="1mins" --docker="docker" --docker_kill_orphans="true"
--docker_registry="https://registry-1.docker.io" --docker_remove_delay="6hrs" --docker_socket="/var/run/docker.sock"
--docker_stop_timeout="0ns" --docker_store_dir="/tmp/mesos/store/docker" --docker_volume_checkpoint_dir="/var/run/mesos/isolators/docker/volume"
--enforce_container_disk_quota="false" --executor_registration_timeout="1mins" --executor_shutdown_grace_period="5secs"
--fetcher_cache_dir="/tmp/Endpoint_SlaveEndpointTest_AuthorizedRequest_2_LUMC6n/fetch" --fetcher_cache_size="2GB"
--frameworks_home="" --gc_delay="1weeks" --gc_disk_headroom="0.1" --hadoop_home="" --help="false"
--hostname_lookup="true" --http_command_executor="false" --http_credentials="/tmp/Endpoint_SlaveEndpointTest_AuthorizedRequest_2_LUMC6n/http_credentials"
--http_heartbeat_interval="30secs" --initialize_driver_logging="true" --isolation="posix/cpu,posix/mem"
--launcher="posix" --launcher_dir="/mesos/build/src" --logbufsecs="0" --logging_level="INFO"
--max_completed_executors_per_framework="150" --oversubscribed_resources_interval="15secs"
--perf_duration="10secs" --perf_interval="1mins" --port="5051" --qos_correction_interval_min="0ns"
--quiet="false" --recover="reconnect" --recovery_timeout="15mins" --registration_backoff_factor="10ms"
--resources="cpus:2;gpus:0;mem:1024;disk:1024;ports:[31000-32000]" --revocable_cpu_low_priority="true"
--runtime_dir="/tmp/Endpoint_SlaveEndpointTest_AuthorizedRequest_2_LUMC6n" --sandbox_directory="/mnt/mesos/sandbox"
--strict="true" --switch_user="true" --systemd_enable_support="true" --systemd_runtime_directory="/run/systemd/system"
--version="false" --work_dir="/tmp/Endpoint_SlaveEndpointTest_AuthorizedRequest_2_iYCW1c"
I0401 01:34:40.911682 24434 credentials.hpp:86] Loading credential for authentication from
'/tmp/Endpoint_SlaveEndpointTest_AuthorizedRequest_2_LUMC6n/credential'
I0401 01:34:40.911777 24434 slave.cpp:259] Agent using credential for: test-principal
I0401 01:34:40.911792 24434 credentials.hpp:37] Loading credentials for authentication from
'/tmp/Endpoint_SlaveEndpointTest_AuthorizedRequest_2_LUMC6n/http_credentials'
I0401 01:34:40.911903 24434 http.cpp:975] Creating default 'basic' HTTP authenticator for
realm 'mesos-agent-readonly'
I0401 01:34:40.911950 24434 http.cpp:975] Creating default 'basic' HTTP authenticator for
realm 'mesos-agent-readwrite'
I0401 01:34:40.912417 24434 slave.cpp:492] Agent resources: cpus(*):2; mem(*):1024; disk(*):1024;
ports(*):[31000-32000]
I0401 01:34:40.912461 24434 slave.cpp:500] Agent attributes: [  ]
I0401 01:34:40.912467 24434 slave.cpp:505] Agent hostname: 359af1c6200e
I0401 01:34:40.912552 24430 status_update_manager.cpp:177] Pausing sending status updates
I0401 01:34:40.913009 24427 state.cpp:62] Recovering state from '/tmp/Endpoint_SlaveEndpointTest_AuthorizedRequest_2_iYCW1c/meta'
I0401 01:34:40.913156 24432 status_update_manager.cpp:203] Recovering status update manager
I0401 01:34:40.913290 24434 containerizer.cpp:608] Recovering containerizer
I0401 01:34:40.913950 24441 provisioner.cpp:410] Provisioner recovery complete
I0401 01:34:40.914289 24441 slave.cpp:5927] Finished recovery
I0401 01:34:40.914674 24441 slave.cpp:6109] Querying resource estimator for oversubscribable
resources
I0401 01:34:40.914855 24427 slave.cpp:6123] Received oversubscribable resources {} from the
resource estimator
I0401 01:34:40.916379 24429 process.cpp:3705] Handling HTTP event for process 'slave(720)'
with path: '/slave(720)/containers'
I0401 01:34:40.916860 24435 http.cpp:936] Authorizing principal 'test-principal' to GET the
'/containers' endpoint
I0401 01:34:40.918442 24426 slave.cpp:754] Agent terminating
[       OK ] Endpoint/SlaveEndpointTest.AuthorizedRequest/2 (14 ms)
[ RUN      ] Endpoint/SlaveEndpointTest.UnauthorizedRequest/0
I0401 01:34:40.925295 24425 containerizer.cpp:221] Using isolation: posix/cpu,posix/mem,filesystem/posix,network/cni
W0401 01:34:40.925647 24425 backend.cpp:76] Failed to create 'aufs' backend: AufsBackend requires
root privileges
W0401 01:34:40.925698 24425 backend.cpp:76] Failed to create 'bind' backend: BindBackend requires
root privileges
I0401 01:34:40.925724 24425 provisioner.cpp:249] Using default backend 'copy'
I0401 01:34:40.926784 24434 slave.cpp:226] Mesos agent started on (721)@172.17.0.2:39138
I0401 01:34:40.926811 24434 slave.cpp:227] Flags at startup: --acls="" --appc_simple_discovery_uri_prefix="http://"
--appc_store_dir="/tmp/mesos/store/appc" --authenticate_http_readonly="true" --authenticate_http_readwrite="true"
--authenticatee="crammd5" --authentication_backoff_factor="1secs" --authorizer="local" --cgroups_cpu_enable_pids_and_tids_count="false"
--cgroups_enable_cfs="false" --cgroups_hierarchy="/sys/fs/cgroup" --cgroups_limit_swap="false"
--cgroups_root="mesos" --container_disk_watch_interval="15secs" --containerizers="mesos" --credential="/tmp/Endpoint_SlaveEndpointTest_UnauthorizedRequest_0_V8V1x6/credential"
--default_role="*" --disk_watch_interval="1mins" --docker="docker" --docker_kill_orphans="true"
--docker_registry="https://registry-1.docker.io" --docker_remove_delay="6hrs" --docker_socket="/var/run/docker.sock"
--docker_stop_timeout="0ns" --docker_store_dir="/tmp/mesos/store/docker" --docker_volume_checkpoint_dir="/var/run/mesos/isolators/docker/volume"
--enforce_container_disk_quota="false" --executor_registration_timeout="1mins" --executor_shutdown_grace_period="5secs"
--fetcher_cache_dir="/tmp/Endpoint_SlaveEndpointTest_UnauthorizedRequest_0_V8V1x6/fetch" --fetcher_cache_size="2GB"
--frameworks_home="" --gc_delay="1weeks" --gc_disk_headroom="0.1" --hadoop_home="" --help="false"
--hostname_lookup="true" --http_command_executor="false" --http_credentials="/tmp/Endpoint_SlaveEndpointTest_UnauthorizedRequest_0_V8V1x6/http_credentials"
--http_heartbeat_interval="30secs" --initialize_driver_logging="true" --isolation="posix/cpu,posix/mem"
--launcher="posix" --launcher_dir="/mesos/build/src" --logbufsecs="0" --logging_level="INFO"
--max_completed_executors_per_framework="150" --oversubscribed_resources_interval="15secs"
--perf_duration="10secs" --perf_interval="1mins" --port="5051" --qos_correction_interval_min="0ns"
--quiet="false" --recover="reconnect" --recovery_timeout="15mins" --registration_backoff_factor="10ms"
--resources="cpus:2;gpus:0;mem:1024;disk:1024;ports:[31000-32000]" --revocable_cpu_low_priority="true"
--runtime_dir="/tmp/Endpoint_SlaveEndpointTest_UnauthorizedRequest_0_V8V1x6" --sandbox_directory="/mnt/mesos/sandbox"
--strict="true" --switch_user="true" --systemd_enable_support="true" --systemd_runtime_directory="/run/systemd/system"
--version="false" --work_dir="/tmp/Endpoint_SlaveEndpointTest_UnauthorizedRequest_0_A5xKqV"
I0401 01:34:40.927305 24434 credentials.hpp:86] Loading credential for authentication from
'/tmp/Endpoint_SlaveEndpointTest_UnauthorizedRequest_0_V8V1x6/credential'
I0401 01:34:40.927435 24434 slave.cpp:259] Agent using credential for: test-principal
I0401 01:34:40.927450 24434 credentials.hpp:37] Loading credentials for authentication from
'/tmp/Endpoint_SlaveEndpointTest_UnauthorizedRequest_0_V8V1x6/http_credentials'
I0401 01:34:40.927568 24434 http.cpp:975] Creating default 'basic' HTTP authenticator for
realm 'mesos-agent-readonly'
I0401 01:34:40.927620 24434 http.cpp:975] Creating default 'basic' HTTP authenticator for
realm 'mesos-agent-readwrite'
I0401 01:34:40.928128 24434 slave.cpp:492] Agent resources: cpus(*):2; mem(*):1024; disk(*):1024;
ports(*):[31000-32000]
I0401 01:34:40.928170 24434 slave.cpp:500] Agent attributes: [  ]
I0401 01:34:40.928179 24434 slave.cpp:505] Agent hostname: 359af1c6200e
I0401 01:34:40.928298 24433 status_update_manager.cpp:177] Pausing sending status updates
I0401 01:34:40.928589 24431 state.cpp:62] Recovering state from '/tmp/Endpoint_SlaveEndpointTest_UnauthorizedRequest_0_A5xKqV/meta'
I0401 01:34:40.928797 24427 status_update_manager.cpp:203] Recovering status update manager
I0401 01:34:40.929013 24431 containerizer.cpp:608] Recovering containerizer
I0401 01:34:40.929553 24438 provisioner.cpp:410] Provisioner recovery complete
I0401 01:34:40.929805 24431 slave.cpp:5927] Finished recovery
I0401 01:34:40.930176 24431 slave.cpp:6109] Querying resource estimator for oversubscribable
resources
I0401 01:34:40.930300 24440 slave.cpp:6123] Received oversubscribable resources {} from the
resource estimator
I0401 01:34:40.930886 24434 process.cpp:3705] Handling HTTP event for process 'slave(721)'
with path: '/slave(721)/monitor/statistics'
I0401 01:34:40.931299 24430 http.cpp:936] Authorizing principal 'test-principal' to GET the
'/monitor/statistics' endpoint
I0401 01:34:40.932384 24427 slave.cpp:754] Agent terminating
[       OK ] Endpoint/SlaveEndpointTest.UnauthorizedRequest/0 (12 ms)
[ RUN      ] Endpoint/SlaveEndpointTest.UnauthorizedRequest/1
I0401 01:34:40.942260 24425 containerizer.cpp:221] Using isolation: posix/cpu,posix/mem,filesystem/posix,network/cni
W0401 01:34:40.942528 24425 backend.cpp:76] Failed to create 'aufs' backend: AufsBackend requires
root privileges
W0401 01:34:40.942561 24425 backend.cpp:76] Failed to create 'bind' backend: BindBackend requires
root privileges
I0401 01:34:40.942579 24425 provisioner.cpp:249] Using default backend 'copy'
I0401 01:34:40.943490 24429 slave.cpp:226] Mesos agent started on (722)@172.17.0.2:39138
I0401 01:34:40.943506 24429 slave.cpp:227] Flags at startup: --acls="" --appc_simple_discovery_uri_prefix="http://"
--appc_store_dir="/tmp/mesos/store/appc" --authenticate_http_readonly="true" --authenticate_http_readwrite="true"
--authenticatee="crammd5" --authentication_backoff_factor="1secs" --authorizer="local" --cgroups_cpu_enable_pids_and_tids_count="false"
--cgroups_enable_cfs="false" --cgroups_hierarchy="/sys/fs/cgroup" --cgroups_limit_swap="false"
--cgroups_root="mesos" --container_disk_watch_interval="15secs" --containerizers="mesos" --credential="/tmp/Endpoint_SlaveEndpointTest_UnauthorizedRequest_1_mm2paP/credential"
--default_role="*" --disk_watch_interval="1mins" --docker="docker" --docker_kill_orphans="true"
--docker_registry="https://registry-1.docker.io" --docker_remove_delay="6hrs" --docker_socket="/var/run/docker.sock"
--docker_stop_timeout="0ns" --docker_store_dir="/tmp/mesos/store/docker" --docker_volume_checkpoint_dir="/var/run/mesos/isolators/docker/volume"
--enforce_container_disk_quota="false" --executor_registration_timeout="1mins" --executor_shutdown_grace_period="5secs"
--fetcher_cache_dir="/tmp/Endpoint_SlaveEndpointTest_UnauthorizedRequest_1_mm2paP/fetch" --fetcher_cache_size="2GB"
--frameworks_home="" --gc_delay="1weeks" --gc_disk_headroom="0.1" --hadoop_home="" --help="false"
--hostname_lookup="true" --http_command_executor="false" --http_credentials="/tmp/Endpoint_SlaveEndpointTest_UnauthorizedRequest_1_mm2paP/http_credentials"
--http_heartbeat_interval="30secs" --initialize_driver_logging="true" --isolation="posix/cpu,posix/mem"
--launcher="posix" --launcher_dir="/mesos/build/src" --logbufsecs="0" --logging_level="INFO"
--max_completed_executors_per_framework="150" --oversubscribed_resources_interval="15secs"
--perf_duration="10secs" --perf_interval="1mins" --port="5051" --qos_correction_interval_min="0ns"
--quiet="false" --recover="reconnect" --recovery_timeout="15mins" --registration_backoff_factor="10ms"
--resources="cpus:2;gpus:0;mem:1024;disk:1024;ports:[31000-32000]" --revocable_cpu_low_priority="true"
--runtime_dir="/tmp/Endpoint_SlaveEndpointTest_UnauthorizedRequest_1_mm2paP" --sandbox_directory="/mnt/mesos/sandbox"
--strict="true" --switch_user="true" --systemd_enable_support="true" --systemd_runtime_directory="/run/systemd/system"
--version="false" --work_dir="/tmp/Endpoint_SlaveEndpointTest_UnauthorizedRequest_1_1Z0j0D"
I0401 01:34:40.943804 24429 credentials.hpp:86] Loading credential for authentication from
'/tmp/Endpoint_SlaveEndpointTest_UnauthorizedRequest_1_mm2paP/credential'
I0401 01:34:40.943874 24429 slave.cpp:259] Agent using credential for: test-principal
I0401 01:34:40.943886 24429 credentials.hpp:37] Loading credentials for authentication from
'/tmp/Endpoint_SlaveEndpointTest_UnauthorizedRequest_1_mm2paP/http_credentials'
I0401 01:34:40.943967 24429 http.cpp:975] Creating default 'basic' HTTP authenticator for
realm 'mesos-agent-readonly'
I0401 01:34:40.944008 24429 http.cpp:975] Creating default 'basic' HTTP authenticator for
realm 'mesos-agent-readwrite'
I0401 01:34:40.944380 24429 slave.cpp:492] Agent resources: cpus(*):2; mem(*):1024; disk(*):1024;
ports(*):[31000-32000]
I0401 01:34:40.944412 24429 slave.cpp:500] Agent attributes: [  ]
I0401 01:34:40.944416 24429 slave.cpp:505] Agent hostname: 359af1c6200e
I0401 01:34:40.944471 24427 status_update_manager.cpp:177] Pausing sending status updates
I0401 01:34:40.944881 24438 state.cpp:62] Recovering state from '/tmp/Endpoint_SlaveEndpointTest_UnauthorizedRequest_1_1Z0j0D/meta'
I0401 01:34:40.945024 24441 status_update_manager.cpp:203] Recovering status update manager
I0401 01:34:40.945086 24438 containerizer.cpp:608] Recovering containerizer
I0401 01:34:40.945616 24436 provisioner.cpp:410] Provisioner recovery complete
I0401 01:34:40.945765 24436 slave.cpp:5927] Finished recovery
I0401 01:34:40.946066 24436 slave.cpp:6109] Querying resource estimator for oversubscribable
resources
I0401 01:34:40.946208 24428 slave.cpp:6123] Received oversubscribable resources {} from the
resource estimator
I0401 01:34:40.946900 24429 process.cpp:3705] Handling HTTP event for process 'slave(722)'
with path: '/slave(722)/monitor/statistics.json'
I0401 01:34:40.947247 24435 http.cpp:936] Authorizing principal 'test-principal' to GET the
'/monitor/statistics.json' endpoint
I0401 01:34:40.948170 24425 slave.cpp:754] Agent terminating
[       OK ] Endpoint/SlaveEndpointTest.UnauthorizedRequest/1 (10 ms)
[ RUN      ] Endpoint/SlaveEndpointTest.UnauthorizedRequest/2
I0401 01:34:40.959275 24425 containerizer.cpp:221] Using isolation: posix/cpu,posix/mem,filesystem/posix,network/cni
W0401 01:34:40.959568 24425 backend.cpp:76] Failed to create 'aufs' backend: AufsBackend requires
root privileges
W0401 01:34:40.959609 24425 backend.cpp:76] Failed to create 'bind' backend: BindBackend requires
root privileges
I0401 01:34:40.959625 24425 provisioner.cpp:249] Using default backend 'copy'
I0401 01:34:40.960556 24432 slave.cpp:226] Mesos agent started on (723)@172.17.0.2:39138
I0401 01:34:40.960573 24432 slave.cpp:227] Flags at startup: --acls="" --appc_simple_discovery_uri_prefix="http://"
--appc_store_dir="/tmp/mesos/store/appc" --authenticate_http_readonly="true" --authenticate_http_readwrite="true"
--authenticatee="crammd5" --authentication_backoff_factor="1secs" --authorizer="local" --cgroups_cpu_enable_pids_and_tids_count="false"
--cgroups_enable_cfs="false" --cgroups_hierarchy="/sys/fs/cgroup" --cgroups_limit_swap="false"
--cgroups_root="mesos" --container_disk_watch_interval="15secs" --containerizers="mesos" --credential="/tmp/Endpoint_SlaveEndpointTest_UnauthorizedRequest_2_OQGDXx/credential"
--default_role="*" --disk_watch_interval="1mins" --docker="docker" --docker_kill_orphans="true"
--docker_registry="https://registry-1.docker.io" --docker_remove_delay="6hrs" --docker_socket="/var/run/docker.sock"
--docker_stop_timeout="0ns" --docker_store_dir="/tmp/mesos/store/docker" --docker_volume_checkpoint_dir="/var/run/mesos/isolators/docker/volume"
--enforce_container_disk_quota="false" --executor_registration_timeout="1mins" --executor_shutdown_grace_period="5secs"
--fetcher_cache_dir="/tmp/Endpoint_SlaveEndpointTest_UnauthorizedRequest_2_OQGDXx/fetch" --fetcher_cache_size="2GB"
--frameworks_home="" --gc_delay="1weeks" --gc_disk_headroom="0.1" --hadoop_home="" --help="false"
--hostname_lookup="true" --http_command_executor="false" --http_credentials="/tmp/Endpoint_SlaveEndpointTest_UnauthorizedRequest_2_OQGDXx/http_credentials"
--http_heartbeat_interval="30secs" --initialize_driver_logging="true" --isolation="posix/cpu,posix/mem"
--launcher="posix" --launcher_dir="/mesos/build/src" --logbufsecs="0" --logging_level="INFO"
--max_completed_executors_per_framework="150" --oversubscribed_resources_interval="15secs"
--perf_duration="10secs" --perf_interval="1mins" --port="5051" --qos_correction_interval_min="0ns"
--quiet="false" --recover="reconnect" --recovery_timeout="15mins" --registration_backoff_factor="10ms"
--resources="cpus:2;gpus:0;mem:1024;disk:1024;ports:[31000-32000]" --revocable_cpu_low_priority="true"
--runtime_dir="/tmp/Endpoint_SlaveEndpointTest_UnauthorizedRequest_2_OQGDXx" --sandbox_directory="/mnt/mesos/sandbox"
--strict="true" --switch_user="true" --systemd_enable_support="true" --systemd_runtime_directory="/run/systemd/system"
--version="false" --work_dir="/tmp/Endpoint_SlaveEndpointTest_UnauthorizedRequest_2_x4lNKm"
I0401 01:34:40.960855 24432 credentials.hpp:86] Loading credential for authentication from
'/tmp/Endpoint_SlaveEndpointTest_UnauthorizedRequest_2_OQGDXx/credential'
I0401 01:34:40.960969 24432 slave.cpp:259] Agent using credential for: test-principal
I0401 01:34:40.960983 24432 credentials.hpp:37] Loading credentials for authentication from
'/tmp/Endpoint_SlaveEndpointTest_UnauthorizedRequest_2_OQGDXx/http_credentials'
I0401 01:34:40.961081 24432 http.cpp:975] Creating default 'basic' HTTP authenticator for
realm 'mesos-agent-readonly'
I0401 01:34:40.961127 24432 http.cpp:975] Creating default 'basic' HTTP authenticator for
realm 'mesos-agent-readwrite'
I0401 01:34:40.961441 24432 slave.cpp:492] Agent resources: cpus(*):2; mem(*):1024; disk(*):1024;
ports(*):[31000-32000]
I0401 01:34:40.961473 24432 slave.cpp:500] Agent attributes: [  ]
I0401 01:34:40.961478 24432 slave.cpp:505] Agent hostname: 359af1c6200e
I0401 01:34:40.961546 24428 status_update_manager.cpp:177] Pausing sending status updates
I0401 01:34:40.961807 24433 state.cpp:62] Recovering state from '/tmp/Endpoint_SlaveEndpointTest_UnauthorizedRequest_2_x4lNKm/meta'
I0401 01:34:40.961925 24426 status_update_manager.cpp:203] Recovering status update manager
I0401 01:34:40.962085 24433 containerizer.cpp:608] Recovering containerizer
I0401 01:34:40.962538 24437 provisioner.cpp:410] Provisioner recovery complete
I0401 01:34:40.962707 24435 slave.cpp:5927] Finished recovery
I0401 01:34:40.963032 24435 slave.cpp:6109] Querying resource estimator for oversubscribable
resources
I0401 01:34:40.963248 24427 slave.cpp:6123] Received oversubscribable resources {} from the
resource estimator
I0401 01:34:40.963883 24426 process.cpp:3705] Handling HTTP event for process 'slave(723)'
with path: '/slave(723)/containers'
I0401 01:34:40.964239 24428 http.cpp:936] Authorizing principal 'test-principal' to GET the
'/containers' endpoint
I0401 01:34:40.965220 24441 slave.cpp:754] Agent terminating
[       OK ] Endpoint/SlaveEndpointTest.UnauthorizedRequest/2 (9 ms)
[ RUN      ] Endpoint/SlaveEndpointTest.NoAuthorizer/0
I0401 01:34:40.972895 24425 containerizer.cpp:221] Using isolation: posix/cpu,posix/mem,filesystem/posix,network/cni
W0401 01:34:40.973145 24425 backend.cpp:76] Failed to create 'aufs' backend: AufsBackend requires
root privileges
W0401 01:34:40.973176 24425 backend.cpp:76] Failed to create 'bind' backend: BindBackend requires
root privileges
I0401 01:34:40.973186 24425 provisioner.cpp:249] Using default backend 'copy'
I0401 01:34:40.973716 24425 cluster.cpp:446] Creating default 'local' authorizer
I0401 01:34:40.974088 24436 slave.cpp:226] Mesos agent started on (724)@172.17.0.2:39138
I0401 01:34:40.974103 24436 slave.cpp:227] Flags at startup: --acls="" --appc_simple_discovery_uri_prefix="http://"
--appc_store_dir="/tmp/mesos/store/appc" --authenticate_http_readonly="true" --authenticate_http_readwrite="true"
--authenticatee="crammd5" --authentication_backoff_factor="1secs" --authorizer="local" --cgroups_cpu_enable_pids_and_tids_count="false"
--cgroups_enable_cfs="false" --cgroups_hierarchy="/sys/fs/cgroup" --cgroups_limit_swap="false"
--cgroups_root="mesos" --container_disk_watch_interval="15secs" --containerizers="mesos" --credential="/tmp/Endpoint_SlaveEndpointTest_NoAuthorizer_0_cuZdUg/credential"
--default_role="*" --disk_watch_interval="1mins" --docker="docker" --docker_kill_orphans="true"
--docker_registry="https://registry-1.docker.io" --docker_remove_delay="6hrs" --docker_socket="/var/run/docker.sock"
--docker_stop_timeout="0ns" --docker_store_dir="/tmp/mesos/store/docker" --docker_volume_checkpoint_dir="/var/run/mesos/isolators/docker/volume"
--enforce_container_disk_quota="false" --executor_registration_timeout="1mins" --executor_shutdown_grace_period="5secs"
--fetcher_cache_dir="/tmp/Endpoint_SlaveEndpointTest_NoAuthorizer_0_cuZdUg/fetch" --fetcher_cache_size="2GB"
--frameworks_home="" --gc_delay="1weeks" --gc_disk_headroom="0.1" --hadoop_home="" --help="false"
--hostname_lookup="true" --http_command_executor="false" --http_credentials="/tmp/Endpoint_SlaveEndpointTest_NoAuthorizer_0_cuZdUg/http_credentials"
--http_heartbeat_interval="30secs" --initialize_driver_logging="true" --isolation="posix/cpu,posix/mem"
--launcher="posix" --launcher_dir="/mesos/build/src" --logbufsecs="0" --logging_level="INFO"
--max_completed_executors_per_framework="150" --oversubscribed_resources_interval="15secs"
--perf_duration="10secs" --perf_interval="1mins" --port="5051" --qos_correction_interval_min="0ns"
--quiet="false" --recover="reconnect" --recovery_timeout="15mins" --registration_backoff_factor="10ms"
--resources="cpus:2;gpus:0;mem:1024;disk:1024;ports:[31000-32000]" --revocable_cpu_low_priority="true"
--runtime_dir="/tmp/Endpoint_SlaveEndpointTest_NoAuthorizer_0_cuZdUg" --sandbox_directory="/mnt/mesos/sandbox"
--strict="true" --switch_user="true" --systemd_enable_support="true" --systemd_runtime_directory="/run/systemd/system"
--version="false" --work_dir="/tmp/Endpoint_SlaveEndpointTest_NoAuthorizer_0_1I2bF5"
I0401 01:34:40.974431 24436 credentials.hpp:86] Loading credential for authentication from
'/tmp/Endpoint_SlaveEndpointTest_NoAuthorizer_0_cuZdUg/credential'
I0401 01:34:40.974517 24436 slave.cpp:259] Agent using credential for: test-principal
I0401 01:34:40.974534 24436 credentials.hpp:37] Loading credentials for authentication from
'/tmp/Endpoint_SlaveEndpointTest_NoAuthorizer_0_cuZdUg/http_credentials'
I0401 01:34:40.974622 24436 http.cpp:975] Creating default 'basic' HTTP authenticator for
realm 'mesos-agent-readonly'
I0401 01:34:40.974663 24436 http.cpp:975] Creating default 'basic' HTTP authenticator for
realm 'mesos-agent-readwrite'
I0401 01:34:40.975044 24436 slave.cpp:492] Agent resources: cpus(*):2; mem(*):1024; disk(*):1024;
ports(*):[31000-32000]
I0401 01:34:40.975075 24436 slave.cpp:500] Agent attributes: [  ]
I0401 01:34:40.975080 24436 slave.cpp:505] Agent hostname: 359af1c6200e
I0401 01:34:40.975134 24427 status_update_manager.cpp:177] Pausing sending status updates
I0401 01:34:40.975370 24434 state.cpp:62] Recovering state from '/tmp/Endpoint_SlaveEndpointTest_NoAuthorizer_0_1I2bF5/meta'
I0401 01:34:40.975534 24436 status_update_manager.cpp:203] Recovering status update manager
I0401 01:34:40.975621 24433 containerizer.cpp:608] Recovering containerizer
I0401 01:34:40.976045 24433 provisioner.cpp:410] Provisioner recovery complete
I0401 01:34:40.976172 24430 slave.cpp:5927] Finished recovery
I0401 01:34:40.976464 24430 slave.cpp:6109] Querying resource estimator for oversubscribable
resources
I0401 01:34:40.976572 24431 slave.cpp:6123] Received oversubscribable resources {} from the
resource estimator
I0401 01:34:40.977124 24435 process.cpp:3705] Handling HTTP event for process 'slave(724)'
with path: '/slave(724)/monitor/statistics'
I0401 01:34:40.977545 24441 http.cpp:936] Authorizing principal 'test-principal' to GET the
'/monitor/statistics' endpoint
I0401 01:34:40.978731 24425 slave.cpp:754] Agent terminating
[       OK ] Endpoint/SlaveEndpointTest.NoAuthorizer/0 (11 ms)
[ RUN      ] Endpoint/SlaveEndpointTest.NoAuthorizer/1
I0401 01:34:40.988649 24425 containerizer.cpp:221] Using isolation: posix/cpu,posix/mem,filesystem/posix,network/cni
W0401 01:34:40.988907 24425 backend.cpp:76] Failed to create 'aufs' backend: AufsBackend requires
root privileges
W0401 01:34:40.988955 24425 backend.cpp:76] Failed to create 'bind' backend: BindBackend requires
root privileges
I0401 01:34:40.988971 24425 provisioner.cpp:249] Using default backend 'copy'
I0401 01:34:40.989506 24425 cluster.cpp:446] Creating default 'local' authorizer
I0401 01:34:40.989897 24430 slave.cpp:226] Mesos agent started on (725)@172.17.0.2:39138
I0401 01:34:40.989908 24430 slave.cpp:227] Flags at startup: --acls="" --appc_simple_discovery_uri_prefix="http://"
--appc_store_dir="/tmp/mesos/store/appc" --authenticate_http_readonly="true" --authenticate_http_readwrite="true"
--authenticatee="crammd5" --authentication_backoff_factor="1secs" --authorizer="local" --cgroups_cpu_enable_pids_and_tids_count="false"
--cgroups_enable_cfs="false" --cgroups_hierarchy="/sys/fs/cgroup" --cgroups_limit_swap="false"
--cgroups_root="mesos" --container_disk_watch_interval="15secs" --containerizers="mesos" --credential="/tmp/Endpoint_SlaveEndpointTest_NoAuthorizer_1_gQ8p0Z/credential"
--default_role="*" --disk_watch_interval="1mins" --docker="docker" --docker_kill_orphans="true"
--docker_registry="https://registry-1.docker.io" --docker_remove_delay="6hrs" --docker_socket="/var/run/docker.sock"
--docker_stop_timeout="0ns" --docker_store_dir="/tmp/mesos/store/docker" --docker_volume_checkpoint_dir="/var/run/mesos/isolators/docker/volume"
--enforce_container_disk_quota="false" --executor_registration_timeout="1mins" --executor_shutdown_grace_period="5secs"
--fetcher_cache_dir="/tmp/Endpoint_SlaveEndpointTest_NoAuthorizer_1_gQ8p0Z/fetch" --fetcher_cache_size="2GB"
--frameworks_home="" --gc_delay="1weeks" --gc_disk_headroom="0.1" --hadoop_home="" --help="false"
--hostname_lookup="true" --http_command_executor="false" --http_credentials="/tmp/Endpoint_SlaveEndpointTest_NoAuthorizer_1_gQ8p0Z/http_credentials"
--http_heartbeat_interval="30secs" --initialize_driver_logging="true" --isolation="posix/cpu,posix/mem"
--launcher="posix" --launcher_dir="/mesos/build/src" --logbufsecs="0" --logging_level="INFO"
--max_completed_executors_per_framework="150" --oversubscribed_resources_interval="15secs"
--perf_duration="10secs" --perf_interval="1mins" --port="5051" --qos_correction_interval_min="0ns"
--quiet="false" --recover="reconnect" --recovery_timeout="15mins" --registration_backoff_factor="10ms"
--resources="cpus:2;gpus:0;mem:1024;disk:1024;ports:[31000-32000]" --revocable_cpu_low_priority="true"
--runtime_dir="/tmp/Endpoint_SlaveEndpointTest_NoAuthorizer_1_gQ8p0Z" --sandbox_directory="/mnt/mesos/sandbox"
--strict="true" --switch_user="true" --systemd_enable_support="true" --systemd_runtime_directory="/run/systemd/system"
--version="false" --work_dir="/tmp/Endpoint_SlaveEndpointTest_NoAuthorizer_1_LADTIO"
I0401 01:34:40.990187 24430 credentials.hpp:86] Loading credential for authentication from
'/tmp/Endpoint_SlaveEndpointTest_NoAuthorizer_1_gQ8p0Z/credential'
I0401 01:34:40.990257 24430 slave.cpp:259] Agent using credential for: test-principal
I0401 01:34:40.990268 24430 credentials.hpp:37] Loading credentials for authentication from
'/tmp/Endpoint_SlaveEndpointTest_NoAuthorizer_1_gQ8p0Z/http_credentials'
I0401 01:34:40.990365 24430 http.cpp:975] Creating default 'basic' HTTP authenticator for
realm 'mesos-agent-readonly'
I0401 01:34:40.990416 24430 http.cpp:975] Creating default 'basic' HTTP authenticator for
realm 'mesos-agent-readwrite'
I0401 01:34:40.990787 24430 slave.cpp:492] Agent resources: cpus(*):2; mem(*):1024; disk(*):1024;
ports(*):[31000-32000]
I0401 01:34:40.990818 24430 slave.cpp:500] Agent attributes: [  ]
I0401 01:34:40.990824 24430 slave.cpp:505] Agent hostname: 359af1c6200e
I0401 01:34:40.990873 24434 status_update_manager.cpp:177] Pausing sending status updates
I0401 01:34:40.991139 24428 state.cpp:62] Recovering state from '/tmp/Endpoint_SlaveEndpointTest_NoAuthorizer_1_LADTIO/meta'
I0401 01:34:40.991256 24441 status_update_manager.cpp:203] Recovering status update manager
I0401 01:34:40.991485 24431 containerizer.cpp:608] Recovering containerizer
I0401 01:34:40.991879 24426 provisioner.cpp:410] Provisioner recovery complete
I0401 01:34:40.992053 24430 slave.cpp:5927] Finished recovery
I0401 01:34:40.992344 24430 slave.cpp:6109] Querying resource estimator for oversubscribable
resources
I0401 01:34:40.992441 24441 slave.cpp:6123] Received oversubscribable resources {} from the
resource estimator
I0401 01:34:40.993098 24435 process.cpp:3705] Handling HTTP event for process 'slave(725)'
with path: '/slave(725)/monitor/statistics.json'
I0401 01:34:40.993429 24431 http.cpp:936] Authorizing principal 'test-principal' to GET the
'/monitor/statistics.json' endpoint
I0401 01:34:40.994429 24441 slave.cpp:754] Agent terminating
[       OK ] Endpoint/SlaveEndpointTest.NoAuthorizer/1 (11 ms)
[ RUN      ] Endpoint/SlaveEndpointTest.NoAuthorizer/2
I0401 01:34:41.006366 24425 containerizer.cpp:221] Using isolation: posix/cpu,posix/mem,filesystem/posix,network/cni
W0401 01:34:41.006702 24425 backend.cpp:76] Failed to create 'aufs' backend: AufsBackend requires
root privileges
W0401 01:34:41.006744 24425 backend.cpp:76] Failed to create 'bind' backend: BindBackend requires
root privileges
I0401 01:34:41.006757 24425 provisioner.cpp:249] Using default backend 'copy'
I0401 01:34:41.007367 24425 cluster.cpp:446] Creating default 'local' authorizer
I0401 01:34:41.007843 24429 slave.cpp:226] Mesos agent started on (726)@172.17.0.2:39138
I0401 01:34:41.007865 24429 slave.cpp:227] Flags at startup: --acls="" --appc_simple_discovery_uri_prefix="http://"
--appc_store_dir="/tmp/mesos/store/appc" --authenticate_http_readonly="true" --authenticate_http_readwrite="true"
--authenticatee="crammd5" --authentication_backoff_factor="1secs" --authorizer="local" --cgroups_cpu_enable_pids_and_tids_count="false"
--cgroups_enable_cfs="false" --cgroups_hierarchy="/sys/fs/cgroup" --cgroups_limit_swap="false"
--cgroups_root="mesos" --container_disk_watch_interval="15secs" --containerizers="mesos" --credential="/tmp/Endpoint_SlaveEndpointTest_NoAuthorizer_2_EXpYhJ/credential"
--default_role="*" --disk_watch_interval="1mins" --docker="docker" --docker_kill_orphans="true"
--docker_registry="https://registry-1.docker.io" --docker_remove_delay="6hrs" --docker_socket="/var/run/docker.sock"
--docker_stop_timeout="0ns" --docker_store_dir="/tmp/mesos/store/docker" --docker_volume_checkpoint_dir="/var/run/mesos/isolators/docker/volume"
--enforce_container_disk_quota="false" --executor_registration_timeout="1mins" --executor_shutdown_grace_period="5secs"
--fetcher_cache_dir="/tmp/Endpoint_SlaveEndpointTest_NoAuthorizer_2_EXpYhJ/fetch" --fetcher_cache_size="2GB"
--frameworks_home="" --gc_delay="1weeks" --gc_disk_headroom="0.1" --hadoop_home="" --help="false"
--hostname_lookup="true" --http_command_executor="false" --http_credentials="/tmp/Endpoint_SlaveEndpointTest_NoAuthorizer_2_EXpYhJ/http_credentials"
--http_heartbeat_interval="30secs" --initialize_driver_logging="true" --isolation="posix/cpu,posix/mem"
--launcher="posix" --launcher_dir="/mesos/build/src" --logbufsecs="0" --logging_level="INFO"
--max_completed_executors_per_framework="150" --oversubscribed_resources_interval="15secs"
--perf_duration="10secs" --perf_interval="1mins" --port="5051" --qos_correction_interval_min="0ns"
--quiet="false" --recover="reconnect" --recovery_timeout="15mins" --registration_backoff_factor="10ms"
--resources="cpus:2;gpus:0;mem:1024;disk:1024;ports:[31000-32000]" --revocable_cpu_low_priority="true"
--runtime_dir="/tmp/Endpoint_SlaveEndpointTest_NoAuthorizer_2_EXpYhJ" --sandbox_directory="/mnt/mesos/sandbox"
--strict="true" --switch_user="true" --systemd_enable_support="true" --systemd_runtime_directory="/run/systemd/system"
--version="false" --work_dir="/tmp/Endpoint_SlaveEndpointTest_NoAuthorizer_2_78JwXx"
I0401 01:34:41.008258 24429 credentials.hpp:86] Loading credential for authentication from
'/tmp/Endpoint_SlaveEndpointTest_NoAuthorizer_2_EXpYhJ/credential'
I0401 01:34:41.008338 24429 slave.cpp:259] Agent using credential for: test-principal
I0401 01:34:41.008352 24429 credentials.hpp:37] Loading credentials for authentication from
'/tmp/Endpoint_SlaveEndpointTest_NoAuthorizer_2_EXpYhJ/http_credentials'
I0401 01:34:41.008458 24429 http.cpp:975] Creating default 'basic' HTTP authenticator for
realm 'mesos-agent-readonly'
I0401 01:34:41.008527 24429 http.cpp:975] Creating default 'basic' HTTP authenticator for
realm 'mesos-agent-readwrite'
I0401 01:34:41.009136 24429 slave.cpp:492] Agent resources: cpus(*):2; mem(*):1024; disk(*):1024;
ports(*):[31000-32000]
I0401 01:34:41.009176 24429 slave.cpp:500] Agent attributes: [  ]
I0401 01:34:41.009183 24429 slave.cpp:505] Agent hostname: 359af1c6200e
I0401 01:34:41.009248 24428 status_update_manager.cpp:177] Pausing sending status updates
I0401 01:34:41.009541 24439 state.cpp:62] Recovering state from '/tmp/Endpoint_SlaveEndpointTest_NoAuthorizer_2_78JwXx/meta'
I0401 01:34:41.009702 24426 status_update_manager.cpp:203] Recovering status update manager
I0401 01:34:41.009847 24426 containerizer.cpp:608] Recovering containerizer
I0401 01:34:41.010435 24441 provisioner.cpp:410] Provisioner recovery complete
I0401 01:34:41.010789 24427 slave.cpp:5927] Finished recovery
I0401 01:34:41.011175 24427 slave.cpp:6109] Querying resource estimator for oversubscribable
resources
I0401 01:34:41.011301 24432 slave.cpp:6123] Received oversubscribable resources {} from the
resource estimator
I0401 01:34:41.011947 24428 process.cpp:3705] Handling HTTP event for process 'slave(726)'
with path: '/slave(726)/containers'
I0401 01:34:41.012359 24439 http.cpp:936] Authorizing principal 'test-principal' to GET the
'/containers' endpoint
I0401 01:34:41.013730 24425 slave.cpp:754] Agent terminating
[       OK ] Endpoint/SlaveEndpointTest.NoAuthorizer/2 (13 ms)
[----------] 9 tests from Endpoint/SlaveEndpointTest (148 ms total)

[----------] Global test environment tear-down
[==========] 1474 tests from 164 test cases ran. (330868 ms total)
[  PASSED  ] 1473 tests.
[  FAILED  ] 1 test, listed below:
[  FAILED  ] OversubscriptionTest.RescindRevocableOfferWithIncreasedRevocable

 1 FAILED TEST
  YOU HAVE 12 DISABLED TESTS

make[3]: Leaving directory `/mesos/build'
make[3]: *** [CMakeFiles/check] Error 1
make[2]: *** [CMakeFiles/check.dir/all] Error 2
make[2]: Leaving directory `/mesos/build'
make[1]: *** [CMakeFiles/check.dir/rule] Error 2
make[1]: Leaving directory `/mesos/build'
make: *** [check] Error 2
+ docker rmi mesos-1491007383-8375
Untagged: mesos-1491007383-8375:latest
Deleted: sha256:2ec0b432c5edc4d1db1c7ce64907aca4abcaef12ec5d7a120cc120dcd2bd84dc
Deleted: sha256:b581562ae9ccd2190da9989e8162c093c68ea3b1a2919176151e305f6fa52822
Deleted: sha256:8042a7ce4c4f3430edaeff2b03fc01e96d6af8edc02f912bcad35d6fe7ed27b2
Deleted: sha256:b29fe2b31f5cf80f799956d86a6e9e254eaa343c543cbdd0ca9ef4247c60437a
Deleted: sha256:23c2720db7925db9a0e3827f7ed73b94e5ce8db82e965e96da4271342da0fdf2
Deleted: sha256:8eafb051a8c083e09ab30c7b25b904a6e4409e5398f5054fd0fe9ae5684ad1f3
Deleted: sha256:211c7aa439898756627eb261a8b89d8a505449b43e0b83cf49b389b8f7ae0ac7
Deleted: sha256:b27bfb813ac751663a928a5dbea95ee265779032b4851cdf9c604ad3ca0584b9
Deleted: sha256:91bc45143284101ffcb9a3f2c66af10756c30e744021cbdad84f425773daba55
Deleted: sha256:3b43ec225f95f506ad9b2b607c6e9926f7384b2086eab76ea0dc2ae4a3622f68
Deleted: sha256:83d5ed6103649c239faeace006fbe1ed6d169ea07aab4a5f5f9d75a157d623f9
Deleted: sha256:2c617f2d2b37904152b897d4d5f62406342459ecf7a412775be5db892bb18da7
Deleted: sha256:f4a3dea06c9031707c34cf68963d9ab73e01f36ff24056400ce7f1fc73d79075
Deleted: sha256:959d5c6b142c5006ce3189ffd4434614faa867b3af211024293abafe0feab246
Deleted: sha256:a55d2e862782f32ac4f13f9bda0d405c6988346948262a6781ba0fe5144be539
Deleted: sha256:8abc6ce3acf12be09d8b360d05117a7a2c5bac6efd100d4534236c2cfec11c0e
Deleted: sha256:8784bb98b145cf76944878e767eb94f06bcb2c40440e5aa12304edf91e24b3b2
Deleted: sha256:cc9e0a8c6d9b7ac330678ab76b892db17dfe909c8f84e642c7db415f7bb58154
Deleted: sha256:032987086ba3f5e4eb15740cd11cfe2d6b0074786422442c9b9d36b0f3dc80a6
Deleted: sha256:84b18e7e18df7fbeb29a9d307e29f27baa4c8c35348d48faa4967930c4f5b531
Deleted: sha256:5dacd61657a04251c284527270771b1876da13312c473d3d835dbf9bc008fefa
Deleted: sha256:a64066fc6baf315f0b75772d57276c2d9a39d0a64212fa06ad79260658cd901c
Deleted: sha256:9726cb616c768463fd08ea9f0f8f48a86d507c1922a0291a117031c424d51b28
Deleted: sha256:f0f1700d3ef0e9ea87df4d98e50322fe7760360f384e841c2282effcdb55947c
Deleted: sha256:199c51d9c7274c8fd48f73d9397ffb7023e46a2d2a50c0941197d7e6fecbac3b
Build step 'Execute shell' marked build as failure

Mime
View raw message