mesos-builds mailing list archives

Site index · List index
Message view « Date » · « Thread »
Top « Date » · « Thread »
From Apache Jenkins Server <jenk...@builds.apache.org>
Subject Build failed in Jenkins: Mesos-Buildbot » autotools,gcc,--verbose --enable-libevent --enable-ssl,GLOG_v=1 MESOS_VERBOSE=1,ubuntu:14.04,(docker||Hadoop)&&(!ubuntu-us1)&&(!ubuntu-eu2) #3562
Date Wed, 26 Apr 2017 05:44:04 GMT
See <https://builds.apache.org/job/Mesos-Buildbot/BUILDTOOL=autotools,COMPILER=gcc,CONFIGURATION=--verbose%20--enable-libevent%20--enable-ssl,ENVIRONMENT=GLOG_v=1%20MESOS_VERBOSE=1,OS=ubuntu%3A14.04,label_exp=(docker%7C%7CHadoop)&&(!ubuntu-us1)&&(!ubuntu-eu2)/3562/display/redirect?page=changes>

Changes:

[yujie.jay] Fixed docker fetcher 3xx redirect errors by header attached.

[yujie.jay] Fixed an ordering issue in 1.2.1 CHANGELOG.

[yujie.jay] Added MESOS-5172 to 1.2.1 CHANGELOG.

------------------------------------------
[...truncated 26.18 MB...]
I0426 05:43:58.771930 15443 provisioner.cpp:410] Provisioner recovery complete
I0426 05:43:58.772271 15439 slave.cpp:5550] Finished recovery
I0426 05:43:58.772701 15439 slave.cpp:5724] Querying resource estimator for oversubscribable
resources
I0426 05:43:58.772933 15444 slave.cpp:5738] Received oversubscribable resources {} from the
resource estimator
I0426 05:43:58.774621 15436 process.cpp:3704] Handling HTTP event for process 'slave(699)'
with path: '/slave(699)/monitor/statistics.json'
I0426 05:43:58.775637 15438 http.cpp:871] Authorizing principal 'test-principal' to GET the
'/monitor/statistics.json' endpoint
I0426 05:43:58.781150 15439 slave.cpp:803] Agent terminating
[       OK ] Endpoint/SlaveEndpointTest.AuthorizedRequest/1 (26 ms)
[ RUN      ] Endpoint/SlaveEndpointTest.AuthorizedRequest/2
I0426 05:43:58.790019 32527 containerizer.cpp:221] Using isolation: posix/cpu,posix/mem,filesystem/posix,network/cni
W0426 05:43:58.790472 32527 backend.cpp:76] Failed to create 'aufs' backend: AufsBackend requires
root privileges
W0426 05:43:58.790555 32527 backend.cpp:76] Failed to create 'bind' backend: BindBackend requires
root privileges
I0426 05:43:58.790592 32527 provisioner.cpp:249] Using default backend 'copy'
I0426 05:43:58.793138 15446 slave.cpp:211] Mesos agent started on (700)@172.17.0.2:45998
I0426 05:43:58.793185 15446 slave.cpp:212] Flags at startup: --acls="" --appc_simple_discovery_uri_prefix="http://"
--appc_store_dir="/tmp/mesos/store/appc" --authenticate_http_readonly="true" --authenticate_http_readwrite="true"
--authenticatee="crammd5" --authentication_backoff_factor="1secs" --authorizer="local" --cgroups_cpu_enable_pids_and_tids_count="false"
--cgroups_enable_cfs="false" --cgroups_hierarchy="/sys/fs/cgroup" --cgroups_limit_swap="false"
--cgroups_root="mesos" --container_disk_watch_interval="15secs" --containerizers="mesos" --credential="/tmp/Endpoint_SlaveEndpointTest_AuthorizedRequest_2_6s2Ukk/credential"
--default_role="*" --disk_watch_interval="1mins" --docker="docker" --docker_kill_orphans="true"
--docker_registry="https://registry-1.docker.io" --docker_remove_delay="6hrs" --docker_socket="/var/run/docker.sock"
--docker_stop_timeout="0ns" --docker_store_dir="/tmp/mesos/store/docker" --docker_volume_checkpoint_dir="/var/run/mesos/isolators/docker/volume"
--enforce_container_disk_quota="false" --executor_registration_timeout="1mins" --executor_shutdown_grace_period="5secs"
--fetcher_cache_dir="/tmp/Endpoint_SlaveEndpointTest_AuthorizedRequest_2_6s2Ukk/fetch" --fetcher_cache_size="2GB"
--frameworks_home="" --gc_delay="1weeks" --gc_disk_headroom="0.1" --hadoop_home="" --help="false"
--hostname_lookup="true" --http_authenticators="basic" --http_command_executor="false" --http_credentials="/tmp/Endpoint_SlaveEndpointTest_AuthorizedRequest_2_6s2Ukk/http_credentials"
--http_heartbeat_interval="30secs" --initialize_driver_logging="true" --isolation="posix/cpu,posix/mem"
--launcher="posix" --launcher_dir="/mesos/mesos-1.2.1/_build/src" --logbufsecs="0" --logging_level="INFO"
--max_completed_executors_per_framework="150" --oversubscribed_resources_interval="15secs"
--perf_duration="10secs" --perf_interval="1mins" --port="5051" --qos_correction_interval_min="0ns"
--quiet="false" --recover="reconnect" --recovery_timeout="15mins" --registration_backoff_factor="10ms"
--resources="cpus:2;gpus:0;mem:1024;disk:1024;ports:[31000-32000]" --revocable_cpu_low_priority="true"
--runtime_dir="/tmp/Endpoint_SlaveEndpointTest_AuthorizedRequest_2_6s2Ukk" --sandbox_directory="/mnt/mesos/sandbox"
--strict="true" --switch_user="true" --systemd_enable_support="true" --systemd_runtime_directory="/run/systemd/system"
--version="false" --work_dir="/tmp/Endpoint_SlaveEndpointTest_AuthorizedRequest_2_Z31Uga"
I0426 05:43:58.793715 15446 credentials.hpp:86] Loading credential for authentication from
'/tmp/Endpoint_SlaveEndpointTest_AuthorizedRequest_2_6s2Ukk/credential'
I0426 05:43:58.793871 15446 slave.cpp:354] Agent using credential for: test-principal
I0426 05:43:58.793896 15446 credentials.hpp:37] Loading credentials for authentication from
'/tmp/Endpoint_SlaveEndpointTest_AuthorizedRequest_2_6s2Ukk/http_credentials'
I0426 05:43:58.794123 15446 http.cpp:919] Using default 'basic' HTTP authenticator for realm
'mesos-agent-readonly'
I0426 05:43:58.794234 15446 http.cpp:919] Using default 'basic' HTTP authenticator for realm
'mesos-agent-readwrite'
I0426 05:43:58.795439 15446 slave.cpp:541] Agent resources: cpus(*):2; mem(*):1024; disk(*):1024;
ports(*):[31000-32000]
I0426 05:43:58.795511 15446 slave.cpp:549] Agent attributes: [  ]
I0426 05:43:58.795523 15446 slave.cpp:554] Agent hostname: d022c7e0cf65
I0426 05:43:58.795635 15441 status_update_manager.cpp:177] Pausing sending status updates
I0426 05:43:58.796703 15442 state.cpp:62] Recovering state from '/tmp/Endpoint_SlaveEndpointTest_AuthorizedRequest_2_Z31Uga/meta'
I0426 05:43:58.796921 15443 status_update_manager.cpp:203] Recovering status update manager
I0426 05:43:58.797291 15436 containerizer.cpp:600] Recovering containerizer
I0426 05:43:58.798599 15436 provisioner.cpp:410] Provisioner recovery complete
I0426 05:43:58.798928 15444 slave.cpp:5550] Finished recovery
I0426 05:43:58.799350 15444 slave.cpp:5724] Querying resource estimator for oversubscribable
resources
I0426 05:43:58.799547 15444 slave.cpp:5738] Received oversubscribable resources {} from the
resource estimator
I0426 05:43:58.801157 15439 process.cpp:3704] Handling HTTP event for process 'slave(700)'
with path: '/slave(700)/containers'
I0426 05:43:58.802286 15450 http.cpp:871] Authorizing principal 'test-principal' to GET the
'/containers' endpoint
I0426 05:43:58.804833 15437 slave.cpp:803] Agent terminating
[       OK ] Endpoint/SlaveEndpointTest.AuthorizedRequest/2 (22 ms)
[ RUN      ] Endpoint/SlaveEndpointTest.UnauthorizedRequest/0
I0426 05:43:58.812995 32527 containerizer.cpp:221] Using isolation: posix/cpu,posix/mem,filesystem/posix,network/cni
W0426 05:43:58.813401 32527 backend.cpp:76] Failed to create 'aufs' backend: AufsBackend requires
root privileges
W0426 05:43:58.813488 32527 backend.cpp:76] Failed to create 'bind' backend: BindBackend requires
root privileges
I0426 05:43:58.813529 32527 provisioner.cpp:249] Using default backend 'copy'
I0426 05:43:58.816283 15437 slave.cpp:211] Mesos agent started on (701)@172.17.0.2:45998
I0426 05:43:58.816305 15437 slave.cpp:212] Flags at startup: --acls="" --appc_simple_discovery_uri_prefix="http://"
--appc_store_dir="/tmp/mesos/store/appc" --authenticate_http_readonly="true" --authenticate_http_readwrite="true"
--authenticatee="crammd5" --authentication_backoff_factor="1secs" --authorizer="local" --cgroups_cpu_enable_pids_and_tids_count="false"
--cgroups_enable_cfs="false" --cgroups_hierarchy="/sys/fs/cgroup" --cgroups_limit_swap="false"
--cgroups_root="mesos" --container_disk_watch_interval="15secs" --containerizers="mesos" --credential="/tmp/Endpoint_SlaveEndpointTest_UnauthorizedRequest_0_mqyJNY/credential"
--default_role="*" --disk_watch_interval="1mins" --docker="docker" --docker_kill_orphans="true"
--docker_registry="https://registry-1.docker.io" --docker_remove_delay="6hrs" --docker_socket="/var/run/docker.sock"
--docker_stop_timeout="0ns" --docker_store_dir="/tmp/mesos/store/docker" --docker_volume_checkpoint_dir="/var/run/mesos/isolators/docker/volume"
--enforce_container_disk_quota="false" --executor_registration_timeout="1mins" --executor_shutdown_grace_period="5secs"
--fetcher_cache_dir="/tmp/Endpoint_SlaveEndpointTest_UnauthorizedRequest_0_mqyJNY/fetch" --fetcher_cache_size="2GB"
--frameworks_home="" --gc_delay="1weeks" --gc_disk_headroom="0.1" --hadoop_home="" --help="false"
--hostname_lookup="true" --http_authenticators="basic" --http_command_executor="false" --http_credentials="/tmp/Endpoint_SlaveEndpointTest_UnauthorizedRequest_0_mqyJNY/http_credentials"
--http_heartbeat_interval="30secs" --initialize_driver_logging="true" --isolation="posix/cpu,posix/mem"
--launcher="posix" --launcher_dir="/mesos/mesos-1.2.1/_build/src" --logbufsecs="0" --logging_level="INFO"
--max_completed_executors_per_framework="150" --oversubscribed_resources_interval="15secs"
--perf_duration="10secs" --perf_interval="1mins" --port="5051" --qos_correction_interval_min="0ns"
--quiet="false" --recover="reconnect" --recovery_timeout="15mins" --registration_backoff_factor="10ms"
--resources="cpus:2;gpus:0;mem:1024;disk:1024;ports:[31000-32000]" --revocable_cpu_low_priority="true"
--runtime_dir="/tmp/Endpoint_SlaveEndpointTest_UnauthorizedRequest_0_mqyJNY" --sandbox_directory="/mnt/mesos/sandbox"
--strict="true" --switch_user="true" --systemd_enable_support="true" --systemd_runtime_directory="/run/systemd/system"
--version="false" --work_dir="/tmp/Endpoint_SlaveEndpointTest_UnauthorizedRequest_0_X70YFO"
I0426 05:43:58.816856 15437 credentials.hpp:86] Loading credential for authentication from
'/tmp/Endpoint_SlaveEndpointTest_UnauthorizedRequest_0_mqyJNY/credential'
I0426 05:43:58.817060 15437 slave.cpp:354] Agent using credential for: test-principal
I0426 05:43:58.817080 15437 credentials.hpp:37] Loading credentials for authentication from
'/tmp/Endpoint_SlaveEndpointTest_UnauthorizedRequest_0_mqyJNY/http_credentials'
I0426 05:43:58.817309 15437 http.cpp:919] Using default 'basic' HTTP authenticator for realm
'mesos-agent-readonly'
I0426 05:43:58.817431 15437 http.cpp:919] Using default 'basic' HTTP authenticator for realm
'mesos-agent-readwrite'
I0426 05:43:58.818600 15437 slave.cpp:541] Agent resources: cpus(*):2; mem(*):1024; disk(*):1024;
ports(*):[31000-32000]
I0426 05:43:58.818673 15437 slave.cpp:549] Agent attributes: [  ]
I0426 05:43:58.818684 15437 slave.cpp:554] Agent hostname: d022c7e0cf65
I0426 05:43:58.818823 15446 status_update_manager.cpp:177] Pausing sending status updates
I0426 05:43:58.819996 15450 state.cpp:62] Recovering state from '/tmp/Endpoint_SlaveEndpointTest_UnauthorizedRequest_0_X70YFO/meta'
I0426 05:43:58.820332 15438 status_update_manager.cpp:203] Recovering status update manager
I0426 05:43:58.820528 15446 containerizer.cpp:600] Recovering containerizer
I0426 05:43:58.821826 15448 provisioner.cpp:410] Provisioner recovery complete
I0426 05:43:58.822175 15442 slave.cpp:5550] Finished recovery
I0426 05:43:58.822574 15442 slave.cpp:5724] Querying resource estimator for oversubscribable
resources
I0426 05:43:58.822860 15447 slave.cpp:5738] Received oversubscribable resources {} from the
resource estimator
I0426 05:43:58.824415 15451 process.cpp:3704] Handling HTTP event for process 'slave(701)'
with path: '/slave(701)/monitor/statistics'
I0426 05:43:58.825428 15437 http.cpp:871] Authorizing principal 'test-principal' to GET the
'/monitor/statistics' endpoint
I0426 05:43:58.827111 15450 slave.cpp:803] Agent terminating
[       OK ] Endpoint/SlaveEndpointTest.UnauthorizedRequest/0 (21 ms)
[ RUN      ] Endpoint/SlaveEndpointTest.UnauthorizedRequest/1
I0426 05:43:58.837582 32527 containerizer.cpp:221] Using isolation: posix/cpu,posix/mem,filesystem/posix,network/cni
W0426 05:43:58.838002 32527 backend.cpp:76] Failed to create 'aufs' backend: AufsBackend requires
root privileges
W0426 05:43:58.838096 32527 backend.cpp:76] Failed to create 'bind' backend: BindBackend requires
root privileges
I0426 05:43:58.838138 32527 provisioner.cpp:249] Using default backend 'copy'
I0426 05:43:58.840811 15441 slave.cpp:211] Mesos agent started on (702)@172.17.0.2:45998
I0426 05:43:58.840834 15441 slave.cpp:212] Flags at startup: --acls="" --appc_simple_discovery_uri_prefix="http://"
--appc_store_dir="/tmp/mesos/store/appc" --authenticate_http_readonly="true" --authenticate_http_readwrite="true"
--authenticatee="crammd5" --authentication_backoff_factor="1secs" --authorizer="local" --cgroups_cpu_enable_pids_and_tids_count="false"
--cgroups_enable_cfs="false" --cgroups_hierarchy="/sys/fs/cgroup" --cgroups_limit_swap="false"
--cgroups_root="mesos" --container_disk_watch_interval="15secs" --containerizers="mesos" --credential="/tmp/Endpoint_SlaveEndpointTest_UnauthorizedRequest_1_21OfwD/credential"
--default_role="*" --disk_watch_interval="1mins" --docker="docker" --docker_kill_orphans="true"
--docker_registry="https://registry-1.docker.io" --docker_remove_delay="6hrs" --docker_socket="/var/run/docker.sock"
--docker_stop_timeout="0ns" --docker_store_dir="/tmp/mesos/store/docker" --docker_volume_checkpoint_dir="/var/run/mesos/isolators/docker/volume"
--enforce_container_disk_quota="false" --executor_registration_timeout="1mins" --executor_shutdown_grace_period="5secs"
--fetcher_cache_dir="/tmp/Endpoint_SlaveEndpointTest_UnauthorizedRequest_1_21OfwD/fetch" --fetcher_cache_size="2GB"
--frameworks_home="" --gc_delay="1weeks" --gc_disk_headroom="0.1" --hadoop_home="" --help="false"
--hostname_lookup="true" --http_authenticators="basic" --http_command_executor="false" --http_credentials="/tmp/Endpoint_SlaveEndpointTest_UnauthorizedRequest_1_21OfwD/http_credentials"
--http_heartbeat_interval="30secs" --initialize_driver_logging="true" --isolation="posix/cpu,posix/mem"
--launcher="posix" --launcher_dir="/mesos/mesos-1.2.1/_build/src" --logbufsecs="0" --logging_level="INFO"
--max_completed_executors_per_framework="150" --oversubscribed_resources_interval="15secs"
--perf_duration="10secs" --perf_interval="1mins" --port="5051" --qos_correction_interval_min="0ns"
--quiet="false" --recover="reconnect" --recovery_timeout="15mins" --registration_backoff_factor="10ms"
--resources="cpus:2;gpus:0;mem:1024;disk:1024;ports:[31000-32000]" --revocable_cpu_low_priority="true"
--runtime_dir="/tmp/Endpoint_SlaveEndpointTest_UnauthorizedRequest_1_21OfwD" --sandbox_directory="/mnt/mesos/sandbox"
--strict="true" --switch_user="true" --systemd_enable_support="true" --systemd_runtime_directory="/run/systemd/system"
--version="false" --work_dir="/tmp/Endpoint_SlaveEndpointTest_UnauthorizedRequest_1_xttwkt"
I0426 05:43:58.841655 15441 credentials.hpp:86] Loading credential for authentication from
'/tmp/Endpoint_SlaveEndpointTest_UnauthorizedRequest_1_21OfwD/credential'
I0426 05:43:58.841809 15441 slave.cpp:354] Agent using credential for: test-principal
I0426 05:43:58.841832 15441 credentials.hpp:37] Loading credentials for authentication from
'/tmp/Endpoint_SlaveEndpointTest_UnauthorizedRequest_1_21OfwD/http_credentials'
I0426 05:43:58.842079 15441 http.cpp:919] Using default 'basic' HTTP authenticator for realm
'mesos-agent-readonly'
I0426 05:43:58.842202 15441 http.cpp:919] Using default 'basic' HTTP authenticator for realm
'mesos-agent-readwrite'
I0426 05:43:58.843281 15441 slave.cpp:541] Agent resources: cpus(*):2; mem(*):1024; disk(*):1024;
ports(*):[31000-32000]
I0426 05:43:58.843353 15441 slave.cpp:549] Agent attributes: [  ]
I0426 05:43:58.843364 15441 slave.cpp:554] Agent hostname: d022c7e0cf65
I0426 05:43:58.843505 15442 status_update_manager.cpp:177] Pausing sending status updates
I0426 05:43:58.844507 15439 state.cpp:62] Recovering state from '/tmp/Endpoint_SlaveEndpointTest_UnauthorizedRequest_1_xttwkt/meta'
I0426 05:43:58.844722 15436 status_update_manager.cpp:203] Recovering status update manager
I0426 05:43:58.844924 15447 containerizer.cpp:600] Recovering containerizer
I0426 05:43:58.846065 15436 provisioner.cpp:410] Provisioner recovery complete
I0426 05:43:58.846379 15441 slave.cpp:5550] Finished recovery
I0426 05:43:58.846770 15441 slave.cpp:5724] Querying resource estimator for oversubscribable
resources
I0426 05:43:58.847034 15441 slave.cpp:5738] Received oversubscribable resources {} from the
resource estimator
I0426 05:43:58.848600 15443 process.cpp:3704] Handling HTTP event for process 'slave(702)'
with path: '/slave(702)/monitor/statistics.json'
I0426 05:43:58.849575 15443 http.cpp:871] Authorizing principal 'test-principal' to GET the
'/monitor/statistics.json' endpoint
I0426 05:43:58.851163 15436 slave.cpp:803] Agent terminating
[       OK ] Endpoint/SlaveEndpointTest.UnauthorizedRequest/1 (22 ms)
[ RUN      ] Endpoint/SlaveEndpointTest.UnauthorizedRequest/2
I0426 05:43:58.859282 32527 containerizer.cpp:221] Using isolation: posix/cpu,posix/mem,filesystem/posix,network/cni
W0426 05:43:58.859674 32527 backend.cpp:76] Failed to create 'aufs' backend: AufsBackend requires
root privileges
W0426 05:43:58.859760 32527 backend.cpp:76] Failed to create 'bind' backend: BindBackend requires
root privileges
I0426 05:43:58.859794 32527 provisioner.cpp:249] Using default backend 'copy'
I0426 05:43:58.862398 15444 slave.cpp:211] Mesos agent started on (703)@172.17.0.2:45998
I0426 05:43:58.862423 15444 slave.cpp:212] Flags at startup: --acls="" --appc_simple_discovery_uri_prefix="http://"
--appc_store_dir="/tmp/mesos/store/appc" --authenticate_http_readonly="true" --authenticate_http_readwrite="true"
--authenticatee="crammd5" --authentication_backoff_factor="1secs" --authorizer="local" --cgroups_cpu_enable_pids_and_tids_count="false"
--cgroups_enable_cfs="false" --cgroups_hierarchy="/sys/fs/cgroup" --cgroups_limit_swap="false"
--cgroups_root="mesos" --container_disk_watch_interval="15secs" --containerizers="mesos" --credential="/tmp/Endpoint_SlaveEndpointTest_UnauthorizedRequest_2_63tkti/credential"
--default_role="*" --disk_watch_interval="1mins" --docker="docker" --docker_kill_orphans="true"
--docker_registry="https://registry-1.docker.io" --docker_remove_delay="6hrs" --docker_socket="/var/run/docker.sock"
--docker_stop_timeout="0ns" --docker_store_dir="/tmp/mesos/store/docker" --docker_volume_checkpoint_dir="/var/run/mesos/isolators/docker/volume"
--enforce_container_disk_quota="false" --executor_registration_timeout="1mins" --executor_shutdown_grace_period="5secs"
--fetcher_cache_dir="/tmp/Endpoint_SlaveEndpointTest_UnauthorizedRequest_2_63tkti/fetch" --fetcher_cache_size="2GB"
--frameworks_home="" --gc_delay="1weeks" --gc_disk_headroom="0.1" --hadoop_home="" --help="false"
--hostname_lookup="true" --http_authenticators="basic" --http_command_executor="false" --http_credentials="/tmp/Endpoint_SlaveEndpointTest_UnauthorizedRequest_2_63tkti/http_credentials"
--http_heartbeat_interval="30secs" --initialize_driver_logging="true" --isolation="posix/cpu,posix/mem"
--launcher="posix" --launcher_dir="/mesos/mesos-1.2.1/_build/src" --logbufsecs="0" --logging_level="INFO"
--max_completed_executors_per_framework="150" --oversubscribed_resources_interval="15secs"
--perf_duration="10secs" --perf_interval="1mins" --port="5051" --qos_correction_interval_min="0ns"
--quiet="false" --recover="reconnect" --recovery_timeout="15mins" --registration_backoff_factor="10ms"
--resources="cpus:2;gpus:0;mem:1024;disk:1024;ports:[31000-32000]" --revocable_cpu_low_priority="true"
--runtime_dir="/tmp/Endpoint_SlaveEndpointTest_UnauthorizedRequest_2_63tkti" --sandbox_directory="/mnt/mesos/sandbox"
--strict="true" --switch_user="true" --systemd_enable_support="true" --systemd_runtime_directory="/run/systemd/system"
--version="false" --work_dir="/tmp/Endpoint_SlaveEndpointTest_UnauthorizedRequest_2_1NH3d8"
I0426 05:43:58.862886 15444 credentials.hpp:86] Loading credential for authentication from
'/tmp/Endpoint_SlaveEndpointTest_UnauthorizedRequest_2_63tkti/credential'
I0426 05:43:58.863001 15444 slave.cpp:354] Agent using credential for: test-principal
I0426 05:43:58.863020 15444 credentials.hpp:37] Loading credentials for authentication from
'/tmp/Endpoint_SlaveEndpointTest_UnauthorizedRequest_2_63tkti/http_credentials'
I0426 05:43:58.863209 15444 http.cpp:919] Using default 'basic' HTTP authenticator for realm
'mesos-agent-readonly'
I0426 05:43:58.863312 15444 http.cpp:919] Using default 'basic' HTTP authenticator for realm
'mesos-agent-readwrite'
I0426 05:43:58.864397 15444 slave.cpp:541] Agent resources: cpus(*):2; mem(*):1024; disk(*):1024;
ports(*):[31000-32000]
I0426 05:43:58.864470 15444 slave.cpp:549] Agent attributes: [  ]
I0426 05:43:58.864480 15444 slave.cpp:554] Agent hostname: d022c7e0cf65
I0426 05:43:58.864593 15448 status_update_manager.cpp:177] Pausing sending status updates
I0426 05:43:58.865697 15448 state.cpp:62] Recovering state from '/tmp/Endpoint_SlaveEndpointTest_UnauthorizedRequest_2_1NH3d8/meta'
I0426 05:43:58.865931 15450 status_update_manager.cpp:203] Recovering status update manager
I0426 05:43:58.866109 15443 containerizer.cpp:600] Recovering containerizer
I0426 05:43:58.867374 15450 provisioner.cpp:410] Provisioner recovery complete
I0426 05:43:58.867743 15441 slave.cpp:5550] Finished recovery
I0426 05:43:58.868221 15441 slave.cpp:5724] Querying resource estimator for oversubscribable
resources
I0426 05:43:58.868451 15448 slave.cpp:5738] Received oversubscribable resources {} from the
resource estimator
I0426 05:43:58.870077 15439 process.cpp:3704] Handling HTTP event for process 'slave(703)'
with path: '/slave(703)/containers'
I0426 05:43:58.871109 15450 http.cpp:871] Authorizing principal 'test-principal' to GET the
'/containers' endpoint
I0426 05:43:58.872659 15451 slave.cpp:803] Agent terminating
[       OK ] Endpoint/SlaveEndpointTest.UnauthorizedRequest/2 (23 ms)
[ RUN      ] Endpoint/SlaveEndpointTest.NoAuthorizer/0
I0426 05:43:58.883178 32527 containerizer.cpp:221] Using isolation: posix/cpu,posix/mem,filesystem/posix,network/cni
W0426 05:43:58.883604 32527 backend.cpp:76] Failed to create 'aufs' backend: AufsBackend requires
root privileges
W0426 05:43:58.883694 32527 backend.cpp:76] Failed to create 'bind' backend: BindBackend requires
root privileges
I0426 05:43:58.883724 32527 provisioner.cpp:249] Using default backend 'copy'
I0426 05:43:58.885215 32527 cluster.cpp:446] Creating default 'local' authorizer
I0426 05:43:58.886692 15442 slave.cpp:211] Mesos agent started on (704)@172.17.0.2:45998
I0426 05:43:58.886714 15442 slave.cpp:212] Flags at startup: --acls="" --appc_simple_discovery_uri_prefix="http://"
--appc_store_dir="/tmp/mesos/store/appc" --authenticate_http_readonly="true" --authenticate_http_readwrite="true"
--authenticatee="crammd5" --authentication_backoff_factor="1secs" --authorizer="local" --cgroups_cpu_enable_pids_and_tids_count="false"
--cgroups_enable_cfs="false" --cgroups_hierarchy="/sys/fs/cgroup" --cgroups_limit_swap="false"
--cgroups_root="mesos" --container_disk_watch_interval="15secs" --containerizers="mesos" --credential="/tmp/Endpoint_SlaveEndpointTest_NoAuthorizer_0_CV0jFX/credential"
--default_role="*" --disk_watch_interval="1mins" --docker="docker" --docker_kill_orphans="true"
--docker_registry="https://registry-1.docker.io" --docker_remove_delay="6hrs" --docker_socket="/var/run/docker.sock"
--docker_stop_timeout="0ns" --docker_store_dir="/tmp/mesos/store/docker" --docker_volume_checkpoint_dir="/var/run/mesos/isolators/docker/volume"
--enforce_container_disk_quota="false" --executor_registration_timeout="1mins" --executor_shutdown_grace_period="5secs"
--fetcher_cache_dir="/tmp/Endpoint_SlaveEndpointTest_NoAuthorizer_0_CV0jFX/fetch" --fetcher_cache_size="2GB"
--frameworks_home="" --gc_delay="1weeks" --gc_disk_headroom="0.1" --hadoop_home="" --help="false"
--hostname_lookup="true" --http_authenticators="basic" --http_command_executor="false" --http_credentials="/tmp/Endpoint_SlaveEndpointTest_NoAuthorizer_0_CV0jFX/http_credentials"
--http_heartbeat_interval="30secs" --initialize_driver_logging="true" --isolation="posix/cpu,posix/mem"
--launcher="posix" --launcher_dir="/mesos/mesos-1.2.1/_build/src" --logbufsecs="0" --logging_level="INFO"
--max_completed_executors_per_framework="150" --oversubscribed_resources_interval="15secs"
--perf_duration="10secs" --perf_interval="1mins" --port="5051" --qos_correction_interval_min="0ns"
--quiet="false" --recover="reconnect" --recovery_timeout="15mins" --registration_backoff_factor="10ms"
--resources="cpus:2;gpus:0;mem:1024;disk:1024;ports:[31000-32000]" --revocable_cpu_low_priority="true"
--runtime_dir="/tmp/Endpoint_SlaveEndpointTest_NoAuthorizer_0_CV0jFX" --sandbox_directory="/mnt/mesos/sandbox"
--strict="true" --switch_user="true" --systemd_enable_support="true" --systemd_runtime_directory="/run/systemd/system"
--version="false" --work_dir="/tmp/Endpoint_SlaveEndpointTest_NoAuthorizer_0_VlpemN"
I0426 05:43:58.887485 15442 credentials.hpp:86] Loading credential for authentication from
'/tmp/Endpoint_SlaveEndpointTest_NoAuthorizer_0_CV0jFX/credential'
I0426 05:43:58.887651 15442 slave.cpp:354] Agent using credential for: test-principal
I0426 05:43:58.887676 15442 credentials.hpp:37] Loading credentials for authentication from
'/tmp/Endpoint_SlaveEndpointTest_NoAuthorizer_0_CV0jFX/http_credentials'
I0426 05:43:58.887919 15442 http.cpp:919] Using default 'basic' HTTP authenticator for realm
'mesos-agent-readonly'
I0426 05:43:58.888025 15442 http.cpp:919] Using default 'basic' HTTP authenticator for realm
'mesos-agent-readwrite'
I0426 05:43:58.889081 15442 slave.cpp:541] Agent resources: cpus(*):2; mem(*):1024; disk(*):1024;
ports(*):[31000-32000]
I0426 05:43:58.889153 15442 slave.cpp:549] Agent attributes: [  ]
I0426 05:43:58.889165 15442 slave.cpp:554] Agent hostname: d022c7e0cf65
I0426 05:43:58.889276 15439 status_update_manager.cpp:177] Pausing sending status updates
I0426 05:43:58.890311 15444 state.cpp:62] Recovering state from '/tmp/Endpoint_SlaveEndpointTest_NoAuthorizer_0_VlpemN/meta'
I0426 05:43:58.890573 15443 status_update_manager.cpp:203] Recovering status update manager
I0426 05:43:58.890790 15436 containerizer.cpp:600] Recovering containerizer
I0426 05:43:58.891871 15448 provisioner.cpp:410] Provisioner recovery complete
I0426 05:43:58.892200 15443 slave.cpp:5550] Finished recovery
I0426 05:43:58.892609 15443 slave.cpp:5724] Querying resource estimator for oversubscribable
resources
I0426 05:43:58.892815 15437 slave.cpp:5738] Received oversubscribable resources {} from the
resource estimator
I0426 05:43:58.894466 15444 process.cpp:3704] Handling HTTP event for process 'slave(704)'
with path: '/slave(704)/monitor/statistics'
I0426 05:43:58.895478 15444 http.cpp:871] Authorizing principal 'test-principal' to GET the
'/monitor/statistics' endpoint
I0426 05:43:58.897891 15443 slave.cpp:803] Agent terminating
[       OK ] Endpoint/SlaveEndpointTest.NoAuthorizer/0 (24 ms)
[ RUN      ] Endpoint/SlaveEndpointTest.NoAuthorizer/1
I0426 05:43:58.906685 32527 containerizer.cpp:221] Using isolation: posix/cpu,posix/mem,filesystem/posix,network/cni
W0426 05:43:58.907089 32527 backend.cpp:76] Failed to create 'aufs' backend: AufsBackend requires
root privileges
W0426 05:43:58.907181 32527 backend.cpp:76] Failed to create 'bind' backend: BindBackend requires
root privileges
I0426 05:43:58.907222 32527 provisioner.cpp:249] Using default backend 'copy'
I0426 05:43:58.908499 32527 cluster.cpp:446] Creating default 'local' authorizer
I0426 05:43:58.909853 15451 slave.cpp:211] Mesos agent started on (705)@172.17.0.2:45998
I0426 05:43:58.909873 15451 slave.cpp:212] Flags at startup: --acls="" --appc_simple_discovery_uri_prefix="http://"
--appc_store_dir="/tmp/mesos/store/appc" --authenticate_http_readonly="true" --authenticate_http_readwrite="true"
--authenticatee="crammd5" --authentication_backoff_factor="1secs" --authorizer="local" --cgroups_cpu_enable_pids_and_tids_count="false"
--cgroups_enable_cfs="false" --cgroups_hierarchy="/sys/fs/cgroup" --cgroups_limit_swap="false"
--cgroups_root="mesos" --container_disk_watch_interval="15secs" --containerizers="mesos" --credential="/tmp/Endpoint_SlaveEndpointTest_NoAuthorizer_1_ofCO6C/credential"
--default_role="*" --disk_watch_interval="1mins" --docker="docker" --docker_kill_orphans="true"
--docker_registry="https://registry-1.docker.io" --docker_remove_delay="6hrs" --docker_socket="/var/run/docker.sock"
--docker_stop_timeout="0ns" --docker_store_dir="/tmp/mesos/store/docker" --docker_volume_checkpoint_dir="/var/run/mesos/isolators/docker/volume"
--enforce_container_disk_quota="false" --executor_registration_timeout="1mins" --executor_shutdown_grace_period="5secs"
--fetcher_cache_dir="/tmp/Endpoint_SlaveEndpointTest_NoAuthorizer_1_ofCO6C/fetch" --fetcher_cache_size="2GB"
--frameworks_home="" --gc_delay="1weeks" --gc_disk_headroom="0.1" --hadoop_home="" --help="false"
--hostname_lookup="true" --http_authenticators="basic" --http_command_executor="false" --http_credentials="/tmp/Endpoint_SlaveEndpointTest_NoAuthorizer_1_ofCO6C/http_credentials"
--http_heartbeat_interval="30secs" --initialize_driver_logging="true" --isolation="posix/cpu,posix/mem"
--launcher="posix" --launcher_dir="/mesos/mesos-1.2.1/_build/src" --logbufsecs="0" --logging_level="INFO"
--max_completed_executors_per_framework="150" --oversubscribed_resources_interval="15secs"
--perf_duration="10secs" --perf_interval="1mins" --port="5051" --qos_correction_interval_min="0ns"
--quiet="false" --recover="reconnect" --recovery_timeout="15mins" --registration_backoff_factor="10ms"
--resources="cpus:2;gpus:0;mem:1024;disk:1024;ports:[31000-32000]" --revocable_cpu_low_priority="true"
--runtime_dir="/tmp/Endpoint_SlaveEndpointTest_NoAuthorizer_1_ofCO6C" --sandbox_directory="/mnt/mesos/sandbox"
--strict="true" --switch_user="true" --systemd_enable_support="true" --systemd_runtime_directory="/run/systemd/system"
--version="false" --work_dir="/tmp/Endpoint_SlaveEndpointTest_NoAuthorizer_1_lFaTJs"
I0426 05:43:58.910404 15451 credentials.hpp:86] Loading credential for authentication from
'/tmp/Endpoint_SlaveEndpointTest_NoAuthorizer_1_ofCO6C/credential'
I0426 05:43:58.910573 15451 slave.cpp:354] Agent using credential for: test-principal
I0426 05:43:58.910603 15451 credentials.hpp:37] Loading credentials for authentication from
'/tmp/Endpoint_SlaveEndpointTest_NoAuthorizer_1_ofCO6C/http_credentials'
I0426 05:43:58.910850 15451 http.cpp:919] Using default 'basic' HTTP authenticator for realm
'mesos-agent-readonly'
I0426 05:43:58.910993 15451 http.cpp:919] Using default 'basic' HTTP authenticator for realm
'mesos-agent-readwrite'
I0426 05:43:58.912101 15451 slave.cpp:541] Agent resources: cpus(*):2; mem(*):1024; disk(*):1024;
ports(*):[31000-32000]
I0426 05:43:58.912174 15451 slave.cpp:549] Agent attributes: [  ]
I0426 05:43:58.912185 15451 slave.cpp:554] Agent hostname: d022c7e0cf65
I0426 05:43:58.912293 15437 status_update_manager.cpp:177] Pausing sending status updates
I0426 05:43:58.913404 15443 state.cpp:62] Recovering state from '/tmp/Endpoint_SlaveEndpointTest_NoAuthorizer_1_lFaTJs/meta'
I0426 05:43:58.913725 15449 status_update_manager.cpp:203] Recovering status update manager
I0426 05:43:58.913980 15450 containerizer.cpp:600] Recovering containerizer
I0426 05:43:58.915120 15448 provisioner.cpp:410] Provisioner recovery complete
I0426 05:43:58.915441 15440 slave.cpp:5550] Finished recovery
I0426 05:43:58.915968 15440 slave.cpp:5724] Querying resource estimator for oversubscribable
resources
I0426 05:43:58.916213 15450 slave.cpp:5738] Received oversubscribable resources {} from the
resource estimator
I0426 05:43:58.917742 15450 process.cpp:3704] Handling HTTP event for process 'slave(705)'
with path: '/slave(705)/monitor/statistics.json'
I0426 05:43:58.918740 15442 http.cpp:871] Authorizing principal 'test-principal' to GET the
'/monitor/statistics.json' endpoint
I0426 05:43:58.921555 15447 slave.cpp:803] Agent terminating
[       OK ] Endpoint/SlaveEndpointTest.NoAuthorizer/1 (23 ms)
[ RUN      ] Endpoint/SlaveEndpointTest.NoAuthorizer/2
I0426 05:43:58.929780 32527 containerizer.cpp:221] Using isolation: posix/cpu,posix/mem,filesystem/posix,network/cni
W0426 05:43:58.930164 32527 backend.cpp:76] Failed to create 'aufs' backend: AufsBackend requires
root privileges
W0426 05:43:58.930246 32527 backend.cpp:76] Failed to create 'bind' backend: BindBackend requires
root privileges
I0426 05:43:58.930275 32527 provisioner.cpp:249] Using default backend 'copy'
I0426 05:43:58.931529 32527 cluster.cpp:446] Creating default 'local' authorizer
I0426 05:43:58.932904 15442 slave.cpp:211] Mesos agent started on (706)@172.17.0.2:45998
I0426 05:43:58.932925 15442 slave.cpp:212] Flags at startup: --acls="" --appc_simple_discovery_uri_prefix="http://"
--appc_store_dir="/tmp/mesos/store/appc" --authenticate_http_readonly="true" --authenticate_http_readwrite="true"
--authenticatee="crammd5" --authentication_backoff_factor="1secs" --authorizer="local" --cgroups_cpu_enable_pids_and_tids_count="false"
--cgroups_enable_cfs="false" --cgroups_hierarchy="/sys/fs/cgroup" --cgroups_limit_swap="false"
--cgroups_root="mesos" --container_disk_watch_interval="15secs" --containerizers="mesos" --credential="/tmp/Endpoint_SlaveEndpointTest_NoAuthorizer_2_iZTkNi/credential"
--default_role="*" --disk_watch_interval="1mins" --docker="docker" --docker_kill_orphans="true"
--docker_registry="https://registry-1.docker.io" --docker_remove_delay="6hrs" --docker_socket="/var/run/docker.sock"
--docker_stop_timeout="0ns" --docker_store_dir="/tmp/mesos/store/docker" --docker_volume_checkpoint_dir="/var/run/mesos/isolators/docker/volume"
--enforce_container_disk_quota="false" --executor_registration_timeout="1mins" --executor_shutdown_grace_period="5secs"
--fetcher_cache_dir="/tmp/Endpoint_SlaveEndpointTest_NoAuthorizer_2_iZTkNi/fetch" --fetcher_cache_size="2GB"
--frameworks_home="" --gc_delay="1weeks" --gc_disk_headroom="0.1" --hadoop_home="" --help="false"
--hostname_lookup="true" --http_authenticators="basic" --http_command_executor="false" --http_credentials="/tmp/Endpoint_SlaveEndpointTest_NoAuthorizer_2_iZTkNi/http_credentials"
--http_heartbeat_interval="30secs" --initialize_driver_logging="true" --isolation="posix/cpu,posix/mem"
--launcher="posix" --launcher_dir="/mesos/mesos-1.2.1/_build/src" --logbufsecs="0" --logging_level="INFO"
--max_completed_executors_per_framework="150" --oversubscribed_resources_interval="15secs"
--perf_duration="10secs" --perf_interval="1mins" --port="5051" --qos_correction_interval_min="0ns"
--quiet="false" --recover="reconnect" --recovery_timeout="15mins" --registration_backoff_factor="10ms"
--resources="cpus:2;gpus:0;mem:1024;disk:1024;ports:[31000-32000]" --revocable_cpu_low_priority="true"
--runtime_dir="/tmp/Endpoint_SlaveEndpointTest_NoAuthorizer_2_iZTkNi" --sandbox_directory="/mnt/mesos/sandbox"
--strict="true" --switch_user="true" --systemd_enable_support="true" --systemd_runtime_directory="/run/systemd/system"
--version="false" --work_dir="/tmp/Endpoint_SlaveEndpointTest_NoAuthorizer_2_zMcFm8"
I0426 05:43:58.933529 15442 credentials.hpp:86] Loading credential for authentication from
'/tmp/Endpoint_SlaveEndpointTest_NoAuthorizer_2_iZTkNi/credential'
I0426 05:43:58.933663 15442 slave.cpp:354] Agent using credential for: test-principal
I0426 05:43:58.933682 15442 credentials.hpp:37] Loading credentials for authentication from
'/tmp/Endpoint_SlaveEndpointTest_NoAuthorizer_2_iZTkNi/http_credentials'
I0426 05:43:58.933882 15442 http.cpp:919] Using default 'basic' HTTP authenticator for realm
'mesos-agent-readonly'
I0426 05:43:58.933995 15442 http.cpp:919] Using default 'basic' HTTP authenticator for realm
'mesos-agent-readwrite'
I0426 05:43:58.935029 15442 slave.cpp:541] Agent resources: cpus(*):2; mem(*):1024; disk(*):1024;
ports(*):[31000-32000]
I0426 05:43:58.935102 15442 slave.cpp:549] Agent attributes: [  ]
I0426 05:43:58.935113 15442 slave.cpp:554] Agent hostname: d022c7e0cf65
I0426 05:43:58.935307 15441 status_update_manager.cpp:177] Pausing sending status updates
I0426 05:43:58.936334 15446 state.cpp:62] Recovering state from '/tmp/Endpoint_SlaveEndpointTest_NoAuthorizer_2_zMcFm8/meta'
I0426 05:43:58.936591 15449 status_update_manager.cpp:203] Recovering status update manager
I0426 05:43:58.936795 15439 containerizer.cpp:600] Recovering containerizer
I0426 05:43:58.938462 15439 provisioner.cpp:410] Provisioner recovery complete
I0426 05:43:58.938858 15451 slave.cpp:5550] Finished recovery
I0426 05:43:58.939316 15451 slave.cpp:5724] Querying resource estimator for oversubscribable
resources
I0426 05:43:58.939625 15445 slave.cpp:5738] Received oversubscribable resources {} from the
resource estimator
I0426 05:43:58.941442 15441 process.cpp:3704] Handling HTTP event for process 'slave(706)'
with path: '/slave(706)/containers'
I0426 05:43:58.942545 15442 http.cpp:871] Authorizing principal 'test-principal' to GET the
'/containers' endpoint
I0426 05:43:58.945283 15442 slave.cpp:803] Agent terminating
[       OK ] Endpoint/SlaveEndpointTest.NoAuthorizer/2 (24 ms)
[----------] 9 tests from Endpoint/SlaveEndpointTest (214 ms total)

[----------] Global test environment tear-down
[==========] 1498 tests from 168 test cases ran. (554941 ms total)
[  PASSED  ] 1496 tests.
[  FAILED  ] 2 tests, listed below:
[  FAILED  ] ProvisionerDockerLocalStoreTest.MetadataManagerInitialization
[  FAILED  ] ProvisionerDockerLocalStoreTest.MissingLayer

 2 FAILED TESTS
  YOU HAVE 11 DISABLED TESTS

make[4]: *** [check-local] Error 1
make[4]: Leaving directory `/mesos/mesos-1.2.1/_build/src'
make[3]: *** [check-am] Error 2
make[3]: Leaving directory `/mesos/mesos-1.2.1/_build/src'
make[2]: *** [check] Error 2
make[2]: Leaving directory `/mesos/mesos-1.2.1/_build/src'
make[1]: *** [check-recursive] Error 1
make[1]: Leaving directory `/mesos/mesos-1.2.1/_build'
make: *** [distcheck] Error 1
+ docker rmi mesos-1493181932-21664
Untagged: mesos-1493181932-21664:latest
Deleted: sha256:c98a5ae147963119837b0c77c096b7bc75d4f0d7ac8dba62aeff4a9e583b28d1
Deleted: sha256:7c516b0f490f5de5a3f631e97e73177c9441bd5b9abdbae69e43993c90e1c594
Deleted: sha256:03100d028b93881ff725235fb682727d798d15dc32b3772aa2b1d46055f5d9fe
Deleted: sha256:7d9c6523732053d7ec02db83e823d38cb5af7d873003ce6780ea2f9c2d735931
Deleted: sha256:525286198ec556d96e33dca25b9e547793a84c983c8655454812db976c9c2134
Deleted: sha256:2998b4dd20c13f6a6dad7b4678da8b3f5ddf6dbf5d2ac82b78ac8c59670fba35
Deleted: sha256:327f7397f6a0a0c6b5e7b862d2499a80a6c2d2a77124b8564cacdfec3d859872
Deleted: sha256:3acf7bc455ef157dc5eee0f8fef0dbe8ad65ea3fe397aceb516be82107cc3082
Deleted: sha256:3311aef5e0d0be6397c6d53e7d09d53fdaab45e16d86ae6f1e1c17a36bf8f8bc
Deleted: sha256:52220c7da5ba92afbe5894ec5dc2ef914b61eb77e279a9c8e40b0ab5d442b195
Deleted: sha256:3b9137345b7d1d835e4c8d9f7a303fdc0cabe10618e213ebf99d7c4244d6e9bd
Deleted: sha256:007a2ad895f4379925a24ee268f2ec58ce288345fd2e504da817601667c8b787
Deleted: sha256:3226f34f365963c8e0f9aaedc6dd48941a703fac4e537e96754a29cd699b1d1f
Deleted: sha256:99d132da60c4904146ba9a7f7231d40f8aecc391c7604b20d965305ab50138ee
Deleted: sha256:42c9602ab1eebcc25290e4f533036cab9d6a4de969820eaabb73384094d87f4b
Deleted: sha256:deb390c333757b2cb8918963ac2d0fd275228f4f38e9d124df4d09cd45c1d051
Deleted: sha256:3288ee13c0624d90cad6940a942c33000b1d6396b37c8b52e49c67a0c6545ee4
Deleted: sha256:c98b4517632b268d1daab17fa526347b1e546287189f4d50bdae9ac7c765282b
Deleted: sha256:c9ba18b4b1810c99481d2f632b3899d20e9dd194ea665938fecab7a0e87c9107
Deleted: sha256:8a717f7e94ea418b6bdb3bf841e950269d6963c7fa080590265253069264ad0a
Deleted: sha256:22a72b7306a345ca5a0848066fc6cfcf5753254516896b22198e90205ce2e1ce
Deleted: sha256:f09ae99242c79aac8d0996748168522e41ad1990a58ff4fc2e71bc0788ae33e1
Deleted: sha256:b0a03eb544af88f3c1a51a28167d5d5f810db2501b30796c250385d2255b07e3
Deleted: sha256:08e9d89fd4d11162096dd73199f085ff47a0e7dcba973e877bb88479446c0693
Build step 'Execute shell' marked build as failure
Not sending mail to unregistered user yujie.jay@gmail.com

Mime
View raw message