mesos-builds mailing list archives

Site index · List index
Message view « Date » · « Thread »
Top « Date » · « Thread »
From Apache Jenkins Server <jenk...@builds.apache.org>
Subject Build failed in Jenkins: Mesos-Buildbot » cmake,clang,--verbose --enable-libevent --enable-ssl,GLOG_v=1 MESOS_VERBOSE=1,ubuntu:14.04,(docker||Hadoop)&&(!ubuntu-us1)&&(!ubuntu-eu2) #3545
Date Thu, 20 Apr 2017 01:25:45 GMT
See <https://builds.apache.org/job/Mesos-Buildbot/BUILDTOOL=cmake,COMPILER=clang,CONFIGURATION=--verbose%20--enable-libevent%20--enable-ssl,ENVIRONMENT=GLOG_v=1%20MESOS_VERBOSE=1,OS=ubuntu%3A14.04,label_exp=(docker%7C%7CHadoop)&&(!ubuntu-us1)&&(!ubuntu-eu2)/3545/display/redirect?page=changes>

Changes:

[yujie.jay] Added MESOS-7346 to 1.2.1 CHANGELOG.

[bmahler] Removed unnecessary Registry copying to improve performance.

[neil.conway] Remove unnecessary hashmap lookups.

------------------------------------------
[...truncated 25.74 MB...]
I0420 01:25:38.511204 31569 slave.cpp:6145] Querying resource estimator for oversubscribable
resources
I0420 01:25:38.511346 31569 slave.cpp:6159] Received oversubscribable resources {} from the
resource estimator
I0420 01:25:38.512418 31563 process.cpp:3722] Handling HTTP event for process 'slave(727)'
with path: '/slave(727)/containers'
I0420 01:25:38.512878 31563 http.cpp:1115] HTTP GET for /slave(727)/containers from 172.17.0.3:60725
I0420 01:25:38.512924 31563 http.cpp:936] Authorizing principal 'test-principal' to GET the
'/containers' endpoint
I0420 01:25:38.514755 25996 slave.cpp:790] Agent terminating
[       OK ] Endpoint/SlaveEndpointTest.AuthorizedRequest/2 (13 ms)
[ RUN      ] Endpoint/SlaveEndpointTest.UnauthorizedRequest/0
I0420 01:25:38.519778 25996 containerizer.cpp:221] Using isolation: posix/cpu,posix/mem,filesystem/posix,network/cni
W0420 01:25:38.520100 25996 backend.cpp:76] Failed to create 'aufs' backend: AufsBackend requires
root privileges
W0420 01:25:38.520159 25996 backend.cpp:76] Failed to create 'bind' backend: BindBackend requires
root privileges
I0420 01:25:38.520176 25996 provisioner.cpp:249] Using default backend 'copy'
I0420 01:25:38.521824 31566 slave.cpp:225] Mesos agent started on (728)@172.17.0.3:52576
I0420 01:25:38.521852 31566 slave.cpp:226] Flags at startup: --acls="" --appc_simple_discovery_uri_prefix="http://"
--appc_store_dir="/tmp/mesos/store/appc" --authenticate_http_executors="true" --authenticate_http_readonly="true"
--authenticate_http_readwrite="true" --authenticatee="crammd5" --authentication_backoff_factor="1secs"
--authorizer="local" --cgroups_cpu_enable_pids_and_tids_count="false" --cgroups_enable_cfs="false"
--cgroups_hierarchy="/sys/fs/cgroup" --cgroups_limit_swap="false" --cgroups_root="mesos" --container_disk_watch_interval="15secs"
--containerizers="mesos" --credential="/tmp/Endpoint_SlaveEndpointTest_UnauthorizedRequest_0_6181JK/credential"
--default_role="*" --disk_watch_interval="1mins" --docker="docker" --docker_kill_orphans="true"
--docker_registry="https://registry-1.docker.io" --docker_remove_delay="6hrs" --docker_socket="/var/run/docker.sock"
--docker_stop_timeout="0ns" --docker_store_dir="/tmp/mesos/store/docker" --docker_volume_checkpoint_dir="/var/run/mesos/isolators/docker/volume"
--enforce_container_disk_quota="false" --executor_registration_timeout="1mins" --executor_secret_key="/tmp/Endpoint_SlaveEndpointTest_UnauthorizedRequest_0_6181JK/executor_secret_key"
--executor_shutdown_grace_period="5secs" --fetcher_cache_dir="/tmp/Endpoint_SlaveEndpointTest_UnauthorizedRequest_0_6181JK/fetch"
--fetcher_cache_size="2GB" --frameworks_home="" --gc_delay="1weeks" --gc_disk_headroom="0.1"
--hadoop_home="" --help="false" --hostname_lookup="true" --http_command_executor="false" --http_credentials="/tmp/Endpoint_SlaveEndpointTest_UnauthorizedRequest_0_6181JK/http_credentials"
--http_heartbeat_interval="30secs" --initialize_driver_logging="true" --isolation="posix/cpu,posix/mem"
--launcher="posix" --launcher_dir="/mesos/build/src" --logbufsecs="0" --logging_level="INFO"
--max_completed_executors_per_framework="150" --oversubscribed_resources_interval="15secs"
--perf_duration="10secs" --perf_interval="1mins" --port="5051" --qos_correction_interval_min="0ns"
--quiet="false" --recover="reconnect" --recovery_timeout="15mins" --registration_backoff_factor="10ms"
--resources="cpus:2;gpus:0;mem:1024;disk:1024;ports:[31000-32000]" --revocable_cpu_low_priority="true"
--runtime_dir="/tmp/Endpoint_SlaveEndpointTest_UnauthorizedRequest_0_6181JK" --sandbox_directory="/mnt/mesos/sandbox"
--strict="true" --switch_user="true" --systemd_enable_support="true" --systemd_runtime_directory="/run/systemd/system"
--version="false" --work_dir="/tmp/Endpoint_SlaveEndpointTest_UnauthorizedRequest_0_tsJGVY"
I0420 01:25:38.522358 31566 credentials.hpp:86] Loading credential for authentication from
'/tmp/Endpoint_SlaveEndpointTest_UnauthorizedRequest_0_6181JK/credential'
I0420 01:25:38.522568 31566 slave.cpp:258] Agent using credential for: test-principal
I0420 01:25:38.522583 31566 credentials.hpp:37] Loading credentials for authentication from
'/tmp/Endpoint_SlaveEndpointTest_UnauthorizedRequest_0_6181JK/http_credentials'
I0420 01:25:38.522838 31566 http.cpp:975] Creating default 'basic' HTTP authenticator for
realm 'mesos-agent-executor'
I0420 01:25:38.523012 31566 http.cpp:996] Creating default 'jwt' HTTP authenticator for realm
'mesos-agent-executor'
I0420 01:25:38.523099 31566 http.cpp:975] Creating default 'basic' HTTP authenticator for
realm 'mesos-agent-readonly'
I0420 01:25:38.523260 31566 http.cpp:996] Creating default 'jwt' HTTP authenticator for realm
'mesos-agent-readonly'
I0420 01:25:38.523551 31566 http.cpp:975] Creating default 'basic' HTTP authenticator for
realm 'mesos-agent-readwrite'
I0420 01:25:38.523597 31566 http.cpp:996] Creating default 'jwt' HTTP authenticator for realm
'mesos-agent-readwrite'
I0420 01:25:38.524274 31566 slave.cpp:525] Agent resources: cpus(*):2; mem(*):1024; disk(*):1024;
ports(*):[31000-32000]
I0420 01:25:38.524310 31566 slave.cpp:533] Agent attributes: [  ]
I0420 01:25:38.524318 31566 slave.cpp:538] Agent hostname: 88762a063bb6
I0420 01:25:38.524747 31566 status_update_manager.cpp:177] Pausing sending status updates
I0420 01:25:38.525023 31573 state.cpp:62] Recovering state from '/tmp/Endpoint_SlaveEndpointTest_UnauthorizedRequest_0_tsJGVY/meta'
I0420 01:25:38.525192 31573 status_update_manager.cpp:203] Recovering status update manager
I0420 01:25:38.525311 31573 containerizer.cpp:608] Recovering containerizer
I0420 01:25:38.525794 31573 provisioner.cpp:410] Provisioner recovery complete
I0420 01:25:38.525935 31573 slave.cpp:5963] Finished recovery
I0420 01:25:38.526374 31573 slave.cpp:6145] Querying resource estimator for oversubscribable
resources
I0420 01:25:38.526553 31573 slave.cpp:6159] Received oversubscribable resources {} from the
resource estimator
I0420 01:25:38.527875 31573 process.cpp:3722] Handling HTTP event for process 'slave(728)'
with path: '/slave(728)/monitor/statistics'
I0420 01:25:38.528623 31570 http.cpp:1115] HTTP GET for /slave(728)/monitor/statistics from
172.17.0.3:60726
I0420 01:25:38.528669 31570 http.cpp:936] Authorizing principal 'test-principal' to GET the
'/monitor/statistics' endpoint
I0420 01:25:38.530455 25996 slave.cpp:790] Agent terminating
[       OK ] Endpoint/SlaveEndpointTest.UnauthorizedRequest/0 (15 ms)
[ RUN      ] Endpoint/SlaveEndpointTest.UnauthorizedRequest/1
I0420 01:25:38.536738 25996 containerizer.cpp:221] Using isolation: posix/cpu,posix/mem,filesystem/posix,network/cni
W0420 01:25:38.537103 25996 backend.cpp:76] Failed to create 'aufs' backend: AufsBackend requires
root privileges
W0420 01:25:38.537154 25996 backend.cpp:76] Failed to create 'bind' backend: BindBackend requires
root privileges
I0420 01:25:38.537173 25996 provisioner.cpp:249] Using default backend 'copy'
I0420 01:25:38.538482 31560 slave.cpp:225] Mesos agent started on (729)@172.17.0.3:52576
I0420 01:25:38.538630 31560 slave.cpp:226] Flags at startup: --acls="" --appc_simple_discovery_uri_prefix="http://"
--appc_store_dir="/tmp/mesos/store/appc" --authenticate_http_executors="true" --authenticate_http_readonly="true"
--authenticate_http_readwrite="true" --authenticatee="crammd5" --authentication_backoff_factor="1secs"
--authorizer="local" --cgroups_cpu_enable_pids_and_tids_count="false" --cgroups_enable_cfs="false"
--cgroups_hierarchy="/sys/fs/cgroup" --cgroups_limit_swap="false" --cgroups_root="mesos" --container_disk_watch_interval="15secs"
--containerizers="mesos" --credential="/tmp/Endpoint_SlaveEndpointTest_UnauthorizedRequest_1_LdBs8P/credential"
--default_role="*" --disk_watch_interval="1mins" --docker="docker" --docker_kill_orphans="true"
--docker_registry="https://registry-1.docker.io" --docker_remove_delay="6hrs" --docker_socket="/var/run/docker.sock"
--docker_stop_timeout="0ns" --docker_store_dir="/tmp/mesos/store/docker" --docker_volume_checkpoint_dir="/var/run/mesos/isolators/docker/volume"
--enforce_container_disk_quota="false" --executor_registration_timeout="1mins" --executor_secret_key="/tmp/Endpoint_SlaveEndpointTest_UnauthorizedRequest_1_LdBs8P/executor_secret_key"
--executor_shutdown_grace_period="5secs" --fetcher_cache_dir="/tmp/Endpoint_SlaveEndpointTest_UnauthorizedRequest_1_LdBs8P/fetch"
--fetcher_cache_size="2GB" --frameworks_home="" --gc_delay="1weeks" --gc_disk_headroom="0.1"
--hadoop_home="" --help="false" --hostname_lookup="true" --http_command_executor="false" --http_credentials="/tmp/Endpoint_SlaveEndpointTest_UnauthorizedRequest_1_LdBs8P/http_credentials"
--http_heartbeat_interval="30secs" --initialize_driver_logging="true" --isolation="posix/cpu,posix/mem"
--launcher="posix" --launcher_dir="/mesos/build/src" --logbufsecs="0" --logging_level="INFO"
--max_completed_executors_per_framework="150" --oversubscribed_resources_interval="15secs"
--perf_duration="10secs" --perf_interval="1mins" --port="5051" --qos_correction_interval_min="0ns"
--quiet="false" --recover="reconnect" --recovery_timeout="15mins" --registration_backoff_factor="10ms"
--resources="cpus:2;gpus:0;mem:1024;disk:1024;ports:[31000-32000]" --revocable_cpu_low_priority="true"
--runtime_dir="/tmp/Endpoint_SlaveEndpointTest_UnauthorizedRequest_1_LdBs8P" --sandbox_directory="/mnt/mesos/sandbox"
--strict="true" --switch_user="true" --systemd_enable_support="true" --systemd_runtime_directory="/run/systemd/system"
--version="false" --work_dir="/tmp/Endpoint_SlaveEndpointTest_UnauthorizedRequest_1_4n9qh4"
I0420 01:25:38.539072 31560 credentials.hpp:86] Loading credential for authentication from
'/tmp/Endpoint_SlaveEndpointTest_UnauthorizedRequest_1_LdBs8P/credential'
I0420 01:25:38.539361 31560 slave.cpp:258] Agent using credential for: test-principal
I0420 01:25:38.539453 31560 credentials.hpp:37] Loading credentials for authentication from
'/tmp/Endpoint_SlaveEndpointTest_UnauthorizedRequest_1_LdBs8P/http_credentials'
I0420 01:25:38.539676 31560 http.cpp:975] Creating default 'basic' HTTP authenticator for
realm 'mesos-agent-executor'
I0420 01:25:38.539741 31560 http.cpp:996] Creating default 'jwt' HTTP authenticator for realm
'mesos-agent-executor'
I0420 01:25:38.539829 31560 http.cpp:975] Creating default 'basic' HTTP authenticator for
realm 'mesos-agent-readonly'
I0420 01:25:38.539885 31560 http.cpp:996] Creating default 'jwt' HTTP authenticator for realm
'mesos-agent-readonly'
I0420 01:25:38.539973 31560 http.cpp:975] Creating default 'basic' HTTP authenticator for
realm 'mesos-agent-readwrite'
I0420 01:25:38.540012 31560 http.cpp:996] Creating default 'jwt' HTTP authenticator for realm
'mesos-agent-readwrite'
I0420 01:25:38.540474 31560 slave.cpp:525] Agent resources: cpus(*):2; mem(*):1024; disk(*):1024;
ports(*):[31000-32000]
I0420 01:25:38.540510 31560 slave.cpp:533] Agent attributes: [  ]
I0420 01:25:38.540518 31560 slave.cpp:538] Agent hostname: 88762a063bb6
I0420 01:25:38.540650 31561 status_update_manager.cpp:177] Pausing sending status updates
I0420 01:25:38.541033 31570 state.cpp:62] Recovering state from '/tmp/Endpoint_SlaveEndpointTest_UnauthorizedRequest_1_4n9qh4/meta'
I0420 01:25:38.541239 31567 status_update_manager.cpp:203] Recovering status update manager
I0420 01:25:38.541364 31563 containerizer.cpp:608] Recovering containerizer
I0420 01:25:38.541925 31563 provisioner.cpp:410] Provisioner recovery complete
I0420 01:25:38.542064 31563 slave.cpp:5963] Finished recovery
I0420 01:25:38.542510 31563 slave.cpp:6145] Querying resource estimator for oversubscribable
resources
I0420 01:25:38.542673 31563 slave.cpp:6159] Received oversubscribable resources {} from the
resource estimator
I0420 01:25:38.543702 31563 process.cpp:3722] Handling HTTP event for process 'slave(729)'
with path: '/slave(729)/monitor/statistics.json'
I0420 01:25:38.544312 31575 http.cpp:1115] HTTP GET for /slave(729)/monitor/statistics.json
from 172.17.0.3:60727
I0420 01:25:38.544366 31575 http.cpp:936] Authorizing principal 'test-principal' to GET the
'/monitor/statistics.json' endpoint
I0420 01:25:38.545725 31569 slave.cpp:790] Agent terminating
[       OK ] Endpoint/SlaveEndpointTest.UnauthorizedRequest/1 (14 ms)
[ RUN      ] Endpoint/SlaveEndpointTest.UnauthorizedRequest/2
I0420 01:25:38.550367 25996 containerizer.cpp:221] Using isolation: posix/cpu,posix/mem,filesystem/posix,network/cni
W0420 01:25:38.550606 25996 backend.cpp:76] Failed to create 'aufs' backend: AufsBackend requires
root privileges
W0420 01:25:38.550642 25996 backend.cpp:76] Failed to create 'bind' backend: BindBackend requires
root privileges
I0420 01:25:38.550652 25996 provisioner.cpp:249] Using default backend 'copy'
I0420 01:25:38.551662 31565 slave.cpp:225] Mesos agent started on (730)@172.17.0.3:52576
I0420 01:25:38.551729 31565 slave.cpp:226] Flags at startup: --acls="" --appc_simple_discovery_uri_prefix="http://"
--appc_store_dir="/tmp/mesos/store/appc" --authenticate_http_executors="true" --authenticate_http_readonly="true"
--authenticate_http_readwrite="true" --authenticatee="crammd5" --authentication_backoff_factor="1secs"
--authorizer="local" --cgroups_cpu_enable_pids_and_tids_count="false" --cgroups_enable_cfs="false"
--cgroups_hierarchy="/sys/fs/cgroup" --cgroups_limit_swap="false" --cgroups_root="mesos" --container_disk_watch_interval="15secs"
--containerizers="mesos" --credential="/tmp/Endpoint_SlaveEndpointTest_UnauthorizedRequest_2_MN2uGV/credential"
--default_role="*" --disk_watch_interval="1mins" --docker="docker" --docker_kill_orphans="true"
--docker_registry="https://registry-1.docker.io" --docker_remove_delay="6hrs" --docker_socket="/var/run/docker.sock"
--docker_stop_timeout="0ns" --docker_store_dir="/tmp/mesos/store/docker" --docker_volume_checkpoint_dir="/var/run/mesos/isolators/docker/volume"
--enforce_container_disk_quota="false" --executor_registration_timeout="1mins" --executor_secret_key="/tmp/Endpoint_SlaveEndpointTest_UnauthorizedRequest_2_MN2uGV/executor_secret_key"
--executor_shutdown_grace_period="5secs" --fetcher_cache_dir="/tmp/Endpoint_SlaveEndpointTest_UnauthorizedRequest_2_MN2uGV/fetch"
--fetcher_cache_size="2GB" --frameworks_home="" --gc_delay="1weeks" --gc_disk_headroom="0.1"
--hadoop_home="" --help="false" --hostname_lookup="true" --http_command_executor="false" --http_credentials="/tmp/Endpoint_SlaveEndpointTest_UnauthorizedRequest_2_MN2uGV/http_credentials"
--http_heartbeat_interval="30secs" --initialize_driver_logging="true" --isolation="posix/cpu,posix/mem"
--launcher="posix" --launcher_dir="/mesos/build/src" --logbufsecs="0" --logging_level="INFO"
--max_completed_executors_per_framework="150" --oversubscribed_resources_interval="15secs"
--perf_duration="10secs" --perf_interval="1mins" --port="5051" --qos_correction_interval_min="0ns"
--quiet="false" --recover="reconnect" --recovery_timeout="15mins" --registration_backoff_factor="10ms"
--resources="cpus:2;gpus:0;mem:1024;disk:1024;ports:[31000-32000]" --revocable_cpu_low_priority="true"
--runtime_dir="/tmp/Endpoint_SlaveEndpointTest_UnauthorizedRequest_2_MN2uGV" --sandbox_directory="/mnt/mesos/sandbox"
--strict="true" --switch_user="true" --systemd_enable_support="true" --systemd_runtime_directory="/run/systemd/system"
--version="false" --work_dir="/tmp/Endpoint_SlaveEndpointTest_UnauthorizedRequest_2_bkEaN9"
I0420 01:25:38.551947 31565 credentials.hpp:86] Loading credential for authentication from
'/tmp/Endpoint_SlaveEndpointTest_UnauthorizedRequest_2_MN2uGV/credential'
I0420 01:25:38.552043 31565 slave.cpp:258] Agent using credential for: test-principal
I0420 01:25:38.552075 31565 credentials.hpp:37] Loading credentials for authentication from
'/tmp/Endpoint_SlaveEndpointTest_UnauthorizedRequest_2_MN2uGV/http_credentials'
I0420 01:25:38.552250 31565 http.cpp:975] Creating default 'basic' HTTP authenticator for
realm 'mesos-agent-executor'
I0420 01:25:38.552290 31565 http.cpp:996] Creating default 'jwt' HTTP authenticator for realm
'mesos-agent-executor'
I0420 01:25:38.552403 31565 http.cpp:975] Creating default 'basic' HTTP authenticator for
realm 'mesos-agent-readonly'
I0420 01:25:38.552440 31565 http.cpp:996] Creating default 'jwt' HTTP authenticator for realm
'mesos-agent-readonly'
I0420 01:25:38.552521 31565 http.cpp:975] Creating default 'basic' HTTP authenticator for
realm 'mesos-agent-readwrite'
I0420 01:25:38.552558 31565 http.cpp:996] Creating default 'jwt' HTTP authenticator for realm
'mesos-agent-readwrite'
I0420 01:25:38.552996 31565 slave.cpp:525] Agent resources: cpus(*):2; mem(*):1024; disk(*):1024;
ports(*):[31000-32000]
I0420 01:25:38.553030 31565 slave.cpp:533] Agent attributes: [  ]
I0420 01:25:38.553036 31565 slave.cpp:538] Agent hostname: 88762a063bb6
I0420 01:25:38.553107 31572 status_update_manager.cpp:177] Pausing sending status updates
I0420 01:25:38.553609 31563 state.cpp:62] Recovering state from '/tmp/Endpoint_SlaveEndpointTest_UnauthorizedRequest_2_bkEaN9/meta'
I0420 01:25:38.553750 31565 status_update_manager.cpp:203] Recovering status update manager
I0420 01:25:38.553843 31561 containerizer.cpp:608] Recovering containerizer
I0420 01:25:38.554365 31561 provisioner.cpp:410] Provisioner recovery complete
I0420 01:25:38.554496 31561 slave.cpp:5963] Finished recovery
I0420 01:25:38.554884 31561 slave.cpp:6145] Querying resource estimator for oversubscribable
resources
I0420 01:25:38.555022 31575 slave.cpp:6159] Received oversubscribable resources {} from the
resource estimator
I0420 01:25:38.556012 31571 process.cpp:3722] Handling HTTP event for process 'slave(730)'
with path: '/slave(730)/containers'
I0420 01:25:38.556485 31571 http.cpp:1115] HTTP GET for /slave(730)/containers from 172.17.0.3:60728
I0420 01:25:38.556529 31571 http.cpp:936] Authorizing principal 'test-principal' to GET the
'/containers' endpoint
I0420 01:25:38.557565 25996 slave.cpp:790] Agent terminating
[       OK ] Endpoint/SlaveEndpointTest.UnauthorizedRequest/2 (20 ms)
[ RUN      ] Endpoint/SlaveEndpointTest.NoAuthorizer/0
I0420 01:25:38.571879 25996 containerizer.cpp:221] Using isolation: posix/cpu,posix/mem,filesystem/posix,network/cni
W0420 01:25:38.572296 25996 backend.cpp:76] Failed to create 'aufs' backend: AufsBackend requires
root privileges
W0420 01:25:38.572351 25996 backend.cpp:76] Failed to create 'bind' backend: BindBackend requires
root privileges
I0420 01:25:38.572373 25996 provisioner.cpp:249] Using default backend 'copy'
I0420 01:25:38.573083 25996 cluster.cpp:448] Creating default 'local' authorizer
I0420 01:25:38.573802 31565 slave.cpp:225] Mesos agent started on (731)@172.17.0.3:52576
I0420 01:25:38.573843 31565 slave.cpp:226] Flags at startup: --acls="" --appc_simple_discovery_uri_prefix="http://"
--appc_store_dir="/tmp/mesos/store/appc" --authenticate_http_executors="true" --authenticate_http_readonly="true"
--authenticate_http_readwrite="true" --authenticatee="crammd5" --authentication_backoff_factor="1secs"
--authorizer="local" --cgroups_cpu_enable_pids_and_tids_count="false" --cgroups_enable_cfs="false"
--cgroups_hierarchy="/sys/fs/cgroup" --cgroups_limit_swap="false" --cgroups_root="mesos" --container_disk_watch_interval="15secs"
--containerizers="mesos" --credential="/tmp/Endpoint_SlaveEndpointTest_NoAuthorizer_0_wqrUq1/credential"
--default_role="*" --disk_watch_interval="1mins" --docker="docker" --docker_kill_orphans="true"
--docker_registry="https://registry-1.docker.io" --docker_remove_delay="6hrs" --docker_socket="/var/run/docker.sock"
--docker_stop_timeout="0ns" --docker_store_dir="/tmp/mesos/store/docker" --docker_volume_checkpoint_dir="/var/run/mesos/isolators/docker/volume"
--enforce_container_disk_quota="false" --executor_registration_timeout="1mins" --executor_secret_key="/tmp/Endpoint_SlaveEndpointTest_NoAuthorizer_0_wqrUq1/executor_secret_key"
--executor_shutdown_grace_period="5secs" --fetcher_cache_dir="/tmp/Endpoint_SlaveEndpointTest_NoAuthorizer_0_wqrUq1/fetch"
--fetcher_cache_size="2GB" --frameworks_home="" --gc_delay="1weeks" --gc_disk_headroom="0.1"
--hadoop_home="" --help="false" --hostname_lookup="true" --http_command_executor="false" --http_credentials="/tmp/Endpoint_SlaveEndpointTest_NoAuthorizer_0_wqrUq1/http_credentials"
--http_heartbeat_interval="30secs" --initialize_driver_logging="true" --isolation="posix/cpu,posix/mem"
--launcher="posix" --launcher_dir="/mesos/build/src" --logbufsecs="0" --logging_level="INFO"
--max_completed_executors_per_framework="150" --oversubscribed_resources_interval="15secs"
--perf_duration="10secs" --perf_interval="1mins" --port="5051" --qos_correction_interval_min="0ns"
--quiet="false" --recover="reconnect" --recovery_timeout="15mins" --registration_backoff_factor="10ms"
--resources="cpus:2;gpus:0;mem:1024;disk:1024;ports:[31000-32000]" --revocable_cpu_low_priority="true"
--runtime_dir="/tmp/Endpoint_SlaveEndpointTest_NoAuthorizer_0_wqrUq1" --sandbox_directory="/mnt/mesos/sandbox"
--strict="true" --switch_user="true" --systemd_enable_support="true" --systemd_runtime_directory="/run/systemd/system"
--version="false" --work_dir="/tmp/Endpoint_SlaveEndpointTest_NoAuthorizer_0_oVh7tf"
I0420 01:25:38.574054 31565 credentials.hpp:86] Loading credential for authentication from
'/tmp/Endpoint_SlaveEndpointTest_NoAuthorizer_0_wqrUq1/credential'
I0420 01:25:38.574203 31565 slave.cpp:258] Agent using credential for: test-principal
I0420 01:25:38.574214 31565 credentials.hpp:37] Loading credentials for authentication from
'/tmp/Endpoint_SlaveEndpointTest_NoAuthorizer_0_wqrUq1/http_credentials'
I0420 01:25:38.574334 31565 http.cpp:975] Creating default 'basic' HTTP authenticator for
realm 'mesos-agent-executor'
I0420 01:25:38.574380 31565 http.cpp:996] Creating default 'jwt' HTTP authenticator for realm
'mesos-agent-executor'
I0420 01:25:38.574460 31565 http.cpp:975] Creating default 'basic' HTTP authenticator for
realm 'mesos-agent-readonly'
I0420 01:25:38.574509 31565 http.cpp:996] Creating default 'jwt' HTTP authenticator for realm
'mesos-agent-readonly'
I0420 01:25:38.574581 31565 http.cpp:975] Creating default 'basic' HTTP authenticator for
realm 'mesos-agent-readwrite'
I0420 01:25:38.574694 31565 http.cpp:996] Creating default 'jwt' HTTP authenticator for realm
'mesos-agent-readwrite'
I0420 01:25:38.575111 31565 slave.cpp:525] Agent resources: cpus(*):2; mem(*):1024; disk(*):1024;
ports(*):[31000-32000]
I0420 01:25:38.575145 31565 slave.cpp:533] Agent attributes: [  ]
I0420 01:25:38.575150 31565 slave.cpp:538] Agent hostname: 88762a063bb6
I0420 01:25:38.575208 31575 status_update_manager.cpp:177] Pausing sending status updates
I0420 01:25:38.575544 31573 state.cpp:62] Recovering state from '/tmp/Endpoint_SlaveEndpointTest_NoAuthorizer_0_oVh7tf/meta'
I0420 01:25:38.575721 31573 status_update_manager.cpp:203] Recovering status update manager
I0420 01:25:38.575876 31568 containerizer.cpp:608] Recovering containerizer
I0420 01:25:38.576370 31568 provisioner.cpp:410] Provisioner recovery complete
I0420 01:25:38.576529 31572 slave.cpp:5963] Finished recovery
I0420 01:25:38.576962 31572 slave.cpp:6145] Querying resource estimator for oversubscribable
resources
I0420 01:25:38.577047 31567 slave.cpp:6159] Received oversubscribable resources {} from the
resource estimator
I0420 01:25:38.577915 31572 process.cpp:3722] Handling HTTP event for process 'slave(731)'
with path: '/slave(731)/monitor/statistics'
I0420 01:25:38.578411 31562 http.cpp:1115] HTTP GET for /slave(731)/monitor/statistics from
172.17.0.3:60729
I0420 01:25:38.578444 31562 http.cpp:936] Authorizing principal 'test-principal' to GET the
'/monitor/statistics' endpoint
I0420 01:25:38.579474 31566 slave.cpp:790] Agent terminating
[       OK ] Endpoint/SlaveEndpointTest.NoAuthorizer/0 (12 ms)
[ RUN      ] Endpoint/SlaveEndpointTest.NoAuthorizer/1
I0420 01:25:38.584372 25996 containerizer.cpp:221] Using isolation: posix/cpu,posix/mem,filesystem/posix,network/cni
W0420 01:25:38.584681 25996 backend.cpp:76] Failed to create 'aufs' backend: AufsBackend requires
root privileges
W0420 01:25:38.584717 25996 backend.cpp:76] Failed to create 'bind' backend: BindBackend requires
root privileges
I0420 01:25:38.584733 25996 provisioner.cpp:249] Using default backend 'copy'
I0420 01:25:38.585283 25996 cluster.cpp:448] Creating default 'local' authorizer
I0420 01:25:38.585783 31572 slave.cpp:225] Mesos agent started on (732)@172.17.0.3:52576
I0420 01:25:38.585805 31572 slave.cpp:226] Flags at startup: --acls="" --appc_simple_discovery_uri_prefix="http://"
--appc_store_dir="/tmp/mesos/store/appc" --authenticate_http_executors="true" --authenticate_http_readonly="true"
--authenticate_http_readwrite="true" --authenticatee="crammd5" --authentication_backoff_factor="1secs"
--authorizer="local" --cgroups_cpu_enable_pids_and_tids_count="false" --cgroups_enable_cfs="false"
--cgroups_hierarchy="/sys/fs/cgroup" --cgroups_limit_swap="false" --cgroups_root="mesos" --container_disk_watch_interval="15secs"
--containerizers="mesos" --credential="/tmp/Endpoint_SlaveEndpointTest_NoAuthorizer_1_0UD5k7/credential"
--default_role="*" --disk_watch_interval="1mins" --docker="docker" --docker_kill_orphans="true"
--docker_registry="https://registry-1.docker.io" --docker_remove_delay="6hrs" --docker_socket="/var/run/docker.sock"
--docker_stop_timeout="0ns" --docker_store_dir="/tmp/mesos/store/docker" --docker_volume_checkpoint_dir="/var/run/mesos/isolators/docker/volume"
--enforce_container_disk_quota="false" --executor_registration_timeout="1mins" --executor_secret_key="/tmp/Endpoint_SlaveEndpointTest_NoAuthorizer_1_0UD5k7/executor_secret_key"
--executor_shutdown_grace_period="5secs" --fetcher_cache_dir="/tmp/Endpoint_SlaveEndpointTest_NoAuthorizer_1_0UD5k7/fetch"
--fetcher_cache_size="2GB" --frameworks_home="" --gc_delay="1weeks" --gc_disk_headroom="0.1"
--hadoop_home="" --help="false" --hostname_lookup="true" --http_command_executor="false" --http_credentials="/tmp/Endpoint_SlaveEndpointTest_NoAuthorizer_1_0UD5k7/http_credentials"
--http_heartbeat_interval="30secs" --initialize_driver_logging="true" --isolation="posix/cpu,posix/mem"
--launcher="posix" --launcher_dir="/mesos/build/src" --logbufsecs="0" --logging_level="INFO"
--max_completed_executors_per_framework="150" --oversubscribed_resources_interval="15secs"
--perf_duration="10secs" --perf_interval="1mins" --port="5051" --qos_correction_interval_min="0ns"
--quiet="false" --recover="reconnect" --recovery_timeout="15mins" --registration_backoff_factor="10ms"
--resources="cpus:2;gpus:0;mem:1024;disk:1024;ports:[31000-32000]" --revocable_cpu_low_priority="true"
--runtime_dir="/tmp/Endpoint_SlaveEndpointTest_NoAuthorizer_1_0UD5k7" --sandbox_directory="/mnt/mesos/sandbox"
--strict="true" --switch_user="true" --systemd_enable_support="true" --systemd_runtime_directory="/run/systemd/system"
--version="false" --work_dir="/tmp/Endpoint_SlaveEndpointTest_NoAuthorizer_1_tAmfml"
I0420 01:25:38.586014 31572 credentials.hpp:86] Loading credential for authentication from
'/tmp/Endpoint_SlaveEndpointTest_NoAuthorizer_1_0UD5k7/credential'
I0420 01:25:38.586112 31572 slave.cpp:258] Agent using credential for: test-principal
I0420 01:25:38.586127 31572 credentials.hpp:37] Loading credentials for authentication from
'/tmp/Endpoint_SlaveEndpointTest_NoAuthorizer_1_0UD5k7/http_credentials'
I0420 01:25:38.586282 31572 http.cpp:975] Creating default 'basic' HTTP authenticator for
realm 'mesos-agent-executor'
I0420 01:25:38.586320 31572 http.cpp:996] Creating default 'jwt' HTTP authenticator for realm
'mesos-agent-executor'
I0420 01:25:38.586388 31572 http.cpp:975] Creating default 'basic' HTTP authenticator for
realm 'mesos-agent-readonly'
I0420 01:25:38.586414 31572 http.cpp:996] Creating default 'jwt' HTTP authenticator for realm
'mesos-agent-readonly'
I0420 01:25:38.586447 31572 http.cpp:975] Creating default 'basic' HTTP authenticator for
realm 'mesos-agent-readwrite'
I0420 01:25:38.586465 31572 http.cpp:996] Creating default 'jwt' HTTP authenticator for realm
'mesos-agent-readwrite'
I0420 01:25:38.586800 31572 slave.cpp:525] Agent resources: cpus(*):2; mem(*):1024; disk(*):1024;
ports(*):[31000-32000]
I0420 01:25:38.586833 31572 slave.cpp:533] Agent attributes: [  ]
I0420 01:25:38.586836 31572 slave.cpp:538] Agent hostname: 88762a063bb6
I0420 01:25:38.587222 31572 status_update_manager.cpp:177] Pausing sending status updates
I0420 01:25:38.587409 31572 state.cpp:62] Recovering state from '/tmp/Endpoint_SlaveEndpointTest_NoAuthorizer_1_tAmfml/meta'
I0420 01:25:38.587529 31572 status_update_manager.cpp:203] Recovering status update manager
I0420 01:25:38.587585 31572 containerizer.cpp:608] Recovering containerizer
I0420 01:25:38.587956 31572 provisioner.cpp:410] Provisioner recovery complete
I0420 01:25:38.588076 31572 slave.cpp:5963] Finished recovery
I0420 01:25:38.588410 31572 slave.cpp:6145] Querying resource estimator for oversubscribable
resources
I0420 01:25:38.588522 31572 slave.cpp:6159] Received oversubscribable resources {} from the
resource estimator
I0420 01:25:38.589496 31564 process.cpp:3722] Handling HTTP event for process 'slave(732)'
with path: '/slave(732)/monitor/statistics.json'
I0420 01:25:38.590144 31567 http.cpp:1115] HTTP GET for /slave(732)/monitor/statistics.json
from 172.17.0.3:60730
I0420 01:25:38.590201 31567 http.cpp:936] Authorizing principal 'test-principal' to GET the
'/monitor/statistics.json' endpoint
I0420 01:25:38.591411 25996 slave.cpp:790] Agent terminating
[       OK ] Endpoint/SlaveEndpointTest.NoAuthorizer/1 (11 ms)
[ RUN      ] Endpoint/SlaveEndpointTest.NoAuthorizer/2
I0420 01:25:38.596428 25996 containerizer.cpp:221] Using isolation: posix/cpu,posix/mem,filesystem/posix,network/cni
W0420 01:25:38.596667 25996 backend.cpp:76] Failed to create 'aufs' backend: AufsBackend requires
root privileges
W0420 01:25:38.596704 25996 backend.cpp:76] Failed to create 'bind' backend: BindBackend requires
root privileges
I0420 01:25:38.596748 25996 provisioner.cpp:249] Using default backend 'copy'
I0420 01:25:38.597296 25996 cluster.cpp:448] Creating default 'local' authorizer
I0420 01:25:38.597810 31575 slave.cpp:225] Mesos agent started on (733)@172.17.0.3:52576
I0420 01:25:38.597838 31575 slave.cpp:226] Flags at startup: --acls="" --appc_simple_discovery_uri_prefix="http://"
--appc_store_dir="/tmp/mesos/store/appc" --authenticate_http_executors="true" --authenticate_http_readonly="true"
--authenticate_http_readwrite="true" --authenticatee="crammd5" --authentication_backoff_factor="1secs"
--authorizer="local" --cgroups_cpu_enable_pids_and_tids_count="false" --cgroups_enable_cfs="false"
--cgroups_hierarchy="/sys/fs/cgroup" --cgroups_limit_swap="false" --cgroups_root="mesos" --container_disk_watch_interval="15secs"
--containerizers="mesos" --credential="/tmp/Endpoint_SlaveEndpointTest_NoAuthorizer_2_2WxYmd/credential"
--default_role="*" --disk_watch_interval="1mins" --docker="docker" --docker_kill_orphans="true"
--docker_registry="https://registry-1.docker.io" --docker_remove_delay="6hrs" --docker_socket="/var/run/docker.sock"
--docker_stop_timeout="0ns" --docker_store_dir="/tmp/mesos/store/docker" --docker_volume_checkpoint_dir="/var/run/mesos/isolators/docker/volume"
--enforce_container_disk_quota="false" --executor_registration_timeout="1mins" --executor_secret_key="/tmp/Endpoint_SlaveEndpointTest_NoAuthorizer_2_2WxYmd/executor_secret_key"
--executor_shutdown_grace_period="5secs" --fetcher_cache_dir="/tmp/Endpoint_SlaveEndpointTest_NoAuthorizer_2_2WxYmd/fetch"
--fetcher_cache_size="2GB" --frameworks_home="" --gc_delay="1weeks" --gc_disk_headroom="0.1"
--hadoop_home="" --help="false" --hostname_lookup="true" --http_command_executor="false" --http_credentials="/tmp/Endpoint_SlaveEndpointTest_NoAuthorizer_2_2WxYmd/http_credentials"
--http_heartbeat_interval="30secs" --initialize_driver_logging="true" --isolation="posix/cpu,posix/mem"
--launcher="posix" --launcher_dir="/mesos/build/src" --logbufsecs="0" --logging_level="INFO"
--max_completed_executors_per_framework="150" --oversubscribed_resources_interval="15secs"
--perf_duration="10secs" --perf_interval="1mins" --port="5051" --qos_correction_interval_min="0ns"
--quiet="false" --recover="reconnect" --recovery_timeout="15mins" --registration_backoff_factor="10ms"
--resources="cpus:2;gpus:0;mem:1024;disk:1024;ports:[31000-32000]" --revocable_cpu_low_priority="true"
--runtime_dir="/tmp/Endpoint_SlaveEndpointTest_NoAuthorizer_2_2WxYmd" --sandbox_directory="/mnt/mesos/sandbox"
--strict="true" --switch_user="true" --systemd_enable_support="true" --systemd_runtime_directory="/run/systemd/system"
--version="false" --work_dir="/tmp/Endpoint_SlaveEndpointTest_NoAuthorizer_2_6FHbmr"
I0420 01:25:38.598016 31575 credentials.hpp:86] Loading credential for authentication from
'/tmp/Endpoint_SlaveEndpointTest_NoAuthorizer_2_2WxYmd/credential'
I0420 01:25:38.598095 31575 slave.cpp:258] Agent using credential for: test-principal
I0420 01:25:38.598105 31575 credentials.hpp:37] Loading credentials for authentication from
'/tmp/Endpoint_SlaveEndpointTest_NoAuthorizer_2_2WxYmd/http_credentials'
I0420 01:25:38.598258 31575 http.cpp:975] Creating default 'basic' HTTP authenticator for
realm 'mesos-agent-executor'
I0420 01:25:38.598309 31575 http.cpp:996] Creating default 'jwt' HTTP authenticator for realm
'mesos-agent-executor'
I0420 01:25:38.598403 31575 http.cpp:975] Creating default 'basic' HTTP authenticator for
realm 'mesos-agent-readonly'
I0420 01:25:38.598439 31575 http.cpp:996] Creating default 'jwt' HTTP authenticator for realm
'mesos-agent-readonly'
I0420 01:25:38.598541 31575 http.cpp:975] Creating default 'basic' HTTP authenticator for
realm 'mesos-agent-readwrite'
I0420 01:25:38.598647 31575 http.cpp:996] Creating default 'jwt' HTTP authenticator for realm
'mesos-agent-readwrite'
I0420 01:25:38.599149 31575 slave.cpp:525] Agent resources: cpus(*):2; mem(*):1024; disk(*):1024;
ports(*):[31000-32000]
I0420 01:25:38.599196 31575 slave.cpp:533] Agent attributes: [  ]
I0420 01:25:38.599207 31575 slave.cpp:538] Agent hostname: 88762a063bb6
I0420 01:25:38.599560 31575 status_update_manager.cpp:177] Pausing sending status updates
I0420 01:25:38.599726 31575 state.cpp:62] Recovering state from '/tmp/Endpoint_SlaveEndpointTest_NoAuthorizer_2_6FHbmr/meta'
I0420 01:25:38.599853 31575 status_update_manager.cpp:203] Recovering status update manager
I0420 01:25:38.599918 31575 containerizer.cpp:608] Recovering containerizer
I0420 01:25:38.600378 31575 provisioner.cpp:410] Provisioner recovery complete
I0420 01:25:38.600509 31575 slave.cpp:5963] Finished recovery
I0420 01:25:38.600859 31575 slave.cpp:6145] Querying resource estimator for oversubscribable
resources
I0420 01:25:38.601013 31575 slave.cpp:6159] Received oversubscribable resources {} from the
resource estimator
I0420 01:25:38.601828 31571 process.cpp:3722] Handling HTTP event for process 'slave(733)'
with path: '/slave(733)/containers'
I0420 01:25:38.602381 31574 http.cpp:1115] HTTP GET for /slave(733)/containers from 172.17.0.3:60731
I0420 01:25:38.602418 31574 http.cpp:936] Authorizing principal 'test-principal' to GET the
'/containers' endpoint
I0420 01:25:38.604002 31567 slave.cpp:790] Agent terminating
[       OK ] Endpoint/SlaveEndpointTest.NoAuthorizer/2 (12 ms)
[----------] 9 tests from Endpoint/SlaveEndpointTest (144 ms total)

[----------] Global test environment tear-down
[==========] 1491 tests from 167 test cases ran. (228654 ms total)
[  PASSED  ] 1490 tests.
[  FAILED  ] 1 test, listed below:
[  FAILED  ] UpgradeTest.ReregisterOldAgentWithMultiRoleMaster

 1 FAILED TEST
  YOU HAVE 12 DISABLED TESTS

make[3]: Leaving directory `/mesos/build'
make[3]: *** [CMakeFiles/check] Error 1
make[2]: *** [CMakeFiles/check.dir/all] Error 2
make[2]: Leaving directory `/mesos/build'
make[1]: *** [CMakeFiles/check.dir/rule] Error 2
make[1]: Leaving directory `/mesos/build'
make: *** [check] Error 2
+ docker rmi mesos-1492649090-15887
Untagged: mesos-1492649090-15887:latest
Deleted: sha256:2c6911f0edc40ea83322001c595c14214a230e39776af59e36b9291bed46411f
Deleted: sha256:f0cbc42975786584e06f6bcd835c611fc0eac5d91cd2f189230eba309a22a3cf
Deleted: sha256:c94c31a432dec978a25214026898ee2c3c9136e0aab4308171e6c13c5d2171bd
Deleted: sha256:968ceea93617166ed4cd13bfde9c7ebbd42cb4836cd3e499e8fac65b27793546
Deleted: sha256:e561d487ca2f6c84a7df9922adccccde7c9e404f95398003257a3af4507ce7a0
Deleted: sha256:8ea1e82429ed67fbb270febc762d8d409e0b772cf3548005fd9f9e2044ede8c1
Deleted: sha256:4a4882dcec1851dd4a3a8675bc4a157ba08dd640866281a81cfe4e16017f6f91
Deleted: sha256:47f915851111010f63a607efc0a3a68b3c60248528837e07863ade74a77d90e9
Deleted: sha256:4e26c0949fd5fe178dd30fcff4391eb53d4d607add8cd46834f2303d4f62ff8b
Deleted: sha256:79017365b6ab07352f3fb0ce042d566d77c17201c9b207b6e298e2e315f530b0
Deleted: sha256:24b7ad5215d1182f7592c5d6fc1caaea2b78e39e623edb5408b755e309fe57a9
Deleted: sha256:f6a472077cfcfc72e7753c8acc68301303fdbee2d565dd2feba7a8dbfbca4b7e
Deleted: sha256:5128f619939363c7ea6ed9a15322e17aeea5529f6427363ce5f16aa47f143a28
Deleted: sha256:1d87a6a15099a0749c146c06d8227dabf7efefba29261e29726a9d40a4fc2c40
Deleted: sha256:b82a3c3a535d560a6f7de7042f05cf842390bfe3e10721ceb066b380b583d5b8
Deleted: sha256:c96e46ffd198668ffe2614ce5ba56d570fc23fd9a7ff9a06550c10ab9b72bab3
Deleted: sha256:db1aa9b6796afffad562ab363bcc048e30f51f11a4b434bbe45dee4dbb336dae
Deleted: sha256:1c6828b7cbe4e820e760909dbddc53ab4c11e828262433129676fac9f5e05643
Deleted: sha256:8abe4afa7c209013d1232ed90a432d052f4eab0b6dd6994b5d6e53f02f7cef95
Deleted: sha256:09fb35a7929a80e02a3a6e0654866843bbb7f5b9cc1555180f814cc0887635d6
Deleted: sha256:a050a320c1ae5ca302d2a66747a3960df085368c9e0177bd15c4ac26f163ba5a
Deleted: sha256:b442954a56f47076ee4179e808906992e623d260e7db27c02c9cb53468c382d2
Deleted: sha256:226bed04372183e778e15a548aa521f5e632f35d29304087c9b9cbf0c751a15f
Deleted: sha256:99768659c014fcefd49445c363ed64bc842686c344b4a0f1a038a19570ca587f
Build step 'Execute shell' marked build as failure
Not sending mail to unregistered user yujie.jay@gmail.com
Not sending mail to unregistered user neil.conway@gmail.com

Mime
View raw message