mesos-builds mailing list archives

Site index · List index
Message view « Date » · « Thread »
Top « Date » · « Thread »
From Apache Jenkins Server <jenk...@builds.apache.org>
Subject Build failed in Jenkins: Mesos-Reviewbot #17727
Date Tue, 11 Apr 2017 22:13:33 GMT
See <https://builds.apache.org/job/Mesos-Reviewbot/17727/display/redirect?page=changes>

Changes:

[josephwu] Added test filters to stout tests.

[josephwu] Added test filters to libprocess tests.

[josephwu] Refactored Mesos tests `Environment` class on stout test changes.

------------------------------------------
[...truncated 287.61 KB...]
checking the maximum length of command line arguments... 1572864
checking whether the shell understands some XSI constructs... yes
checking whether the shell understands "+="... yes
checking how to convert x86_64-unknown-linux-gnu file names to x86_64-unknown-linux-gnu format...
func_convert_file_noop
checking how to convert x86_64-unknown-linux-gnu file names to toolchain format... func_convert_file_noop
checking for /usr/bin/ld option to reload object files... -r
checking for objdump... objdump
checking how to recognize dependent libraries... pass_all
checking for dlltool... no
checking how to associate runtime and link libraries... printf %s\n
checking for archiver @FILE support... @
checking for strip... strip
checking for ranlib... ranlib
checking command to parse /usr/bin/nm -B output from gcc object... ok
checking for sysroot... no
checking for mt... mt
checking if mt is a manifest tool... no
checking how to run the C preprocessor... gcc -E
checking for ANSI C header files... yes
checking for sys/types.h... yes
checking for sys/stat.h... yes
checking for stdlib.h... yes
checking for string.h... yes
checking for memory.h... yes
checking for strings.h... yes
checking for inttypes.h... yes
checking for stdint.h... yes
checking for unistd.h... yes
checking for dlfcn.h... yes
checking for objdir... .libs
checking if gcc supports -fno-rtti -fno-exceptions... no
checking for gcc option to produce PIC... -fPIC -DPIC
checking if gcc PIC flag -fPIC -DPIC works... yes
checking if gcc static flag -static works... yes
checking if gcc supports -c -o file.o... yes
checking if gcc supports -c -o file.o... (cached) yes
checking whether the gcc linker (/usr/bin/ld -m elf_x86_64) supports shared libraries... yes
checking whether -lc should be explicitly linked in... no
checking dynamic linker characteristics... GNU/Linux ld.so
checking how to hardcode library paths into programs... immediate
checking whether stripping libraries is possible... yes
checking if libtool supports shared libraries... yes
checking whether to build shared libraries... yes
checking whether to build static libraries... no
checking how to run the C++ preprocessor... g++ -E
checking for ld used by g++... /usr/bin/ld -m elf_x86_64
checking if the linker (/usr/bin/ld -m elf_x86_64) is GNU ld... yes
checking whether the g++ linker (/usr/bin/ld -m elf_x86_64) supports shared libraries... yes
checking for g++ option to produce PIC... -fPIC -DPIC
checking if g++ PIC flag -fPIC -DPIC works... yes
checking if g++ static flag -static works... yes
checking if g++ supports -c -o file.o... yes
checking if g++ supports -c -o file.o... (cached) yes
checking whether the g++ linker (/usr/bin/ld -m elf_x86_64) supports shared libraries... yes
checking dynamic linker characteristics... (cached) GNU/Linux ld.so
checking how to hardcode library paths into programs... immediate
configure: creating ./config.lt
config.lt: creating libtool
configure: Setting up CXXFLAGS for g++ version >= 4.8
checking whether C++ compiler accepts -fstack-protector-strong... no
checking whether g++ supports C++11 features by default... no
checking whether g++ supports C++11 features with -std=c++11... yes
checking if compiler needs -Werror to reject unknown flags... no
checking for the pthreads library -lpthreads... no
checking whether pthreads work without any flags... no
checking whether pthreads work with -Kthread... no
checking whether pthreads work with -kthread... no
checking for the pthreads library -llthread... no
checking whether pthreads work with -pthread... yes
checking for joinable pthread attribute... PTHREAD_CREATE_JOINABLE
checking if more special flags are required for pthreads... no
checking for PTHREAD_PRIO_INHERIT... yes
configure: Setting up build environment for x86_64 linux-gnu
checking for backtrace in -lunwind... no
checking for main in -lgflags... no
checking for gzread in -lz... yes
checking for patch... patch
checking fts.h usability... yes
checking fts.h presence... yes
checking for fts.h... yes
checking for library containing fts_close... none required
checking apr_pools.h usability... yes
checking apr_pools.h presence... yes
checking for apr_pools.h... yes
checking for apr_initialize in -lapr-1... yes
checking for curl_global_init in -lcurl... yes
checking for javac... /usr/bin/javac
checking for java... /usr/bin/java
checking value of Java system property 'java.home'... /usr/lib/jvm/java-7-openjdk-amd64/jre
configure: using JAVA_HOME=/usr/lib/jvm/java-7-openjdk-amd64
checking whether or not we can build with JNI... yes
checking for mvn... /usr/bin/mvn
checking for sasl_done in -lsasl2... yes
checking SASL CRAM-MD5 support... yes
checking svn_version.h usability... yes
checking svn_version.h presence... yes
checking for svn_version.h... yes
checking for svn_stringbuf_create_ensure in -lsvn_subr-1... yes
checking svn_delta.h usability... yes
checking svn_delta.h presence... yes
checking for svn_delta.h... yes
checking for svn_txdelta in -lsvn_delta-1... yes
checking whether to enable the XFS disk isolator... no
checking for deflate, gzread, gzwrite, inflate in -lz... yes
checking C++ standard library for undefined behaviour with selected optimization level...
no
checking for a Python interpreter with version >= 2.6... python
checking for python... /usr/bin/python
checking for python version... 2.7
checking for python platform... linux2
checking for python script directory... ${prefix}/lib/python2.7/site-packages
checking for python extension module directory... ${exec_prefix}/lib/python2.7/site-packages
checking for python2.7... (cached) /usr/bin/python
checking for a version of Python >= '2.1.0'... yes
checking for a version of Python >= '2.6'... yes
checking for the distutils Python package... yes
checking for Python include path... -I/usr/include/python2.7
checking for Python library path... -L/usr/lib -lpython2.7
checking for Python site-packages path... /usr/lib/python2.7/dist-packages
checking python extra libraries... -lpthread -ldl  -lutil -lm
checking python extra linking flags... -Xlinker -export-dynamic -Wl,-O1 -Wl,-Bsymbolic-functions
checking consistency of all components of python development environment... yes
checking whether we can build usable Python eggs... cc1plus: warning: command line option
'-Wstrict-prototypes' is valid for C/ObjC but not for C++ [enabled by default]
yes
checking for an old installation of the Mesos egg (before 0.20.0)... no
checking that generated files are newer than configure... done
configure: creating ./config.status
config.status: creating Makefile
config.status: creating mesos.pc
config.status: creating src/Makefile
config.status: creating 3rdparty/Makefile
config.status: creating 3rdparty/libprocess/Makefile
config.status: creating 3rdparty/libprocess/include/Makefile
config.status: creating 3rdparty/stout/Makefile
config.status: creating 3rdparty/stout/include/Makefile
config.status: creating 3rdparty/gmock_sources.cc
config.status: creating bin/mesos.sh
config.status: creating bin/mesos-agent.sh
config.status: creating bin/mesos-local.sh
config.status: creating bin/mesos-master.sh
config.status: creating bin/mesos-slave.sh
config.status: creating bin/mesos-tests.sh
config.status: creating bin/mesos-agent-flags.sh
config.status: creating bin/mesos-local-flags.sh
config.status: creating bin/mesos-master-flags.sh
config.status: creating bin/mesos-slave-flags.sh
config.status: creating bin/mesos-tests-flags.sh
config.status: creating bin/gdb-mesos-agent.sh
config.status: creating bin/gdb-mesos-local.sh
config.status: creating bin/gdb-mesos-master.sh
config.status: creating bin/gdb-mesos-slave.sh
config.status: creating bin/gdb-mesos-tests.sh
config.status: creating bin/lldb-mesos-agent.sh
config.status: creating bin/lldb-mesos-local.sh
config.status: creating bin/lldb-mesos-master.sh
config.status: creating bin/lldb-mesos-slave.sh
config.status: creating bin/lldb-mesos-tests.sh
config.status: creating bin/valgrind-mesos-agent.sh
config.status: creating bin/valgrind-mesos-local.sh
config.status: creating bin/valgrind-mesos-master.sh
config.status: creating bin/valgrind-mesos-slave.sh
config.status: creating bin/valgrind-mesos-tests.sh
config.status: creating src/deploy/mesos-daemon.sh
config.status: creating src/deploy/mesos-start-agents.sh
config.status: creating src/deploy/mesos-start-cluster.sh
config.status: creating src/deploy/mesos-start-masters.sh
config.status: creating src/deploy/mesos-start-slaves.sh
config.status: creating src/deploy/mesos-stop-agents.sh
config.status: creating src/deploy/mesos-stop-cluster.sh
config.status: creating src/deploy/mesos-stop-masters.sh
config.status: creating src/deploy/mesos-stop-slaves.sh
config.status: creating include/mesos/version.hpp
config.status: creating src/java/generated/org/apache/mesos/MesosNativeLibrary.java
config.status: creating mpi/mpiexec-mesos
config.status: creating src/examples/java/test-exception-framework
config.status: creating src/examples/java/test-executor
config.status: creating src/examples/java/test-framework
config.status: creating src/examples/java/test-multiple-executors-framework
config.status: creating src/examples/java/test-log
config.status: creating src/examples/java/v1-test-framework
config.status: creating src/java/mesos.pom
config.status: creating src/examples/python/test-executor
config.status: creating src/examples/python/test-framework
config.status: creating src/python/setup.py
config.status: creating src/python/cli/setup.py
config.status: creating src/python/interface/setup.py
config.status: creating src/python/native_common/ext_modules.py
config.status: creating src/python/executor/setup.py
config.status: creating src/python/native/setup.py
config.status: creating src/python/scheduler/setup.py
config.status: linking src/python/native_common/ext_modules.py to src/python/executor/ext_modules.py
config.status: linking src/python/native_common/ext_modules.py to src/python/scheduler/ext_modules.py
config.status: executing depfiles commands
config.status: executing libtool commands
configure: Build option summary:
    CXX:        g++
    CXXFLAGS:   -g1 -O0 -Wno-unused-local-typedefs -std=c++11
    CPPFLAGS:   -I/usr/include/subversion-1 -I/usr/include/apr-1 -I/usr/include/apr-1.0 
    LDFLAGS:    
    LIBS:       -lz -lsvn_delta-1 -lsvn_subr-1 -lsasl2 -lcurl -lapr-1 -lz  -lrt

make  dist-gzip am__post_remove_distdir='@:'
make[1]: Entering directory `/mesos'
if test -d "mesos-1.3.0"; then find "mesos-1.3.0" -type d ! -perm -200 -exec chmod u+w {}
';' && rm -rf "mesos-1.3.0" || { sleep 5 && rm -rf "mesos-1.3.0"; }; else
:; fi
test -d "mesos-1.3.0" || mkdir "mesos-1.3.0"
 (cd 3rdparty && make  top_distdir=../mesos-1.3.0 distdir=../mesos-1.3.0/3rdparty
\
     am__remove_distdir=: am__skip_length_check=: am__skip_mode_fix=: distdir)
make[2]: Entering directory `/mesos/3rdparty'
 (cd stout && make  top_distdir=../../mesos-1.3.0 distdir=../../mesos-1.3.0/3rdparty/stout
\
     am__remove_distdir=: am__skip_length_check=: am__skip_mode_fix=: distdir)
make[3]: Entering directory `/mesos/3rdparty/stout'
 (cd include && make  top_distdir=../../../mesos-1.3.0 distdir=../../../mesos-1.3.0/3rdparty/stout/include
\
     am__remove_distdir=: am__skip_length_check=: am__skip_mode_fix=: distdir)
make[4]: Entering directory `/mesos/3rdparty/stout/include'
make[4]: *** No rule to make target `stout/environment.hpp', needed by `distdir'.  Stop.
make[4]: Leaving directory `/mesos/3rdparty/stout/include'
make[3]: *** [distdir] Error 1
make[3]: Leaving directory `/mesos/3rdparty/stout'
make[2]: *** [distdir] Error 1
make[2]: Leaving directory `/mesos/3rdparty'
make[1]: *** [distdir] Error 1
make[1]: Leaving directory `/mesos'
make: *** [dist] Error 2
+ docker rmi mesos-1491948382-16541
Untagged: mesos-1491948382-16541:latest
Deleted: sha256:9e3d416feb0e9b26b91c09df2fc51eb04a91c31821df9af09b1c6d8f53b745b4
Deleted: sha256:9dff63912298a01571fd8cfa164f657fbc2aec506820656b89bc1730c66164c4
Deleted: sha256:3042411795d9693fb0d46bbe5f82a00ffbd1d0d9b6ec40b3214d86381c4216f9
Deleted: sha256:396f4c9bcc7b16c1cf428d826d84df8aa613bd9d7e156d1c07ab711ad849e91b
Deleted: sha256:f27acd38c2e882b3fd833ea23ec21074a45b4dc300d15db16229969840fe7aa4
Deleted: sha256:bdac66129bd951df09b1ec8136220536b59bb5a84d923115afdf5a9667e14445
Deleted: sha256:62149383cd790d06aef6c2b141592fda127991f257965c1e5f7ad1eecb09fbd8
Deleted: sha256:a926918a09c17c145bc1f2e908c50a9d995cb6b8823da900312ac1b62c9704fe
Deleted: sha256:c3f55306d28133196e195bf827e55b7b58f11905b8626cae2ff2b63aba402ce7
Deleted: sha256:5e11f6e795bb83edafa927513f6dcc3d0f724d1e615c9a81e577038abaea9b38
Deleted: sha256:db5a146ccef02e773f34ba35e6fa01ea92b451c6c1b7ef92636e11f3117cc497
Deleted: sha256:0efba7244575ef518e50a3bdfce77fc0f90c9bddbbee803655f66ec7ed3046f0
Deleted: sha256:9180b14d5ebf1417559538499bf6f1bd503a8080e046f61500432f26cfcb4eae
Deleted: sha256:98639b175468e3d6419e0b9088496d61a80781be2f55287b936aa5110c660621
Deleted: sha256:a378b4c795c8861eb813a2457442d5819db0fd39c5ccdc95bf47bb6553732bba
Deleted: sha256:60c6d00c49ab1514ad91fb4a95dc016bcdf361097fde3a69a07d3616fc8fcf86
Deleted: sha256:686c8839989c767c6a42ca4d7c057c4212ece1ec2263eeb2f6090ee88b1e329b
Deleted: sha256:99ff31e7de9a991173719462292bd6b82714a863fae2a94074f75dc9731cc659
Deleted: sha256:96f7175ec93e48d9b8e3863fcc5443f5ca732c4de02313c205e03f03f15776b9
Deleted: sha256:8b821ccd6ec2f16a1fe0991d979554ebcf07b1d2092a88ae06054b45e26dbe33
Deleted: sha256:ae22932286859c8908b87ae7ee2ff02f3e41024f0b392aeb35b095366cd308a5
Deleted: sha256:f0cd4c4db8640b064e47fd3e783261230f285d7566f8b6f110a8b496b560f36c
Deleted: sha256:e560f139bb16eb3bae85f11cefd73bc1c02defcc326a5e820c0e9e3bc83747a7
Deleted: sha256:f5d7c47d9af1281f5a2b2c92df7a2a684056db038b46da8171ae17d8ca8f6cc3
Build step 'Execute shell' marked build as failure

Mime
View raw message