mesos-builds mailing list archives

Site index · List index
Message view « Date » · « Thread »
Top « Date » · « Thread »
From Apache Jenkins Server <jenk...@builds.apache.org>
Subject Build failed in Jenkins: Mesos-Buildbot » autotools,clang,--verbose --enable-libevent --enable-ssl,GLOG_v=1 MESOS_VERBOSE=1,ubuntu:14.04,(docker||Hadoop)&&(!ubuntu-us1)&&(!ubuntu-eu2) #3420
Date Mon, 27 Mar 2017 11:22:24 GMT
See <https://builds.apache.org/job/Mesos-Buildbot/BUILDTOOL=autotools,COMPILER=clang,CONFIGURATION=--verbose%20--enable-libevent%20--enable-ssl,ENVIRONMENT=GLOG_v=1%20MESOS_VERBOSE=1,OS=ubuntu%3A14.04,label_exp=(docker%7C%7CHadoop)&&(!ubuntu-us1)&&(!ubuntu-eu2)/3420/display/redirect?page=changes>

Changes:

[alexr] Reordered messages in 'acls.proto' for readability.

------------------------------------------
[...truncated 2.59 MB...]
I0327 11:22:15.586902 26277 libevent_ssl_socket.cpp:1170] Socket error: error:140760FC:SSL
routines:SSL23_GET_CLIENT_HELLO:unknown protocol
I0327 11:22:15.675765 26260 ssl_tests.cpp:638] Testing server protocol 'LIBPROCESS_SSL_ENABLE_TLS_V1_1'
I0327 11:22:15.676285 26260 openssl.cpp:419] CA file path is unspecified! NOTE: Set CA file
path with LIBPROCESS_SSL_CA_FILE=<filepath>
I0327 11:22:15.676301 26260 openssl.cpp:424] CA directory path unspecified! NOTE: Set CA directory
path with LIBPROCESS_SSL_CA_DIR=<dirpath>
I0327 11:22:15.676308 26260 openssl.cpp:429] Will not verify peer certificate!
NOTE: Set LIBPROCESS_SSL_VERIFY_CERT=1 to enable peer certificate verification
I0327 11:22:15.676316 26260 openssl.cpp:435] Will only verify peer certificate if presented!
NOTE: Set LIBPROCESS_SSL_REQUIRE_CERT=1 to require peer certificate verification
I0327 11:22:15.688338 26277 libevent_ssl_socket.cpp:1170] Socket error: error:140760FC:SSL
routines:SSL23_GET_CLIENT_HELLO:unknown protocol
I0327 11:22:15.777153 26260 ssl_tests.cpp:638] Testing server protocol 'LIBPROCESS_SSL_ENABLE_TLS_V1_2'
I0327 11:22:15.777695 26260 openssl.cpp:419] CA file path is unspecified! NOTE: Set CA file
path with LIBPROCESS_SSL_CA_FILE=<filepath>
I0327 11:22:15.777710 26260 openssl.cpp:424] CA directory path unspecified! NOTE: Set CA directory
path with LIBPROCESS_SSL_CA_DIR=<dirpath>
I0327 11:22:15.777719 26260 openssl.cpp:429] Will not verify peer certificate!
NOTE: Set LIBPROCESS_SSL_VERIFY_CERT=1 to enable peer certificate verification
I0327 11:22:15.777729 26260 openssl.cpp:435] Will only verify peer certificate if presented!
NOTE: Set LIBPROCESS_SSL_REQUIRE_CERT=1 to require peer certificate verification
I0327 11:22:15.790810 26277 libevent_ssl_socket.cpp:1170] Socket error: error:140760FC:SSL
routines:SSL23_GET_CLIENT_HELLO:unknown protocol
[       OK ] SSLTest.NoValidDowngradeEachProtocol (505 ms)
[ RUN      ] SSLTest.PeerAddress
I0327 11:22:16.139019 26260 openssl.cpp:419] CA file path is unspecified! NOTE: Set CA file
path with LIBPROCESS_SSL_CA_FILE=<filepath>
I0327 11:22:16.139051 26260 openssl.cpp:424] CA directory path unspecified! NOTE: Set CA directory
path with LIBPROCESS_SSL_CA_DIR=<dirpath>
I0327 11:22:16.139057 26260 openssl.cpp:429] Will not verify peer certificate!
NOTE: Set LIBPROCESS_SSL_VERIFY_CERT=1 to enable peer certificate verification
I0327 11:22:16.139061 26260 openssl.cpp:435] Will only verify peer certificate if presented!
NOTE: Set LIBPROCESS_SSL_REQUIRE_CERT=1 to require peer certificate verification
[       OK ] SSLTest.PeerAddress (271 ms)
[ RUN      ] SSLTest.HTTPSGet
I0327 11:22:16.534124 26260 openssl.cpp:419] CA file path is unspecified! NOTE: Set CA file
path with LIBPROCESS_SSL_CA_FILE=<filepath>
I0327 11:22:16.534148 26260 openssl.cpp:424] CA directory path unspecified! NOTE: Set CA directory
path with LIBPROCESS_SSL_CA_DIR=<dirpath>
I0327 11:22:16.534154 26260 openssl.cpp:429] Will not verify peer certificate!
NOTE: Set LIBPROCESS_SSL_VERIFY_CERT=1 to enable peer certificate verification
I0327 11:22:16.534158 26260 openssl.cpp:435] Will only verify peer certificate if presented!
NOTE: Set LIBPROCESS_SSL_REQUIRE_CERT=1 to require peer certificate verification
[       OK ] SSLTest.HTTPSGet (393 ms)
[ RUN      ] SSLTest.HTTPSPost
I0327 11:22:17.408799 26260 openssl.cpp:419] CA file path is unspecified! NOTE: Set CA file
path with LIBPROCESS_SSL_CA_FILE=<filepath>
I0327 11:22:17.408818 26260 openssl.cpp:424] CA directory path unspecified! NOTE: Set CA directory
path with LIBPROCESS_SSL_CA_DIR=<dirpath>
I0327 11:22:17.408823 26260 openssl.cpp:429] Will not verify peer certificate!
NOTE: Set LIBPROCESS_SSL_VERIFY_CERT=1 to enable peer certificate verification
I0327 11:22:17.408828 26260 openssl.cpp:435] Will only verify peer certificate if presented!
NOTE: Set LIBPROCESS_SSL_REQUIRE_CERT=1 to require peer certificate verification
[       OK ] SSLTest.HTTPSPost (875 ms)
[ RUN      ] SSLTest.SilentSocket
I0327 11:22:17.913359 26260 openssl.cpp:419] CA file path is unspecified! NOTE: Set CA file
path with LIBPROCESS_SSL_CA_FILE=<filepath>
I0327 11:22:17.913378 26260 openssl.cpp:424] CA directory path unspecified! NOTE: Set CA directory
path with LIBPROCESS_SSL_CA_DIR=<dirpath>
I0327 11:22:17.913383 26260 openssl.cpp:429] Will not verify peer certificate!
NOTE: Set LIBPROCESS_SSL_VERIFY_CERT=1 to enable peer certificate verification
I0327 11:22:17.913386 26260 openssl.cpp:435] Will only verify peer certificate if presented!
NOTE: Set LIBPROCESS_SSL_REQUIRE_CERT=1 to require peer certificate verification
I0327 11:22:17.919919 26277 libevent_ssl_socket.cpp:1170] Socket error: error:00000000:lib(0):func(0):reason(0)
[       OK ] SSLTest.SilentSocket (503 ms)
[----------] 15 tests from SSLTest (9987 ms total)

[----------] 42 tests from Scheme/HTTPTest
[ RUN      ] Scheme/HTTPTest.Endpoints/0
I0327 11:22:18.336510 26260 openssl.cpp:419] CA file path is unspecified! NOTE: Set CA file
path with LIBPROCESS_SSL_CA_FILE=<filepath>
I0327 11:22:18.336526 26260 openssl.cpp:424] CA directory path unspecified! NOTE: Set CA directory
path with LIBPROCESS_SSL_CA_DIR=<dirpath>
I0327 11:22:18.336531 26260 openssl.cpp:429] Will not verify peer certificate!
NOTE: Set LIBPROCESS_SSL_VERIFY_CERT=1 to enable peer certificate verification
I0327 11:22:18.336534 26260 openssl.cpp:435] Will only verify peer certificate if presented!
NOTE: Set LIBPROCESS_SSL_REQUIRE_CERT=1 to require peer certificate verification
I0327 11:22:18.343031 26260 process.cpp:1247] libprocess is initialized on 172.17.0.2:42274
with 16 worker threads
I0327 11:22:18.350100 27026 process.cpp:3705] Handling HTTP event for process '(77)' with
path: '/(77)/body'
I0327 11:22:18.355924 27024 process.cpp:3705] Handling HTTP event for process '(77)' with
path: '/(77)/pipe'
I0327 11:22:18.362294 27028 process.cpp:3705] Handling HTTP event for process '(77)' with
path: '/(77)/body'
I0327 11:22:18.362889 27021 process.cpp:3762] Failed to process request for '/(77)/body':
failure
I0327 11:22:18.362916 27017 process.cpp:1457] Returning '500 Internal Server Error' for '/(77)/body'
(failure)
[       OK ] Scheme/HTTPTest.Endpoints/0 (444 ms)
[ RUN      ] Scheme/HTTPTest.Endpoints/1
I0327 11:22:18.366605 26260 process.cpp:1247] libprocess is initialized on 172.17.0.2:32923
with 16 worker threads
I0327 11:22:18.367461 27047 process.cpp:3705] Handling HTTP event for process '(78)' with
path: '/(78)/body'
I0327 11:22:18.369608 27048 process.cpp:3705] Handling HTTP event for process '(78)' with
path: '/(78)/pipe'
I0327 11:22:18.372323 27035 process.cpp:3705] Handling HTTP event for process '(78)' with
path: '/(78)/body'
I0327 11:22:18.372953 27048 process.cpp:3762] Failed to process request for '/(78)/body':
failure
I0327 11:22:18.373006 27047 process.cpp:1457] Returning '500 Internal Server Error' for '/(78)/body'
(failure)
I0327 11:22:18.373888 27050 process.cpp:828] Decode failure: Connection reset by peer
E0327 11:22:18.373931 27050 process.cpp:2427] Failed to shutdown socket with fd 9: Transport
endpoint is not connected
[       OK ] Scheme/HTTPTest.Endpoints/1 (10 ms)
[ RUN      ] Scheme/HTTPTest.EndpointsHelp/0
I0327 11:22:18.640934 26260 openssl.cpp:419] CA file path is unspecified! NOTE: Set CA file
path with LIBPROCESS_SSL_CA_FILE=<filepath>
I0327 11:22:18.640956 26260 openssl.cpp:424] CA directory path unspecified! NOTE: Set CA directory
path with LIBPROCESS_SSL_CA_DIR=<dirpath>
I0327 11:22:18.640961 26260 openssl.cpp:429] Will not verify peer certificate!
NOTE: Set LIBPROCESS_SSL_VERIFY_CERT=1 to enable peer certificate verification
I0327 11:22:18.640966 26260 openssl.cpp:435] Will only verify peer certificate if presented!
NOTE: Set LIBPROCESS_SSL_REQUIRE_CERT=1 to require peer certificate verification
I0327 11:22:18.649530 26260 process.cpp:1247] libprocess is initialized on 172.17.0.2:58090
with 16 worker threads
I0327 11:22:18.655169 27063 process.cpp:3705] Handling HTTP event for process 'help' with
path: '/help'
I0327 11:22:18.661010 27052 process.cpp:3705] Handling HTTP event for process 'help' with
path: '/help'
I0327 11:22:18.667116 27063 process.cpp:3705] Handling HTTP event for process 'help' with
path: '/help/(79)/body'
I0327 11:22:18.672845 27060 process.cpp:3705] Handling HTTP event for process 'help' with
path: '/help/(79)/a/b/c'
[       OK ] Scheme/HTTPTest.EndpointsHelp/0 (300 ms)
[ RUN      ] Scheme/HTTPTest.EndpointsHelp/1
I0327 11:22:18.676698 26260 process.cpp:1247] libprocess is initialized on 172.17.0.2:52696
with 16 worker threads
I0327 11:22:18.677772 27074 process.cpp:3705] Handling HTTP event for process 'help' with
path: '/help'
I0327 11:22:18.679575 27069 process.cpp:3705] Handling HTTP event for process 'help' with
path: '/help'
I0327 11:22:18.682095 27076 process.cpp:3705] Handling HTTP event for process 'help' with
path: '/help/(80)/body'
I0327 11:22:18.684077 27071 process.cpp:3705] Handling HTTP event for process 'help' with
path: '/help/(80)/a/b/c'
[       OK ] Scheme/HTTPTest.EndpointsHelp/1 (11 ms)
[ RUN      ] Scheme/HTTPTest.EndpointsHelpRemoval/0
I0327 11:22:19.172180 26260 openssl.cpp:419] CA file path is unspecified! NOTE: Set CA file
path with LIBPROCESS_SSL_CA_FILE=<filepath>
I0327 11:22:19.172204 26260 openssl.cpp:424] CA directory path unspecified! NOTE: Set CA directory
path with LIBPROCESS_SSL_CA_DIR=<dirpath>
I0327 11:22:19.172209 26260 openssl.cpp:429] Will not verify peer certificate!
NOTE: Set LIBPROCESS_SSL_VERIFY_CERT=1 to enable peer certificate verification
I0327 11:22:19.172214 26260 openssl.cpp:435] Will only verify peer certificate if presented!
NOTE: Set LIBPROCESS_SSL_REQUIRE_CERT=1 to require peer certificate verification
I0327 11:22:19.174667 26260 process.cpp:1247] libprocess is initialized on 172.17.0.2:49907
with 16 worker threads
I0327 11:22:19.180534 27098 process.cpp:3705] Handling HTTP event for process 'help' with
path: '/help/(81)/body'
I0327 11:22:19.186249 27096 process.cpp:3705] Handling HTTP event for process 'help' with
path: '/help/(81)/bogus'
[       OK ] Scheme/HTTPTest.EndpointsHelpRemoval/0 (502 ms)
[ RUN      ] Scheme/HTTPTest.EndpointsHelpRemoval/1
I0327 11:22:19.197619 26260 process.cpp:1247] libprocess is initialized on 172.17.0.2:60456
with 16 worker threads
I0327 11:22:19.199225 27113 process.cpp:3705] Handling HTTP event for process 'help' with
path: '/help/(82)/body'
I0327 11:22:19.201810 27104 process.cpp:3705] Handling HTTP event for process 'help' with
path: '/help/(82)/bogus'
[       OK ] Scheme/HTTPTest.EndpointsHelpRemoval/1 (16 ms)
[ RUN      ] Scheme/HTTPTest.PipeEOF/0
I0327 11:22:19.331423 26260 openssl.cpp:419] CA file path is unspecified! NOTE: Set CA file
path with LIBPROCESS_SSL_CA_FILE=<filepath>
I0327 11:22:19.331444 26260 openssl.cpp:424] CA directory path unspecified! NOTE: Set CA directory
path with LIBPROCESS_SSL_CA_DIR=<dirpath>
I0327 11:22:19.331450 26260 openssl.cpp:429] Will not verify peer certificate!
NOTE: Set LIBPROCESS_SSL_VERIFY_CERT=1 to enable peer certificate verification
I0327 11:22:19.331454 26260 openssl.cpp:435] Will only verify peer certificate if presented!
NOTE: Set LIBPROCESS_SSL_REQUIRE_CERT=1 to require peer certificate verification
I0327 11:22:19.333729 26260 process.cpp:1247] libprocess is initialized on 172.17.0.2:60161
with 16 worker threads
[       OK ] Scheme/HTTPTest.PipeEOF/0 (137 ms)
[ RUN      ] Scheme/HTTPTest.PipeEOF/1
I0327 11:22:19.345538 26260 process.cpp:1247] libprocess is initialized on 172.17.0.2:45791
with 16 worker threads
[       OK ] Scheme/HTTPTest.PipeEOF/1 (5 ms)
[ RUN      ] Scheme/HTTPTest.PipeFailure/0
I0327 11:22:19.753576 26260 openssl.cpp:419] CA file path is unspecified! NOTE: Set CA file
path with LIBPROCESS_SSL_CA_FILE=<filepath>
I0327 11:22:19.753595 26260 openssl.cpp:424] CA directory path unspecified! NOTE: Set CA directory
path with LIBPROCESS_SSL_CA_DIR=<dirpath>
I0327 11:22:19.753600 26260 openssl.cpp:429] Will not verify peer certificate!
NOTE: Set LIBPROCESS_SSL_VERIFY_CERT=1 to enable peer certificate verification
I0327 11:22:19.753604 26260 openssl.cpp:435] Will only verify peer certificate if presented!
NOTE: Set LIBPROCESS_SSL_REQUIRE_CERT=1 to require peer certificate verification
I0327 11:22:19.761456 26260 process.cpp:1247] libprocess is initialized on 172.17.0.2:33201
with 16 worker threads
[       OK ] Scheme/HTTPTest.PipeFailure/0 (417 ms)
[ RUN      ] Scheme/HTTPTest.PipeFailure/1
I0327 11:22:19.764272 26260 process.cpp:1247] libprocess is initialized on 172.17.0.2:48498
with 16 worker threads
[       OK ] Scheme/HTTPTest.PipeFailure/1 (2 ms)
[ RUN      ] Scheme/HTTPTest.PipeReaderCloses/0
I0327 11:22:19.996279 26260 openssl.cpp:419] CA file path is unspecified! NOTE: Set CA file
path with LIBPROCESS_SSL_CA_FILE=<filepath>
I0327 11:22:19.996305 26260 openssl.cpp:424] CA directory path unspecified! NOTE: Set CA directory
path with LIBPROCESS_SSL_CA_DIR=<dirpath>
I0327 11:22:19.996310 26260 openssl.cpp:429] Will not verify peer certificate!
NOTE: Set LIBPROCESS_SSL_VERIFY_CERT=1 to enable peer certificate verification
I0327 11:22:19.996315 26260 openssl.cpp:435] Will only verify peer certificate if presented!
NOTE: Set LIBPROCESS_SSL_REQUIRE_CERT=1 to require peer certificate verification
I0327 11:22:19.998661 26260 process.cpp:1247] libprocess is initialized on 172.17.0.2:42220
with 16 worker threads
[       OK ] Scheme/HTTPTest.PipeReaderCloses/0 (235 ms)
[ RUN      ] Scheme/HTTPTest.PipeReaderCloses/1
I0327 11:22:20.001116 26260 process.cpp:1247] libprocess is initialized on 172.17.0.2:52053
with 16 worker threads
[       OK ] Scheme/HTTPTest.PipeReaderCloses/1 (2 ms)
[ RUN      ] Scheme/HTTPTest.Encode/0
I0327 11:22:20.275102 26260 openssl.cpp:419] CA file path is unspecified! NOTE: Set CA file
path with LIBPROCESS_SSL_CA_FILE=<filepath>
I0327 11:22:20.275125 26260 openssl.cpp:424] CA directory path unspecified! NOTE: Set CA directory
path with LIBPROCESS_SSL_CA_DIR=<dirpath>
I0327 11:22:20.275130 26260 openssl.cpp:429] Will not verify peer certificate!
NOTE: Set LIBPROCESS_SSL_VERIFY_CERT=1 to enable peer certificate verification
I0327 11:22:20.275135 26260 openssl.cpp:435] Will only verify peer certificate if presented!
NOTE: Set LIBPROCESS_SSL_REQUIRE_CERT=1 to require peer certificate verification
I0327 11:22:20.282621 26260 process.cpp:1247] libprocess is initialized on 172.17.0.2:53754
with 16 worker threads
[       OK ] Scheme/HTTPTest.Encode/0 (282 ms)
[ RUN      ] Scheme/HTTPTest.Encode/1
I0327 11:22:20.287375 26260 process.cpp:1247] libprocess is initialized on 172.17.0.2:38458
with 16 worker threads
[       OK ] Scheme/HTTPTest.Encode/1 (3 ms)
[ RUN      ] Scheme/HTTPTest.PathParse/0
I0327 11:22:20.610015 26260 openssl.cpp:419] CA file path is unspecified! NOTE: Set CA file
path with LIBPROCESS_SSL_CA_FILE=<filepath>
I0327 11:22:20.610035 26260 openssl.cpp:424] CA directory path unspecified! NOTE: Set CA directory
path with LIBPROCESS_SSL_CA_DIR=<dirpath>
I0327 11:22:20.610040 26260 openssl.cpp:429] Will not verify peer certificate!
NOTE: Set LIBPROCESS_SSL_VERIFY_CERT=1 to enable peer certificate verification
I0327 11:22:20.610044 26260 openssl.cpp:435] Will only verify peer certificate if presented!
NOTE: Set LIBPROCESS_SSL_REQUIRE_CERT=1 to require peer certificate verification
I0327 11:22:20.612135 26260 process.cpp:1247] libprocess is initialized on 172.17.0.2:38319
with 16 worker threads
[       OK ] Scheme/HTTPTest.PathParse/0 (325 ms)
[ RUN      ] Scheme/HTTPTest.PathParse/1
I0327 11:22:20.614675 26260 process.cpp:1247] libprocess is initialized on 172.17.0.2:35994
with 16 worker threads
[       OK ] Scheme/HTTPTest.PathParse/1 (2 ms)
[ RUN      ] Scheme/HTTPTest.Get/0
I0327 11:22:21.159148 26260 openssl.cpp:419] CA file path is unspecified! NOTE: Set CA file
path with LIBPROCESS_SSL_CA_FILE=<filepath>
I0327 11:22:21.159173 26260 openssl.cpp:424] CA directory path unspecified! NOTE: Set CA directory
path with LIBPROCESS_SSL_CA_DIR=<dirpath>
I0327 11:22:21.159178 26260 openssl.cpp:429] Will not verify peer certificate!
NOTE: Set LIBPROCESS_SSL_VERIFY_CERT=1 to enable peer certificate verification
I0327 11:22:21.159181 26260 openssl.cpp:435] Will only verify peer certificate if presented!
NOTE: Set LIBPROCESS_SSL_REQUIRE_CERT=1 to require peer certificate verification
I0327 11:22:21.165428 26260 process.cpp:1247] libprocess is initialized on 172.17.0.2:48742
with 16 worker threads
I0327 11:22:21.170610 27301 process.cpp:3705] Handling HTTP event for process '(83)' with
path: '/(83)/get'
I0327 11:22:21.175640 27302 process.cpp:3705] Handling HTTP event for process '(83)' with
path: '/(83)/get'
[       OK ] Scheme/HTTPTest.Get/0 (563 ms)
[ RUN      ] Scheme/HTTPTest.Get/1
I0327 11:22:21.179292 26260 process.cpp:1247] libprocess is initialized on 172.17.0.2:44139
with 16 worker threads
I0327 11:22:21.180099 27314 process.cpp:3705] Handling HTTP event for process '(84)' with
path: '/(84)/get'
I0327 11:22:21.182060 27314 process.cpp:3705] Handling HTTP event for process '(84)' with
path: '/(84)/get'
[       OK ] Scheme/HTTPTest.Get/1 (6 ms)
[ RUN      ] Scheme/HTTPTest.NestedGet/0
I0327 11:22:21.394922 26260 openssl.cpp:419] CA file path is unspecified! NOTE: Set CA file
path with LIBPROCESS_SSL_CA_FILE=<filepath>
I0327 11:22:21.394943 26260 openssl.cpp:424] CA directory path unspecified! NOTE: Set CA directory
path with LIBPROCESS_SSL_CA_DIR=<dirpath>
I0327 11:22:21.394948 26260 openssl.cpp:429] Will not verify peer certificate!
NOTE: Set LIBPROCESS_SSL_VERIFY_CERT=1 to enable peer certificate verification
I0327 11:22:21.394953 26260 openssl.cpp:435] Will only verify peer certificate if presented!
NOTE: Set LIBPROCESS_SSL_REQUIRE_CERT=1 to require peer certificate verification
I0327 11:22:21.397176 26260 process.cpp:1247] libprocess is initialized on 172.17.0.2:41422
with 16 worker threads
I0327 11:22:21.402482 27325 process.cpp:3705] Handling HTTP event for process '(85)' with
path: '/(85)//a/b/c'
I0327 11:22:21.407578 27331 process.cpp:3705] Handling HTTP event for process '(85)' with
path: '/(85)//a/b'
[       OK ] Scheme/HTTPTest.NestedGet/0 (225 ms)
[ RUN      ] Scheme/HTTPTest.NestedGet/1
*** Aborted at 1490613741 (unix time) try "date -d @1490613741" if you are using GNU date
***
PC: @     0x2b141972064e (unknown)
*** SIGSEGV (@0x49ec548) received by PID 26260 (TID 0x2b1420dcd700) from PID 77514056; stack
trace: ***
I0327 11:22:21.411191 26260 process.cpp:1247] libprocess is initialized on 172.17.0.2:54958
with 16 worker threads
    @     0x2b1417072330 (unknown)
    @     0x2b141972064e (unknown)
    @     0x2b1418f20e30 (unknown)
    @     0x2b1418f2148c (unknown)
I0327 11:22:21.412509 27354 process.cpp:3705] Handling HTTP event for process '(86)' with
path: '/(86)//a/b/c'
    @           0x4438cf process::UPID::UPID()
I0327 11:22:21.414396 27349 process.cpp:3705] Handling HTTP event for process '(86)' with
path: '/(86)//a/b'
[       OK ] Scheme/HTTPTest.NestedGet/1 (6 ms)
[ RUN      ] Scheme/HTTPTest.StreamingGetComplete/0
    @           0xa034ae process::DispatchEvent::DispatchEvent()
    @           0x9ece33 process::internal::dispatch()
    @           0xa02f6d process::dispatch<>()
    @           0x9ebe57 process::ProcessBase::route()
    @           0xb122cd process::ProcessBase::route<>()
    @           0xb0fba0 process::Help::initialize()
    @           0xb0fc52 process::Help::initialize()
    @           0x9e6940 process::ProcessManager::resume()
    @           0x9f529c process::ProcessManager::init_threads()::$_2::operator()()
    @           0x9f51a5 _ZNSt12_Bind_simpleIFZN7process14ProcessManager12init_threadsEvE3$_2vEE9_M_invokeIJEEEvSt12_Index_tupleIJXspT_EEE
    @           0x9f5175 std::_Bind_simple<>::operator()()
    @           0x9f514c std::thread::_Impl<>::_M_run()
    @     0x2b1418f17a60 (unknown)
    @     0x2b141706a184 start_thread
    @     0x2b1419783bed (unknown)
make[7]: *** [check-local] Segmentation fault
make[7]: Leaving directory `/mesos/mesos-1.3.0/_build/3rdparty/libprocess'
make[6]: *** [check-am] Error 2
make[6]: Leaving directory `/mesos/mesos-1.3.0/_build/3rdparty/libprocess'
make[5]: *** [check-recursive] Error 1
make[5]: Leaving directory `/mesos/mesos-1.3.0/_build/3rdparty/libprocess'
make[4]: *** [check] Error 2
make[4]: Leaving directory `/mesos/mesos-1.3.0/_build/3rdparty/libprocess'
make[3]: *** [check-recursive] Error 1
make[3]: Leaving directory `/mesos/mesos-1.3.0/_build/3rdparty'
make[2]: *** [check] Error 2
make[2]: Leaving directory `/mesos/mesos-1.3.0/_build/3rdparty'
make[1]: *** [check-recursive] Error 1
make[1]: Leaving directory `/mesos/mesos-1.3.0/_build'
make: *** [distcheck] Error 1
+ docker rmi mesos-1490612251-14537
Untagged: mesos-1490612251-14537:latest
Deleted: sha256:906c6d351c44c8664bdda3f4d780cc79b846939edb5cb4598d408b02a111cdbe
Build step 'Execute shell' marked build as failure

Mime
View raw message